##TITLE=$$ Begin of the data block
##JCAMP-DX=5.00 $$ ACD/SpecManager v 10.08
##SPECTROMETER/DATA SYSTEM=Varian
##DATE=08 Jan 2013 15:01:46
##DATA TYPE=INFRARED SPECTRUM
##DATA CLASS=XYDATA
##ORIGIN=
##OWNER=
##NPOINTS=3735
##FIRSTX=399.26403809
##LASTX=4000.35498047
##MAXX=4000.35498047
##MINX=399.26403809
##MAXY=72.04825592
##MINY=35.36688614
##XFACTOR=1.0000000000
##YFACTOR=0.000000100000000
##FIRSTY=52.55180359
##DELTAX=0.96440572
##XUNITS=1/CM
##YUNITS=TRANSMITTANCE
##XYDATA=(X++(Y..Y))
399.3E25518036l682022K440414R170037m678231n078125K10839J07574K086029M755287
407.9E30849838Q04825m356422J395950j360741p375831J874847P989617j653634o30569
416.6E27537880L348923K380180J0168076q030892l857155j636467n001602l675079
424.3E21233864k740555J769485J696511K488899m03290N49279M376487j332435k223664
433E25414581O27632K090645j102943l871460k989616l842659n09987L872032M834976
441.7E24523201K879295J699028J98098k074089J9683J792374m222488m687004L652992
450.4E23781090N575142J157074m114075q77380N38826j718789L587685k667541m111443
459.1E21150589M041252J433487m804192l801116O72950m75158P46688L235207j53007
$$ y = [525518036, 521836014, 524276428, 533446465, 528768234, 523690109, 523900948, 524008522, 526094551, 530849838, 531654663, 527298241, 528694191, 527333450, 519957619, 521832466, 529822083, 528168449, 527537880, 530886803, 533266983, 543435059, 535404167, 531547012, 529910545, 524908943, 521233864, 518493309, 520262794, 521959305, 524448204, 524044914, 524594193, 528970680, 527638245, 525414581, 526042213, 528132858, 527029915, 523158455, 520168839, 516326180, 515816193, 519688225, 524523201, 527402496, 529101524, 529299622, 527225533, 527245216, 529037590, 524815102, 520128098, 523781090, 529356232, 530513306, 526399231, 525521851, 526060677, 524341888, 527929573, 525262032, 521150589, 525191841, 526625328, 521821136, 518020020, 518692970, 518217812, 518964500, 522199707, 522046700]
467.7E22046700j315003j593323k118454M283104J786957j0475044J495972O838264
475.5E20949173l42102l863182K48985M334030K266922j208992q18977M16069n75142
484.1E21406784L22533l893204p248993n82123J094780K476692J104660l111724j757203
492.8E09812202K835312K701187k573738j06239J172295K778282K993240j804428j941872
501.5E15866241p016410j652108N291748K228356q83484j493988M47426m64096j386605
510.2E10937080K59819J483765q42934j870384j13106l15094p96203j449585K99530
518.9E07592888j166535o38847R72138m67568J371689K03590p45239j750488q95653
527.5E04475975K228813P60651r09958j192055L80020p01141r93347J818771M15116
$$ y = [522046700, 520731697, 519138374, 517019920, 521303024, 523089981, 512614937, 514110909, 520949173, 520607071, 516743889, 516992874, 521326904, 523593826, 522384834, 521565857, 521981926, 521406784, 521729317, 517836113, 510587120, 510004997, 511099777, 513576469, 514681129, 511569405, 509812202, 512647514, 515348701, 512774963, 512668724, 513841019, 516619301, 519612541, 517808113, 515866241, 508849831, 507197723, 512489471, 514717827, 513834343, 512340355, 512787781, 512323685, 510937080, 511196899, 512680664, 511837730, 509967346, 509854240, 509539146, 508742943, 507293358, 507592888, 506426353, 505787506, 506759644, 506292076, 507663765, 507867355, 507122116, 505371628, 504475975, 506704788, 507465439, 506555481, 505363426, 505743446, 505042305, 504048958, 505867729, 506282845]
536.2E06282845m51165r77516j859016n41535P22199l06092j359405l433J416397q77838
545.9E02045441k439804J793708J789093J26725l61214k038956j590690k5826J848869
554.5E01147346o55212j127090l58506n52940J774101l738o93283o15959Q1939P79038
564.2D99775696j002922r97544r25712J255951R56917l93105m51202j26839J209068
572.9D99300308l19175j24321k80724o31332N90591j58501j052475l22837J074409
581.5D98075943l09372J42403l9330r8877K257500J270485l23448p98989K03514j63498
591.2E00216331o93702J111259L84293j374588n58701J037941q3465J025200N56831
599.9E01621399j503639K09961p22847n66788J96800p8125k01530k89879L07617p55615
$$ y = [506282845, 505831680, 504854164, 502995148, 502453613, 503175812, 502869720, 501510315, 501506882, 502923279, 502045441, 499605637, 501399345, 503188438, 503315163, 502953949, 500914993, 499324303, 499298477, 501147346, 500492134, 499365044, 499006538, 498453598, 500227699, 500223961, 499530678, 498914719, 498996658, 499775696, 498772774, 497775230, 496849518, 498105469, 499062386, 498669281, 498218079, 498091240, 499300308, 498981133, 498856812, 498576088, 497944756, 498535347, 498376846, 497324371, 497001534, 498075943, 497766571, 497908974, 497869644, 497770767, 500028267, 501298752, 500975304, 500176315, 500379829, 500216331, 499522629, 500633888, 501018181, 499643593, 499084892, 500122833, 500039368, 501064568, 501621399, 500117760, 500327721, 499604874, 499038086, 499234886, 499156761, 498955231, 498665352, 498972969, 498217354]
609.5D98217354j07651J89514m0703k58178n61142N82542m5738K71110M32129j10473
619.2D98568764m36440n78346O16264N16434O78253J142540J323052O45408N45388
627.8E03021317J248893J11733R09195J477699j29395k26707J322517K397995O31447
636.5E10764694k43950M68903O91948P80411J217460K324295J309548n70069p12852
645.2E16030388M19273J357460L48931m51432L92838J976166J984825N02052J10931
653.9E22671432o08177m11567M12635l24401l20435J21918O3972l63922j228943K53411
663.5E20265923N13534l54309J794319L643303O221809l021469l971214p86743J68457
672.2E24473610p27272K73247Q53538J798401O58608j43815J027871J056366J239509
$$ y = [498217354, 498109703, 498299217, 498258514, 498000336, 497439194, 498021736, 497975998, 498247108, 498679237, 498568764, 498132324, 497553978, 498170242, 498686676, 499364929, 500507469, 501830521, 502475929, 503021317, 504270210, 504381943, 505291138, 506768837, 506639442, 506412735, 507735252, 510133247, 510764694, 510520744, 510989647, 511681595, 512462006, 513679466, 516003761, 517313309, 516743240, 516030388, 516449661, 517807121, 518156052, 517704620, 518097458, 520073624, 522058449, 522560501, 522671432, 522063255, 521651688, 522064323, 521739922, 521419487, 521541405, 521605377, 521241455, 520012512, 520265923, 520779457, 520425148, 522219467, 525862770, 532084579, 529063110, 525091896, 524305153, 524473610, 523746338, 524019585, 524873123, 526671524, 527330132, 527186317, 528214188, 529270554, 530510063]
680.9E30510063O02417O64482N30281j42135L29590l40805K59780J555825J197662
689.6E35167160l96194r29680Q03833J352806J758728P31582j140441r07898q33588
698.2E35606308J025543J803284L40195K18200l0327M65699O57692j14251K95487O17752
707.9E40885582K77710M38003O75622O65321O73790k88582m0283Q18329J06849K47956
717.5E44460297P21054R28840L3379q89549M98237J346054Q58345K63596N25436J015969
727.2E49761658Q45070K13775J06430O57196M13094O84700M45862K21367J262168N32418
736.8E55143738j96572O75660J244545R41887M81491m41590m14657O97059K71530J285325
746.5E59688416K225151r3766j388588L98903J600266J53084J87378J341667O03332
$$ y = [530510063, 531112480, 531776962, 532307243, 532165108, 532494698, 532153893, 532413673, 533969498, 535167160, 534770966, 533841286, 534645119, 535997925, 537756653, 538488235, 537347794, 536439896, 535606308, 536631851, 538435135, 538775330, 538993530, 538963203, 539428902, 540086594, 539972343, 540267830, 540885582, 541163292, 541601295, 542276917, 542942238, 543616028, 543327446, 543287163, 544105492, 544212341, 544460297, 545181351, 546110191, 546143570, 545254021, 545752258, 547098312, 547956657, 548220253, 548745689, 549761658, 550606728, 550820503, 550926933, 551584129, 551997223, 552681923, 553127785, 553349152, 554611320, 555143738, 554947166, 555622826, 556867371, 557809258, 558290749, 557849159, 557434502, 558131561, 558403091, 559688416, 561913567, 561819801, 560431213, 560830116, 562430382, 562583466, 562770844, 564112511, 564715843]
755.1E64715843o96258L31535K566833J341172m39568L4714O52695N12657O3515l2883
764.8E69050255k61727O6643P02477O04477O1454J00899M27780L21427L77464j30653
774.4E71320496o51436J40762O49071L12538j33095p79381O51322P72171r44634O43044
784.1E71980858R35440M72717L85781J87225O50940q61016j22566O60630j02311J2436
793.7E74200134P26815Q28743j020661j54228N94940P36313M59862j484947j610833
802.4E73276138j393470k48070o18553q62465p29065j740914j006889n35202M4403
811.1E66185913l88641j85967o68449j763382l91617m65279k60887l31726O19431J502952
820.7E63852348o56929j18484J687279J965332J304245O44607O73676J986961L174706
$$ y = [564715843, 564019585, 564351120, 566917953, 568259125, 567819557, 567854271, 568506966, 569019623, 569083138, 569050255, 568788528, 568855171, 569557648, 570162125, 570223579, 570324478, 570752258, 571073685, 571451149, 571320496, 570669060, 570809822, 571458893, 571771431, 571638336, 570858955, 571510277, 572282448, 571337814, 571980858, 572916298, 573389015, 573774796, 573962021, 574612961, 573751945, 573629379, 574290009, 574187698, 574200134, 574926949, 575755692, 574735031, 574580803, 575175743, 575912056, 576371918, 574886971, 573276138, 571882668, 571634598, 571016045, 570153580, 569424515, 567683601, 566676712, 566141510, 566185913, 565797272, 565611305, 564942856, 563179474, 562787857, 562322578, 562061691, 561729965, 562349396, 563852348, 563195419, 563076935, 564764214, 566729546, 568033791, 568678398, 569352074, 571339035, 574513741]
829.4E74513741K197227J508141J514206J570472R62448J892701K238769O85806J029930
838.1E88113441J593323K213440O86112j65520O33049J032448J928138J146431J111451
846.8E98292313M87632N28946O30226M34571J651573N95169L72200Q9951L14445Q86078
856.4F04283104Q69636J523514J735192K392196L89977m48838l20281l00484R82246
865.1F11106262M91219N83000n62630j268234p75795p33719l21770l52020l68767p29637
874.7F07067909q47740r45167j12839l94402r04922j17226l92799J07078j31416l81050
884.4F02947426l82m16145j344643r74044J11541j222191r95750L02811K55890o52428
894E98012085o43730K0981m96598K53640k98958j130104j221924p12166Q19664K14958
$$ y = [574513741, 576710968, 578219109, 579733315, 581303787, 582266235, 584158936, 586397705, 587083511, 588113441, 589706764, 591920204, 592606316, 592440796, 593073845, 594106293, 596034431, 597180862, 598292313, 598779945, 599308891, 599939117, 600373688, 602025261, 602620430, 602992630, 603082581, 603397026, 604283104, 605152740, 606676254, 608411446, 610803642, 611193619, 610744781, 610424500, 610124016, 611106262, 611597481, 612180481, 611617851, 610349617, 609573822, 608840103, 608518333, 608166313, 607797546, 607067909, 606220169, 605275002, 605162163, 604767761, 603862839, 603745613, 603352814, 603459892, 603328476, 602947426, 602947044, 602530899, 601186256, 600212212, 600323753, 599101562, 598105812, 598408623, 598664513, 598012085, 597368355, 597389336, 596892738, 597146378, 596847420, 595717316, 594495392, 593783226, 594602890, 594817848]
903.7E94817848L44238J279526J653633J307145J149864J235618M2534m883j68266
912.3F01657257j61438j48392o33888q07342q03185n55839p80526o15539j371079j371879
922E94408150j296616k428932j991272j428757j566314j539917o92406o26793j449204
930.7E81387939k232170j649856k61154j121254j346360q65631m41780o8779m24347
939.3E72976608n16281j308594j087188n64537r63059j615562j773835p18956k80570
948E64148026k33231m75464o86302m40903k66075k81601o32973q53042j083946j025391
957.7E58169098j570015k149315j528969o81228j130562j669769l08800n95055j412353
966.3E47123032l48931o03256j337204j304321j506310k088203k244950j711311j361465
$$ y = [594817848, 595162086, 596441612, 598095245, 599402390, 600552254, 601787872, 601830406, 601825523, 601657257, 601495819, 601347427, 600713539, 599906197, 599103012, 598547173, 597766647, 597151108, 595780029, 594408150, 593111534, 590682602, 588691330, 587262573, 585696259, 584156342, 583463936, 582837143, 581387939, 579155769, 577505913, 577244759, 576123505, 574777145, 573911514, 573469734, 573400955, 572976608, 572460327, 571151733, 570064545, 569500008, 568536949, 566921387, 565147552, 564428596, 564148026, 563914795, 563439331, 562753029, 562312126, 562046051, 561764450, 561131477, 560278435, 559194489, 558169098, 556599083, 554449768, 552920799, 552239571, 551109009, 549439240, 549130440, 548535385, 547123032, 546774101, 546170845, 544833641, 543529320, 542023010, 539934807, 537689857, 535978546, 534617081]
975E34617081j211357j142083j236724j197129j978302l074035k917824k609673l032951
983.7E16217003l447151k801972k519531k309227j401253j571274k416305k996979
991.4D96753311k002373j179046j411553k043342k782326k157059k098121k116776
999.1D80962715j405716j363678j909294j223526o87942j873894j749039j346283j058540
1007.8D68344803j294518j924667j610031j527290j096154j100502r85183p50390r56344
1016.5D57099724j623497k007828j414185j544570j838456k155037j513595q52204
1024.2D44150352n07316n32951j330910n63774n24330j324769j436386n79872o56204
1032.9D36693840n02090M84504j89819N86433Q78678J353302J662559J254845J448059
$$ y = [534617081, 533405724, 532263641, 531026917, 529829788, 527851486, 524777451, 521859627, 519249954, 516217003, 512769852, 509967880, 507448349, 505139122, 503737869, 502166595, 499750290, 496753311, 494750938, 493571892, 492160339, 490116997, 487334671, 485177612, 483079491, 480962715, 479556999, 478193321, 476284027, 475060501, 474372559, 472498665, 470749626, 469403343, 468344803, 467050285, 465125618, 463515587, 461988297, 460892143, 459791641, 458806458, 458056068, 457099724, 455476227, 453468399, 452054214, 450509644, 448671188, 446516151, 445002556, 444150352, 443643036, 443110085, 441779175, 441215401, 440691071, 439366302, 437929916, 437350044, 436693840, 436191750, 436676254, 436486435, 437072868, 437951546, 439304848, 440967407, 442222252, 443670311]
1041.6D43670311N02892N44815M63485P46537K2087n22499L82385M40941K25143j637382
1051.2D44838715q71735l70255j306228l16048j06010m57421j123848k57682m33922
1059.9D39595566L91083J429557R52950J816292O94580R58557J672172J305008R75113
1068.6D49790878J088715J020737l02010K04468K29492M91791J80244j15242N74646
1077.2D53163719j48125L90358Q87871J054840J40686N9891J75057m25148P96089L16658
1086.9D56411896L32336R63860J047439Q56743O43997Q56972J280861J983261L36876
1095.6D64714241l1166R5711J38550O78825N1880P64198R45435J373863P23686p1564
1105.2D69383659O09551J372566J517525n61829N0812Q21800M6387J0300O59713J675492
$$ y = [443670311, 444173203, 444718018, 445181503, 445928040, 445950127, 445427628, 445810013, 446250954, 446476097, 444838715, 443966980, 443596725, 442290497, 441974449, 441868439, 441411018, 440287170, 440029488, 439595566, 439986649, 441416206, 442369156, 444185448, 444880028, 445838585, 447510757, 448815765, 449790878, 450879593, 451900330, 451598320, 451802788, 452032280, 452524071, 452704315, 452589073, 453163719, 453015594, 453405952, 454293823, 455348663, 455489349, 455549240, 455724297, 455299149, 456095238, 456411896, 456744232, 457708092, 458755531, 459612274, 460256271, 461113243, 462394104, 464377365, 464714241, 464683075, 464778786, 464917336, 465596161, 465648041, 466412239, 467357674, 468731537, 469455223, 469383659, 469993210, 471365776, 472883301, 472321472, 472372284, 473194084, 473240471, 473250771, 473910484, 475585976]
1114.9D75585976J90849K9602M38690M93622R35478N92652J60408p40509N53016R06067
1124.5D79145851k56958J13869O17180M85611O59637K187882J578903N10597J258888
1133.2D86301460J678963J956444K080002J243705L61290J159668J671105O77719j80359
1141.9D96949997M08935J252175P44743M25644Q10204J066627L01361R5787M82102
1150.5E02537575k06299n31845j51520P45125K16141q35724m87099n20668k94571j90964
1160.2E00280151j86691M654K22664K46048J05057R25026J027603J155739K126541
1168.9E05906792K412529J746483J501503K381439K624092K029838J733399J941452
1176.6E22277527K232513J595879J347389K042275J637840J201935J833381K290802
$$ y = [475585976, 475776825, 475806427, 476245117, 476738739, 477674217, 478266869, 478427277, 477686768, 478239784, 479145851, 478888893, 479002762, 479619942, 480105553, 480765190, 482953072, 484531975, 485042572, 486301460, 487980423, 489936867, 492016869, 493260574, 493621864, 494781532, 496452637, 497130356, 496949997, 497358932, 498611107, 499355850, 499781494, 500591698, 501658325, 501959686, 502055473, 502537575, 502331276, 501799431, 501647911, 502393036, 502609177, 501773453, 501286354, 500765686, 500471115, 500280151, 500093460, 500098114, 500320778, 500566826, 500671883, 501596909, 502624512, 503780251, 505906792, 508319321, 510065804, 511567307, 513948746, 516572838, 518602676, 520336075, 522277527, 524510040, 526105919, 527453308, 529495583, 531133423, 532335358, 534168739, 536459541]
1184.3E36459541J530762J256981J492538Q16307O02265j717p553N11093K53907J15470
1193.9E43029594j16653m20685o89545q735K51045m95377p31964q51287q77228j209488
1203.6E37879677j597595j193085r29070o70509O2408q0184j42479j66665n21049l23677
1213.2E32317772n62248k76146k24991j089516p40585l4905m09088n32150L68042J68915
1222.9E28985100m80194l21694n11055p38487o68297m95643m76914k63710o38618j132050
1232.5E23258438l54652n7793k13127Q7433N5961j8577J31912j30463k58712K7237
1242.2E22527657o4393j78298j78147j96342k70882l86047k69928l38784n67054j58577
1251.8E19919205L35350k76795m53415J95694K88544l7270k63900J36108R7313l28522
$$ y = [536459541, 537990303, 539247284, 540739822, 541556129, 542158394, 542156677, 542149124, 542660217, 542914124, 543029594, 542912941, 542492256, 541802711, 541793976, 542045021, 541549644, 540817680, 539966393, 539089165, 537879677, 536282082, 535088997, 534159927, 533489418, 533551826, 533471642, 533329163, 533162498, 532641449, 532317772, 531755524, 531479378, 531254387, 530164871, 529424286, 529389381, 528980293, 528448143, 528816185, 528985100, 528504906, 528183212, 527672157, 526933670, 526265373, 525769730, 525292816, 525029106, 524390488, 523258438, 522903786, 522845993, 522632866, 522720299, 522776260, 522757683, 522889595, 522759132, 522500420, 522527657, 522463264, 522284966, 522106819, 521910477, 521639595, 521253548, 520983620, 520644836, 520077782, 519919205, 520254555, 519977760, 519524345, 519720039, 520008583, 519971313, 519707413, 519843521, 519940834, 519612312]
1261.4E19612312j8921K16980M36974N12924K84729M42848Q77419J065369O48040K13662
1271.1E24292336K59552O43005Q75015O43959N44052P68280Q32634M72641O01998P35588
1280.7E30669060N70869Q59642P24259R79042J262626Q55523M15000J20278L82500
1289.4E36838799P20062Q40835K81144L65600O18820M28276N51720J90010L13797J43471
1299E41292534m6959K9106j59531k58483n42069P2289Q9378m50249r8190M1237j99738
1309.7E39769325k76756l59345p22923o56814n43251m90075k42767L0632K28539K55928
1319.3E36992493N13420O92711M49028J04942M88167N10711m5776n2261o9275K02331
1328.9E39786491j8463m50973l26271J1749r8381m38080K6703k80914k57492L93753
$$ y = [519612312, 519593391, 519810371, 520247345, 520760269, 521044998, 521487846, 522365265, 523430634, 524078674, 524292336, 524551888, 525194893, 526069908, 526713867, 527257919, 528026199, 528858833, 529331474, 529933472, 530669060, 531239929, 532099571, 532823830, 533802872, 535065498, 535921021, 536336021, 536456299, 536838799, 537558861, 538399696, 538680840, 539046440, 539665260, 540093536, 540645256, 540835266, 541149063, 541292534, 541245575, 541274681, 541115150, 540856667, 540314598, 540386887, 540476265, 540026016, 539927826, 539969063, 539769325, 539492569, 539133224, 538410301, 537753487, 537210236, 536720161, 536477394, 536508026, 536736565, 536992493, 537505913, 538198624, 538647652, 538752594, 539240761, 539751472, 539705696, 539653435, 539584160, 539786491, 539768028, 539317055, 538990784, 539002533, 538904152, 538466072, 538492775, 538211861, 537954369, 538348122]
1338.6E38348122K79121k47002m56047N57518Q30651M98504K90795K77786L82767J75171
1348.2E40937386N55343m5280l12386j11885j89972J77040l33137p15676m81834P4577
1357.9E39554176J91994K18277L0174l09524J02920j279907m75235J47018o37741m76532
1367.5E37065620m99229m29306K8954M9972l2425O04477N8441m99992N43327P9613
1377.2E36969452l94631o15386o05851p02438o83365q91113q03833j37673r3956N14107
1386.8E32555313q86345j366348m04739j044960j291810j451301r04083j713715k363358
1395.5E21128654q79249l73612J17989j879272j956673r09538j519814j554756j134415
1404.2E11039314k190208k592240j030998q08792p24029n50766p23191p48634j172752
$$ y = [538348122, 538627243, 538380241, 537924194, 538481712, 539312363, 539810867, 540101662, 540379448, 540762215, 540937386, 541492729, 541447449, 541135063, 541023178, 540833206, 541010246, 540677109, 539961433, 539479599, 539554176, 539746170, 539964447, 539994621, 539685097, 539788017, 538508110, 538032875, 538179893, 537542152, 537065620, 536566391, 536137085, 536166039, 536216011, 536183586, 536788063, 536846504, 536346512, 536889839, 536969452, 536574821, 535959435, 535353584, 534651146, 533967781, 533076668, 532272835, 532135162, 532041206, 532555313, 531668968, 530302620, 529897881, 528852921, 527561111, 526109810, 525205727, 523492012, 521128654, 520249405, 519875793, 519993782, 518114510, 516157837, 515248299, 513728485, 512173729, 511039314, 508849106, 506256866, 505225868, 504417076, 503693047, 503142281, 502419090, 501670456, 500497704]
1412.8E00497704p29523o51703q35724m37736l88909M07524k118873j413079N87159
1421.5D94916840L43666J202392l99399l13224J186103L55797N71823O01120n34935
1430.2D97930183n23758Q62847J243133R77440J891594K541352M26445r61457J661339
1438.9E06049118J546631J172714Q86002J85852J161728P42836Q31909J982994K029533
1447.6E16589317J32218M72641J538048R83276J156235M88548J447487K622719J825370
1456.2E27255859N37644j455269J300850N07698J998329J976776J341095K731247k02026
1464.9E35992203k32697J704941J620560J638221J731797L436584L777924J628341
1472.6E51297874o31446J340828L267898J566696O52199J890373J327172R43374N37987
$$ y = [500497704, 499768181, 499116478, 498280754, 497843018, 497454109, 497861633, 495742760, 494329681, 494916840, 495260506, 496462898, 496063499, 495750275, 496936378, 497292175, 497863998, 498465118, 497930183, 497406425, 498269272, 499512405, 500489845, 502381439, 504922791, 505349236, 504387779, 506049118, 507595749, 508768463, 509654465, 509840317, 511002045, 511744881, 512576790, 514559784, 516589317, 516721535, 517194176, 518732224, 519715500, 520871735, 521360283, 522807770, 525430489, 527255859, 527793503, 526338234, 527639084, 528146782, 530145111, 532121887, 533462982, 536194229, 535992203, 535759506, 537464447, 539085007, 540723228, 542455025, 545891609, 549669533, 551297874, 550666428, 552007256, 555275154, 556841850, 557494049, 559384422, 560711594, 561654968, 562192955]
1481.3E62192955O98471J504936J203385M80270J376267O15692r86901J566658J29586
1490E68781319k239495o10084K64435m4098O5269J182213m361458j18828M27971k957649
1499.6E60389595L7193j06048p18041n05562J502648J940422k222366m828797j357231
1508.3E54131813J165237j070442Q10204l58277j983108Q81157M11529K633n39628
1517E53451118m032402L74337K992897N7258l637199k53563L16620J711502j688690
1525.7E49291878m77715Q44841q61282o13442j7280N75218M65889K13013l887749K49557
1535.3E45782928R24225Q23899L177185Q99124n593987Q545Q49724k583198N08689
1544E44797134R63707k992477J008568M36821J367988P72744k955132K61574J119613
$$ y = [562192955, 562891426, 564396362, 565599747, 566080017, 567456284, 568071976, 567085075, 568651733, 568781319, 566541824, 565931740, 566196175, 566152077, 566217346, 567399559, 563038101, 562919273, 563347244, 560389595, 560426788, 560320740, 559602699, 559097137, 560599785, 562540207, 560317841, 555489044, 554131813, 555297050, 554226608, 555036812, 554678535, 552695427, 553576584, 553988113, 553990746, 553451118, 549418716, 549793053, 552785950, 552843208, 549206009, 548952446, 549269066, 550980568, 549291878, 548814163, 549659004, 548797722, 548184280, 548167000, 548742218, 549208107, 549421120, 545533371, 545782928, 546707153, 547531052, 550708237, 551607361, 546013374, 546021919, 546871643, 544288445, 544797134, 545760841, 542768364, 543776932, 544213753, 545581741, 546354485, 543399353, 543660927, 544780540]
1552.7E44780540J905098k402916r54551J899261L197060L625984j2323570k742653
1560.4E36984253L35464J308022L6049J46255j887550k357216p934l16277J046486
1569.1E35287552o930733k429314q01162j995697j099663r73244Q59909r151878j219788
1577.7E11545982j378898k656708k384949l302307j638222l668136k151261k952995
1585.5D91412506k854080k506104k984886j145134l255844j948929l468475k205467
1593.2D71043587j983986k869530j464691l452454j478576k538681j409378k299691
1600.9D53546600j940612n82238k662430r47265k332268n05943j970825j204071p11594
1609.6D40689354k754326j15623j985512k96135r78699J103096K030220p301941O44226
$$ y = [544780540, 546685638, 544282722, 543328171, 545227432, 548424492, 552050476, 539726906, 536984253, 537319717, 538627739, 538663788, 538810043, 536922493, 534565277, 534557343, 534241066, 535287552, 528356819, 525927505, 525126343, 523130646, 522030983, 521057739, 521917648, 512765770, 511545982, 510167084, 507510376, 505125427, 501823120, 500184898, 496516762, 494365501, 491412506, 488558426, 486052322, 483067436, 481922302, 478666458, 476717529, 473249054, 471043587, 469059601, 466190071, 464725380, 461272926, 459794350, 457255669, 455846291, 453546600, 451605988, 451023750, 448361320, 447414055, 445081787, 444575844, 442605019, 441400948, 440689354, 437935028, 437819405, 435833893, 435537758, 434559059, 435662155, 437692375, 430390434, 431034660]
1618.2D31034660j11122N00107r18045J301689O03676l759728L51410j72081J873322
1626.9D30703888q61626l38669N16015L23944P57408K72369K440796J460266j768150
1635.6D33506241j853943K296638M60930N88303J709061J13754J692657J16730J971932
1644.3D40602303K895240R60884J738968j854515Q95691J025543L594094M751320Q182716
1653D62792244r238586l232003K945175J433487J940651J076660J404076J724205J972656
1661.6D62818565J987458j363144K340011J809616J690445K179909K852707J496811
1669.4D75812378M6692L754234O55785K426529L697242K170296q90617J779213L111458
1678D92563210K355423L997573J217156K672996N572968L370628j893043L84483M678078
$$ y = [431034660, 430923538, 431423645, 430505600, 431807289, 432410965, 428651237, 429002647, 428830566, 430703888, 429842262, 429503593, 430019608, 430343552, 431100960, 431373329, 433814125, 435274391, 433506241, 431652298, 433948936, 434409866, 434998169, 436707230, 436820984, 438513641, 438630371, 440602303, 443497543, 444458427, 446197395, 444342880, 445238571, 446264114, 449858208, 454609528, 462792244, 453553658, 450321655, 453266830, 454700317, 456640968, 457717628, 459121704, 460845909, 462818565, 464806023, 463442879, 465782890, 467592506, 469282951, 471462860, 474315567, 475812378, 475859070, 479613304, 480269089, 482695618, 486392860, 488563156, 487672539, 489451752, 492563210, 494918633, 498916206, 500133362, 502806358, 508379326, 511749954, 509856911, 510241394, 514919472]
1686.7E14919472L459778K314567K711754K129097L096313K916222L091431M524078
1694.4E39162712O164169j039009K262879N037842O375999P718468r205475M507332
1702.1E60984917M658699L594932J865349J945343J586037J776581L847046K563819
1709.9E82822723J391945K330475K738533L155708J030236J18141L446846L806953
1717.6F00841560m927330J046296L346176J824379J594352J418801N11131R86824J369400
1726.3F08011589J077232J241723K661018M89197j231919L369294M996337L07618p492676
1734.9F13429413K847061L473473J522255K924232P22885k230453L282814L312225
1742.7F29283905M71191L49465L130646K658920K137337K152099J5946L680801J057510
$$ y = [514919472, 518379250, 520693817, 523405571, 525534668, 528630981, 531547203, 534638634, 539162712, 545326881, 544287872, 546550751, 551588593, 557964592, 565683060, 556477585, 560984917, 565643616, 569238548, 571103897, 573049240, 574635277, 576411858, 580258904, 582822723, 584214668, 586545143, 589283676, 592439384, 593469620, 593587761, 597034607, 600841560, 595914230, 596960526, 600306702, 602131081, 603725433, 605144234, 605655365, 606642189, 608011589, 609088821, 610330544, 612991562, 613480759, 612248840, 615618134, 620614471, 620922089, 613429413, 616276474, 619749947, 621272202, 624196434, 624919319, 622688866, 625971680, 629283905, 629755096, 630104561, 633235207, 635894127, 638031464, 640183563, 640199509, 643880310, 644937820]
1751.3F44937820j113662L971939K560882K287979L416291K4948M64096K012482K221527
1760F60784302M434814k78168j916122K745590J717377J448135J964341K050857k385635
1768.7F70565491J123428M499664J728669p19681l312302K770538K121048j383972
1776.4F77392883J703720J096573J590576J051712j312561K16065J346512J455307
1784.1F84540787l98941M9820J786575J177368L42484J696777J635590J345520k241669
1792.8F89934311k410278L013534R15604j020203Q98743K293777P88269j632843K152558
1801.5F94933472J39541o20269J075744M90265P51190K27814R3155J065750J759262
1810.2F99915924j243133o44761P88269L95356J282730P3776N67017m2191q8959O55442
$$ y = [644937820, 643824158, 647796097, 650356979, 652644958, 656061249, 656086197, 656550293, 658562775, 660784302, 665219116, 664940948, 663024826, 665770416, 667487793, 668935928, 670900269, 672951126, 670565491, 671688919, 676188583, 677917252, 677197571, 673885269, 676655807, 678776855, 677392883, 679096603, 680193176, 681783752, 682835464, 681522903, 681738968, 683085480, 684540787, 684141846, 684191666, 685978241, 687155609, 687498093, 689194870, 690830460, 692175980, 689934311, 687524033, 690537567, 691453171, 690432968, 691331711, 693625488, 694413757, 692780914, 694933472, 695073013, 694452744, 695528488, 696018753, 696769943, 696997757, 697090912, 698156662, 699915924, 698672791, 698028030, 698816299, 699211655, 700494385, 700568161, 701135178, 701092987, 701004028, 701659470]
1819.8G01659470K9983J050415r0256R54285J879578k221833r87091J953736K657242
1828.5G06885529J424713l930817q85239K121048O6529j06201N07583Q95538O04859
1837.2G07583542r38263P97424L78952N72205N46951J567154K193451o110687k4643
1845.8G06566086K029571L92075j18256J18790R74121K89230M97437j52054r4528j95923
1855.5G10306549j36948L51258k60086M40216K07443P37228J43814m7912K42920M9972
1865.1G12034454J429367L84598N26810q29926k280731J64719P04193O71921k81983
1873.8G12523422L29819K66113K30637N21545K70767J9608o97784P7362j48850L51944
1883.4G13744583K38037m51813K29111J14212J225815L59726k011032k03171R91516
$$ y = [701659470, 701689453, 702739868, 702649612, 703603897, 705483475, 703261642, 702274551, 704228287, 706885529, 708310242, 704379425, 703494186, 705615234, 705681763, 705575562, 706083145, 706978683, 707583542, 706645279, 707442703, 707821655, 708393860, 708940811, 710507965, 712701416, 706590729, 706566086, 708595657, 708987732, 708869476, 708988266, 709962387, 710251617, 710749054, 710597000, 710502472, 710306549, 710169601, 710520859, 710260773, 710700989, 710908432, 711645660, 711789474, 711741562, 711984482, 712034454, 713463821, 713848419, 714375229, 713545303, 711264572, 711429291, 712133484, 712805405, 712523422, 712853241, 713119354, 713349991, 713871536, 714142303, 714161911, 713464127, 713541489, 713392639, 713744583, 713982620, 713530807, 713759918, 713874130, 715099945, 715459671, 713448639, 713245468, 714236984]
1892.1G14236984K04621L28674J54343j094208L06320J86081O5689L63541L32031M68597
1901.8G15552673m32434j39618k79693O0119N01099L51410K14844j83030n17196n28031
1911.4G14600143O46668j00632K0218n4474K09122K151947j576691j644287J025009
1920.1G15277023M06189R25522k73056j570053r8877N06897j67007J74636P2022P4692
1929.7G15327988K92282j87149J87759l21350j42670j94854k28424P2860k63824L6697
1939.4G14579315r7961J303558O09741k198944k03247P24182j9912m98581j27869k25906
1949G13844376j48240J98746K34604j86539l01437M19998j92489l08381o5765J1978
1958.7G13506851P6828j82342j79444l19137L21045J02768J66015N37720l14407o28739
$$ y = [714236984, 714441605, 714770279, 714924622, 713830414, 714136734, 714322815, 714388504, 714752045, 715084076, 715552673, 715120239, 714980621, 714700928, 714761047, 715262146, 715613556, 715828400, 715645370, 715128174, 714600143, 715246811, 715146179, 715166397, 715111923, 715321045, 717472992, 715896301, 714252014, 715277023, 715683212, 716608734, 716335678, 714765625, 714666748, 715173645, 715006638, 715181274, 715253296, 715327988, 715620270, 715433121, 715620880, 715299530, 715156860, 714962006, 714733582, 714806442, 714542618, 714579315, 714481354, 715784912, 716394653, 714195709, 713992462, 714716644, 714696732, 714198151, 714070282, 713844376, 713696136, 713894882, 714129486, 713942947, 713641510, 714061508, 713869019, 713560638, 713494873, 713506851, 713583679, 713401337, 713221893, 712902756, 713223801, 713326569, 713492584, 714030304, 713715897, 713087158]
1968.3G13087158k83203N1270r8267L21045k78931m81796K78015k26364j43814l2501
1978G12192612J50146j00555K2888m6845m09393L22876o8741J9913l510j68304m99725
1988.6G11411362p07703P56760O64596o83975p79343L11432R1019l62396O4697j33591
1998.2G10632858J22681l7689o1569m46320n86777k7771P7133J11084k71682J87988
2007.8G09699936p0496j91116m4327m25262r003l97339k69928M38309L82080n80215
2017.5G08532639l66745k0524m52041J54877j86081k37809j54037J3504j95236p90024
2027.1G06298523J56403J3961M6006o4393j79977J99127j50680j94016l73001j20010
2036.8G05631943m98963m54788k06680o4392L67889m9743J97372o6452J02005k99759
$$ y = [713087158, 712803955, 712855225, 712756958, 713078003, 712799072, 712317276, 712595291, 712368927, 712225113, 712192612, 712342758, 712242203, 712265091, 712218246, 711808853, 712131729, 712062988, 712082901, 712079391, 711911087, 711411362, 710703659, 711460419, 712125015, 711441040, 710661697, 710973129, 711064148, 710701752, 710766449, 710632858, 710755539, 710717850, 710656281, 710209961, 709623184, 709595413, 709672546, 709783630, 709511948, 709699936, 709629440, 709438324, 709393997, 708968735, 708959732, 708562393, 708292465, 708730774, 709112854, 708532639, 708165894, 708145370, 707693329, 707848206, 707662125, 707424316, 707270279, 707283783, 707088547, 706298523, 706454926, 706468887, 706514893, 706450500, 706270523, 706469650, 706318970, 706124954, 705751953, 705631943, 705132980, 704678192, 704471512, 704407120, 704775009, 704725266, 704922638, 704856186, 704958191, 704658432]
2046.4G04658432o93817j64032k96021K40784k75040J00480L91159j90812j01776k94113
2056.1G03375244K50321j95160k46048k04087l76510L9673Q468L08457k37351n25207
2065.7G02197800l13645K37961M20990r6359n5847j53580l0441k51465j33438l75977
2075.4G01445999l19366L83682J5640j48010k86408J8692n8441J48621J95618n48478
2085G00847549j08566n7144K4643J86462K51465l63159o83823p5454k10266Q4915j4344
2095.6F99882278K08207r5978n50919j02386l29743j5411k26593n7221O6987n3788
2105.2F98725433J25962j64490J64871l81622m75769J7547J11084j96762k40631L34702
2114.9F98020325j95694k747N3864k04010k26288k65274l9368o52389l36533K34680
$$ y = [704658432, 703964615, 703800583, 703504562, 703745346, 703470306, 703570786, 703961945, 703771133, 703669357, 703375244, 703625565, 703430405, 703184357, 702980270, 702603760, 702643433, 702651901, 702960358, 702723007, 702197800, 701884155, 702122116, 702543106, 702446747, 702390900, 702237320, 702206879, 701955414, 701821976, 701445999, 701126633, 701510315, 701525955, 701377945, 701091537, 701110229, 701051788, 701200409, 701396027, 700847549, 700738983, 700681839, 700706482, 700892944, 701144409, 700781250, 700097427, 700021973, 699811707, 699896622, 699882278, 700090485, 699994507, 699443588, 699341202, 699011459, 698996048, 698769455, 698712234, 698779221, 698725433, 698851395, 698686905, 698851776, 698470154, 697994385, 698011932, 698123016, 697926254, 697685623, 698020325, 697824631, 697821884, 697875748, 697671738, 697445450, 697180176, 697140808, 696488419, 696151886, 696386566]
2124.5F96386566M10919K67411l23944k69547K52152M08554j3276j56784o65207l68270
2134.2F95928574j39389l72620J07574L26310N10635l32642l7536M10919q9645J83563
2143.8F96495743r9716r7504k70233l05100j38168K45056J41373j59073N00641J00326
2153.5F96413345K30332k84119m02908K19421l56598M6692j55182K4033K08816K3652
2163.1F95967484J7929l43171J05210J52664K31781k11487k79465p4157j47705L35693
2172.8F95754776J54419K50473j36337P3394N78156J05057k27204k43606K40097j54495
2182.4F96394730k39792l04184j68228K51617n0812L12882L66363J37406k87094R4909
2192F96507797L57132r9869R2240q2550j0147m51813o027O15005j97372j79596K40783
$$ y = [696386566, 696797485, 697064896, 696740952, 696471405, 696723557, 697132111, 697118835, 696962051, 696296844, 695928574, 695789185, 695416565, 695524139, 695850449, 696361084, 696028442, 695990906, 696401825, 696312180, 696495743, 696396027, 696298523, 696028290, 695723190, 695585022, 695830078, 695971451, 695812378, 696313019, 696413345, 696643677, 696359558, 695956650, 696176071, 695819473, 695866165, 695710983, 695735016, 695943832, 695967484, 695985413, 695642242, 695747452, 695900116, 696131897, 695920410, 695640945, 695566788, 695419083, 695754776, 695909195, 696159668, 696023331, 696096725, 696674881, 696779938, 696552734, 696309128, 696549225, 696394730, 696154938, 695850754, 695682526, 695934143, 695883331, 696196213, 696562576, 696699982, 696412888, 696507797, 696864929, 696765060, 696857300, 696774750, 696764603, 696312790, 696306763, 696921768, 696724396, 696544800, 696785583]
2202.6F96785583M73862J01090j98593l55301j29242J73263J13220q2321n64346R2926
2212.3F96410141J97678K54516L23563q0109J24436o2485R6893j47400n6534p2708
2221.9F96987991j67694J3733l08151L93295K25067n951r002J62964J16653o23093
2231.6F96785812J20087j34048j82343K85721L5477p3472j33056J58996j30767m731
2241.2F96727676j02005n3939J31454K25220M60281r3841Q1405k11868j65176j76163
2250.9F96823044l58734J78985J05133L04261k36054K29K24686N7983L11050n7449
2260.5F97353134J0681m58221k2278K25983J43356N0736m34723M9743j31836M07334
2270.2F97193909K62832m6920L7231j96075K44674m38919k39410r8725k7465l03269
$$ y = [696785583, 697259445, 697360535, 697161942, 696806641, 696677399, 696850662, 696963882, 696881561, 696317215, 696410141, 696607819, 696862335, 697185898, 697105789, 697230225, 697167740, 697264633, 697117233, 697060699, 696987991, 696820297, 696834030, 696525879, 696919174, 697144241, 697138290, 697129288, 697292252, 697408905, 696785812, 696905899, 696771851, 696589508, 696875229, 696910706, 696837234, 696704178, 696863174, 696732407, 696727676, 696625671, 696571732, 696703186, 696928406, 697388687, 697294846, 697376251, 697164383, 696999207, 696823044, 696464310, 696643295, 696748428, 697052689, 696816635, 696816864, 697041550, 697099533, 697410583, 697353134, 697363815, 696905594, 696883316, 697109299, 697252655, 697303391, 696868668, 696918411, 696786575, 697193909, 697456741, 697409821, 697447052, 697250977, 697495651, 697056732, 696817322, 696718597, 696691132, 696387863]
2279.8F96387863m83703N88531J52130K25525j26190k9755M09775j0681K86789k62680
2289.4F97137604J3580j4191R9717K13852o7826O03943J00327M10537L50113j28784
2299.1F98718872j28555j38245O52084K67258N570J14059O52313Q02002K79770M67148
2308.7G01692276K39563N81512M24271J87302J22986j84250P07855M64096j03378O17675
2318.4G04749908R82972N07583P20215J221390Q80279J74485m50592M93927J245727
2327.1G10525894L28446P23724J038513p02286j051712l20205j46027P12585J669693
2335.7G12778625J189194j99356j21689L9673M52728M29154p14188q10776q62655j981735
2345.4G10198975k135621j665954k295761M61654L479081J803741J821671J548919
$$ y = [696387863, 695904160, 696492691, 696644821, 696870346, 696744156, 696714401, 697124176, 697113495, 697400284, 697137604, 697151184, 697136993, 697236710, 697450562, 697382736, 697986679, 698087006, 698497543, 698847656, 698718872, 698590317, 698452072, 699104156, 699371414, 699376984, 699491043, 700143356, 700945358, 701225128, 701692276, 701931839, 702513351, 702937622, 703124924, 703247910, 703063660, 703771515, 704235611, 704132233, 704749908, 705732880, 706240463, 706960678, 708182068, 709062347, 709236832, 708786240, 709280167, 710525894, 710854340, 711578064, 712616577, 711914291, 710862579, 710542374, 710396347, 711108932, 712778625, 713967819, 713768463, 713646774, 713686447, 714139175, 714568329, 713854141, 713043365, 712180710, 710198975, 708063354, 706397400, 704101639, 704563293, 708042374, 709846115, 711667786, 713216705]
2353.1G13216705M00544K027664J609726J489334m10767J127014J022339r14154j017990
2361.8G18550415j521454J86463j113129n61295j856155k632751o63529j410751j559754
2370.4G07418060k081604j177978r96552j179580r36890j948776j775284j448898j035157
2379.1F94837341r51690j262131j135635n46647n09262j126175o68869n47332l85514
2387.8F87704086J1139j89895n7297j5335N5618M1504L7994l3340l63693o74363n16891
2398.4F85999527l3340P5378K0142k03782m9667l36304k31857K84119n29862m49981
2408.1F84544373P0266l9520k44141l27072O0349j3428n24750k79693K97928l357k8000
2418.7F83512955l67813o84205j66091j24436J24588j66473n49469n42069k68783R7046
$$ y = [713216705, 713617249, 715644913, 717254639, 718743973, 718333206, 719460220, 720482559, 719568405, 718550415, 717028961, 717215424, 716102295, 715541000, 713684845, 711052094, 710388565, 708977814, 707418060, 705336456, 704158478, 703161926, 701982346, 701045456, 699096680, 697321396, 695872498, 694837341, 693885651, 692623520, 691487885, 690941238, 690431976, 689305801, 688636932, 688089600, 687704086, 687715225, 687525330, 687468033, 687452698, 687508316, 687549820, 687587814, 687554474, 687190781, 686516418, 685999527, 685966187, 686041565, 686061707, 685857925, 685808258, 685471954, 685240097, 685524216, 684994354, 684544373, 684614639, 684575119, 684330978, 684003906, 684064255, 684050827, 683526077, 683246384, 683544312, 683540955, 683512955, 683145142, 682460937, 682294846, 682170410, 682294998, 682128525, 681579056, 681036987, 680768204, 680865250]
2428.3F80865250j984K10342k58026k02789m7760l72543J60369N0583m36401m61578
2438F79505463j78223l41034j59454J74789l76205n30167j99814J62964k00577j79290
2447.6F77678452J81503r1782l33633n35050k97851k81754l02505l80402j40228O7673
2457.2F75564423r9945M07638j79138o21262j76696p5913j41144l46908m58374n09110
2466.9F73363571j07193n78995o78253P9956P8583J36337j28860l06168l96194l37067
2476.5F71125717p4234j14899l40118l34701j89896q48084o36062p7591J66855M87213
2486.2F69164200R0637l37524p29142n37948m28009l49274j96609m14734l56522j73263
2495.8F65731812P3471l50342l15170l12195j63498L33404m44793n06287n21774l76206
$$ y = [680865250, 680863266, 681073608, 680815582, 680612793, 680565033, 680192490, 680352859, 680403442, 679967041, 679505463, 679327240, 678986206, 678826752, 679001541, 678625336, 678095169, 677895355, 678058319, 677857742, 677678452, 677859955, 677768173, 677434540, 676899490, 676601639, 676319885, 676017380, 675636978, 675496750, 675564423, 675464478, 675872116, 675692978, 675071716, 674895020, 674819107, 674677963, 674331055, 673872681, 673363571, 673256378, 672677383, 671999130, 672079086, 672157669, 672294006, 672165146, 671858978, 671462784, 671125717, 671051483, 670936584, 670596466, 670261765, 670071869, 669223785, 668587723, 668510132, 668676987, 669164200, 669254837, 668917313, 668188171, 667650223, 667222214, 666872940, 666676331, 666261597, 665905075, 665731812, 665805283, 665454941, 665139771, 664827576, 664664078, 664997482, 664552689, 664046402, 663524628, 663148422]
2505.5F63148422j29471m39224j53961k44293j30234o1264j68991k61536k43454l7002
2515.1F61278992m06418o55670l67508J12610j98059l91770l09601q3389J04218l47367
2524.7F58736038q1939k06910k26898k20184n87006m88891l48282Q5525l94211l57437
2534.4F55909805j82647m42810o5232j96914m5319n6305j32751k91596l86810j87836
2544F53921585k20871k75421p73621m16565l6850J33057J57623j54037p7133m92554
2553.7F51765213k88010k04162k89307l47442m83246q774l23868o75278l93448J36490
2563.3F48888168j99585j77688L41034j03073j53428n00717k77176k94342p64694j62201
2573F46596298J1826r0485l62396l89481m49676l72009j03989M7760J05743l98254
$$ y = [663148422, 663018951, 662579727, 662425766, 662181473, 662051239, 661989975, 661820984, 661559448, 661315994, 661278992, 660872574, 660216904, 659849396, 659962006, 659763947, 659372177, 659062576, 658979187, 659083405, 658736038, 658654099, 658447189, 658220291, 658000107, 657413101, 656924210, 656575928, 656661453, 656267242, 655909805, 655727158, 655284348, 655219116, 655022202, 654976883, 654920578, 654787827, 654496231, 654109421, 653921585, 653700714, 653425293, 652651672, 652235107, 652198257, 652331314, 652488937, 652334900, 652257767, 651765213, 651477203, 651273041, 650983734, 650636292, 650153046, 650144272, 649820404, 649145126, 648751678, 648888168, 648688583, 648510895, 648851929, 648748856, 648595428, 648094711, 647817535, 647523193, 646758499, 646596298, 646608124, 646517639, 646155243, 645765762, 645316086, 644944077, 644840088, 644887848, 644993591, 644595337]
2582.6F44595337j44806l87802o39954k39105k32162k12174n26199l09372q8272J09024
2592.2F41924515N34l72238q1635j58386n28030q20656k66648q1596l83835o1760k0256
2602.9F39150009j99432m65775k99301J08681K05917o14815q39614k71874n20401l19824
2612.5F35933571m26712m49295j39160Q2054m6807p68203l89099p5417J35994l6850
2622.1F33820076n05943n99518p16705q0414j33438k57836k2087M7493k06985m35448
2631.8F30909195j46980n57289n10331p70340n24559J74218n03846l23677n2948j67160
2641.4F27526283m15954k94113J19361l99932l91350j57967m23698o74286m48189q3847
2651.1F24356308J5030l53165o58645J1634J92070k77938l80249p0458l74107p39403
$$ y = [644595337, 644450531, 644062729, 643422775, 643183670, 642951508, 642739334, 642213135, 641903763, 641815491, 641924515, 641925049, 641552811, 641471176, 641312790, 640784760, 639964104, 639697456, 639615860, 639232025, 639170265, 639150009, 638950577, 638484802, 638185501, 638294182, 638500099, 637885284, 637045670, 636773796, 636253395, 635933571, 635506859, 635057564, 634918404, 635000458, 634953651, 634185448, 633796349, 633720932, 633856926, 633820076, 633314133, 632714615, 631997910, 631917496, 631784058, 631526222, 631504135, 631551628, 631344643, 630909195, 630762215, 630204926, 629694595, 628924255, 628399696, 628573914, 628070068, 627746391, 627693443, 627526283, 627110329, 626816216, 626935577, 626535645, 626144295, 625986328, 625562630, 624888344, 624440155, 624356308, 624371338, 624018173, 623359528, 623371162, 623563232, 623285294, 622905045, 622834587, 622460480, 621721077]
2660.7F21721077l49388l14140l84789n53055o8092K60353p5569N569m23965p25861
2670.4F19092140m50172l2845k83546o30684k83241J08375L08685j02081k94189m19731
2680F17012711j26954l7345o57692m25530l23372m62074o30837m02641q2359o0234
2689.6F13803673K8305l03078k39334k69127j09062j93329m85420m7264l57552q32214
2699.3F10995598o82182N9814K59056J05591p2289o22940k39677l8490k45438m20532
2708.9F09098511k36588j05247l45383l91693p09686j38855K021k30331m1237j01585
2718.6F06799927K72903k15454o51359n16091k29874R6970j07155k21481l74909j76620
2728.2F04676857j37215j2436K63787r7351l81470m21867j38360j09825l08685j91421
$$ y = [621721077, 621371689, 621057549, 620672760, 620119705, 620051613, 620311966, 620236397, 620241966, 619818001, 619092140, 618641968, 618609123, 618325577, 617694893, 617411652, 617520027, 617828712, 617726631, 617432442, 617012711, 616885757, 616848412, 616190720, 615765190, 615441818, 614979744, 614348907, 613946266, 613863907, 613803673, 613831978, 613528900, 613289566, 613020439, 612911377, 612718048, 612232628, 612185364, 611827812, 610995598, 610313416, 610373230, 610632286, 610737877, 610665588, 610042648, 609802971, 609764481, 609519043, 609098511, 608861923, 608756676, 608411293, 608019600, 607309914, 607171059, 607173080, 606942749, 606901512, 606799927, 607072830, 606857376, 606206017, 605689926, 605460052, 605557022, 605449867, 605228386, 604853477, 604676857, 604539642, 604527206, 604790993, 604693642, 604312172, 603890305, 603751945, 603642120, 603333435, 603142014]
2737.9F03142014o0158l57895l02048J20812j23711k03857j49003J34354K3346o57349
2747.5F01566505n16929o9962J030m18167l44620n3329P0610J10092k52457j36642
2757.2E99956131J10779j1978n82962p46727m49944l5858J25503l46565q1405j01166
2766.8E97835808r3460Q735l05061r9144l01590k95906j60484J87988j21269r71298
2776.4E95684319m28009k57607k92091k31438k95906k44637k73857M807j57509k20986
2786.1E93287086n9089n5809j87264l87802n57899p99713m97551k25182l07312l51143
2795.7E89858322j70364O9809j43662o06270n17845k35252o06575o02341m36554l71742
2805.4E86237526m9973r4947n59655p76062k70004q6174j44920n47562o97441k72369
$$ y = [603142014, 603081856, 602723961, 602421913, 602542725, 602419014, 602215157, 602066154, 602200508, 602223854, 601566505, 601049576, 600979614, 600980644, 600562477, 600217857, 600164528, 600235138, 600345230, 600092773, 599956131, 600066910, 600054932, 599471970, 598725243, 598275299, 598239441, 598364944, 598018379, 597936974, 597835808, 597742348, 597751083, 597446022, 597346878, 597045288, 596749382, 596588898, 596776886, 596655617, 595684319, 595256310, 594998703, 594706612, 594475174, 594179268, 593934631, 593660774, 593665581, 593508072, 593287086, 593227997, 593172188, 592984924, 592597122, 592039223, 591239510, 590741959, 590516777, 590209465, 589858322, 589687958, 589757767, 589614105, 589007835, 588489990, 588254738, 587648163, 587045822, 586609268, 586237526, 586187553, 586092606, 585532951, 584756889, 584486885, 584400711, 584255791, 583708229, 583010788, 582738419]
2815E82738419m00734l61138r20448q88367l01819m15649j76964m53148k89345k10952
2824.7E78319855o34690o40220n70336k19383o82869r23462n56297n54771o03981p22771
2834.3E72211075m78516l20740n17425q34084j296196j135597n56259j123695j603852
2843E64344711j195488j222419j123619j012955j213036j911316j754799p16514j111908
2851.7E53082657j185417o45218k81067M3411P5112L51524J38550j61743k29378l13225
2861.3E50875206j66283J79177K99072l35960p21207k48909K2659n27382q17375p42950
2870.9E47816048m65050q2779l75748m85916l46947l22876k96211k33040l70330o33507
2880.6E44203644n11322n54924l27072j53313m09660l74718l91998o26793p18041o16646
$$ y = [582738419, 582337685, 581976547, 581056099, 580167732, 579865913, 579450264, 579273300, 578820152, 578530807, 578319855, 577685165, 577044945, 576474609, 576255226, 575572357, 574648895, 574092598, 573537827, 572933846, 572211075, 571732559, 571411819, 570894394, 570060310, 568764114, 567628517, 567072258, 565948563, 564344711, 563149223, 561926804, 560803185, 559790230, 558577194, 556665878, 554911079, 554194565, 553082657, 551897240, 551252022, 550970955, 551014366, 551089478, 551441002, 551579552, 551417809, 551188431, 550875206, 550708923, 550888100, 551187172, 550851212, 550130005, 549881096, 549903755, 549376373, 548558998, 547816048, 547350998, 547268219, 546892471, 546406555, 546059608, 545736732, 545440521, 545207481, 544837151, 544203644, 543692322, 543137398, 542810326, 542657013, 542247353, 541872635, 541480637, 540853844, 540135803, 539519157]
2890.2E39519157q00781o37131m28314o23817o48422o02227k64587k33650o84738j065522
2899.9E33529968p78351n30510n77087k45514l75023m02374l98903n46570p53898o66504
2909.5E28255234m90418r52301m91218m83475r05151j310540j595649p62329j061020
2918.2E20203133j139107m73366l35998p64962n37872J89629o09970o0044L45955l891
2927.8E16813507N40505k5902m17786P6790R62143O29120j00136L31039N67742L27110
2937.5E19704132r613N66559Q74176O32133M49067L40271N63545M84619O85043M02146
2947.1E24692078k87667r5672O08520P91283O50635K64206o60897m47769j1978M18358
2956.8E25921097P54356M31214M93354K08359L96042L84941P5684J20887L7003O83632
$$ y = [539519157, 538718376, 538081245, 537652931, 537029114, 536380692, 535778465, 535513878, 535280228, 534595490, 533529968, 532751617, 532221107, 531644020, 531398506, 531023483, 530621109, 530222206, 529675636, 528921738, 528255234, 527764816, 526812515, 526321297, 525837822, 524932671, 523622131, 522026482, 521264153, 520203133, 519064026, 518590660, 518254662, 517489700, 516951828, 517141457, 516531487, 516471443, 516817398, 516813507, 517354012, 517328110, 516910324, 516987114, 517949257, 518578377, 518478241, 518809280, 519377022, 519704132, 519694519, 520261078, 521135254, 521767387, 522216454, 522556725, 523120270, 523604889, 524289932, 524692078, 524404411, 524308739, 524917259, 525708542, 526359177, 526623383, 525962486, 525514717, 525502739, 525921097, 526675453, 527106667, 527600021, 527808380, 528204422, 528589363, 528665047, 528785934, 528822937, 529506569]
2966.4E29506569N94520J58005M92783O41594N80253P06330O59752L72123J71891k67258
2976.1E33616562M4975L79067k5902J23978N67665N69496L49273J85700k31514J74408
2985.7E35753708O14357N3291j57928j68267J2818J02005j73493j10283K55013j78871
2995.3E36002350l38440K34642k29721k24190j02959l30238j35803l16658l92647p25784
3005E33440552o95305j51482J15433L34702K50206l36762m48646j25504p19605o24542
3014.6E31039047l48854m23736l17345o44417k57721k28348k05459m33045q23898R7046
3024.3E27453270j5144n44968p71866q82454k95334K7008n21164q58726J0147k00920
3033.9E23399849q94470m90647j78032j82800j63536j63307m90379o64750p68737o81878
$$ y = [529506569, 530101089, 530259094, 530751877, 531393471, 531973724, 532680054, 533339806, 533711929, 533883820, 533616562, 533661537, 534040604, 534014702, 534138680, 534706345, 535275841, 535625114, 535810814, 535579300, 535753708, 536368065, 536421356, 536263428, 536095161, 536107979, 536209984, 536036491, 535926208, 536181221, 536002350, 535663910, 535898552, 535668831, 535444641, 535341682, 535011444, 534875641, 534558983, 534166336, 533440552, 532745247, 532593765, 532709198, 533043900, 533294106, 532957344, 532508698, 532383194, 531663589, 531039047, 530690193, 530266457, 529949112, 529304695, 529046974, 528818626, 528613167, 528180122, 527356224, 527453270, 527438126, 526893158, 526121292, 525238838, 524943504, 524970512, 524449348, 523590622, 523600769, 523399849, 522505379, 522014732, 521836700, 521653900, 521490364, 521327057, 520836678, 520171928, 519403191, 518721313]
3043.6E18721313n43861n52483o17523n92003J29624j25466n97534n37567q52585o11534
3053.2E13820381l88336j11542j16615m94881m70161m47807o50635q33588l81203k01225
3062.9E09724388j34544m9248p03354r13772n97496m50707k81677k1439l63846o56814
3072.5E05551491j91727J412m47655m86222J50452k41394j041489q82720m06762k02293
3082.1E01803093l48473J9074Q3122r73740j066284J45722J37672q43735q25538j61667
3091.8D97969246k0142n56793n28488k98424n14908m62608k76794J9531j51062q66738
3101.4D94312820j117744n55916j2474K90337J95579o86226p49015o51436r90296n38406
3111.1D89497223j84326k72751l09639m86755o62728l44238m17671n51796m14162n00336
$$ y = [518721313, 518177452, 517624969, 517007446, 516415443, 516545067, 516419601, 515822067, 515284500, 514431915, 513820381, 513432045, 513320503, 513203888, 512709007, 512238846, 511791039, 511140404, 510306816, 509925613, 509724388, 509589844, 509540596, 508837242, 507923470, 507325974, 506875267, 506593590, 506572151, 506208305, 505551491, 505359764, 505361176, 504913521, 504427299, 504577751, 504336357, 503294868, 502412148, 502005386, 501803093, 501454620, 501473694, 501556816, 500583076, 499516792, 499662514, 499800186, 498956451, 498130913, 497969246, 497949104, 497392311, 496863823, 496565399, 496050491, 495587883, 495311089, 495330620, 495179558, 494312820, 493195076, 492639160, 492626686, 492917023, 493112602, 492426376, 491677361, 491025925, 490035629, 489497223, 489312897, 489040146, 488730507, 488243752, 487581024, 487236786, 486819115, 486267319, 485853157, 485352821]
3120.7D85352821k94609n85060l94668O523o20499q53882m44107r6626l73306n29557
3130.4D81167030m79049l55988l63960q52852p12853m90303m15496m26560j84707k88201
3140D76597061p88002l22037o12564o29997j83449p98034n05410k34260q48847n10368
3149.6D71164093O676m93889o90384n19867l25241m18434q81233m12331k16179p06139
3159.3D66507072r41429o66732k44828m04892n37758p21817p79304n48210j81694k86789
3168.9D61193619n92118m09927p81708p44819n58892n94177j98097Q3733m5662j037217
3178.6D56314735j136093p69233n07050L85056M2533q09288q99505p38335m27360n04837
3188.2D50950623q93136m97894j89705m37774n20783o27441k35329l7346k06375o92596
$$ y = [485352821, 485058212, 484473152, 484078484, 484085007, 483464508, 482610626, 482166519, 482069893, 481696587, 481167030, 480687981, 480331993, 479968033, 479115181, 478402328, 477912025, 477496529, 477069969, 476885262, 476597061, 475809059, 475487022, 474874458, 474244461, 474061012, 473262978, 472757568, 472523308, 471674461, 471164093, 471170769, 470676880, 469986496, 469466629, 469141388, 468722954, 467841721, 467429390, 467213211, 466507072, 465565643, 464898911, 464654083, 464249191, 463711433, 462989616, 462210312, 461662102, 461480408, 461193619, 460601501, 460191574, 459409866, 458665047, 458106155, 457511978, 457313881, 457397614, 457351952, 456314735, 455178642, 454409409, 453902359, 454287415, 454329948, 453520660, 452621155, 451882820, 451455460, 450950623, 450057487, 449559593, 449369888, 448932114, 448411331, 447783890, 447548561, 447511215, 447304840, 446612244]
3197.9D46612244r71947o17638p63588n58853p19833n06554j16615m55551k6932l77426
3207.5D41497307n92270q10165j011391q164J11466k91634r72633q58231l91311o46782
3217.2D36026192k98081p4539m28581q15811o91185l72315j16615l51219n30396m49562
3226.8D31897888q20579m36516o06728p27653k30713k08321O8360n56412q29888n48706
3236.4D27000732k99377p4959p24830p57218n17998l70712j76048J04866R8114q00972
3246.1D23481598p34406m80499o15768k96364j78681p10525o30531K62527k48337n23758
3255.7D19325256k50167p17392j92833j34430l94364k34527p94793m70504K9793k97013
3265.4D15869026n82390n92651p3090K40670N0544o04553n49850J53923l12691n89027
$$ y = [446612244, 445640297, 445022659, 444259071, 443700218, 442980385, 442473831, 442357216, 441901665, 441874733, 441497307, 440905037, 440094872, 439083481, 439075317, 439186783, 438895149, 437922516, 437064285, 436672974, 436026192, 435728111, 435653572, 435224991, 434409180, 433717995, 433345680, 433229065, 432877846, 432347450, 431897888, 431077309, 430640793, 430034065, 429306412, 429075699, 428867378, 428935738, 428379326, 427549438, 427000732, 426701355, 426626396, 425901566, 425144348, 424626350, 424255638, 424079590, 424184456, 424282570, 423481598, 422747192, 422266693, 421650925, 421354561, 421175880, 420465355, 419834824, 420097351, 419849014, 419325256, 419075089, 418357697, 418164864, 418030434, 417636070, 417401543, 416606750, 416136246, 416166039, 415869026, 415286636, 414693985, 414620895, 414861565, 414912109, 414307556, 413757706, 413911629, 413598938, 413009911]
3275D13009911m91448m97742m17327o91452k91596n1498j11657L04223j41678o97060
3284.7D09922676m74281n13916m97513k24495n4359J3237j09253l50685r25675p18956
3294.3D06066780k07863m76722j56518j75209p95288p61947j7472M24042k15187o56052
3303.9D03028564n36079l17154n92155m42925j45988n28450m27475m73824n1460l92342
3313.6C99120712r13162l69301p10640m20570l41530j28326k0905j042938n52330l05596
3323.2C94315414q38623p93571m02794o59027o56433L5248p64542r04922o59371n21545
3332.9C88149834K13012k88963q72650j081925q53920k28881j34087p89299j256561
3341.6C82856560q21038p01408l83644O4697k20337o96869l67736r5482p11861q61816
$$ y = [413009911, 412518463, 412020721, 411603394, 410911942, 410620346, 410568848, 410457191, 410761414, 410619736, 409922676, 409448395, 408934479, 408436966, 408212471, 408158112, 408171349, 408062096, 407711411, 406785736, 406066780, 405858917, 405382195, 405225677, 405050468, 404255180, 403493233, 403475761, 403899803, 403684616, 403028564, 402492485, 402175331, 401583176, 401140251, 400994263, 400465813, 400038338, 399564514, 399513054, 399120712, 398207550, 397838249, 397127609, 396707039, 396365509, 396237183, 396216278, 395173340, 394621010, 394315414, 393476791, 392683220, 392280426, 391621399, 390964966, 391000214, 390235672, 389330750, 388671379, 388149834, 388362846, 388073883, 387201233, 386119308, 385265388, 385036507, 384902420, 384113121, 382856560, 382035522, 381334114, 380950470, 381015167, 380794830, 380097961, 379730225, 379634743, 378922882, 378061066]
3351.2C78061066r35212o29348m75655o12488k3727j72730l52745o91909j044503l37028
3360.8C72785721m61044p59049k49863m32205q80470p00874n52369o40754l75099k1935
3370.5C67712059m81071n01023j63688m02413l86772j032639q76770q9225j69526J35613
3380.1C63744545k75230n69954o95534o46095L64380K44903k27890o52237r30519n06973
3389.8C59849396k59400J02196K14310k92893o16569n31159j83334J87569K9106l23906
3399.4C58175316n36881o54754n48020m85191k85339L2234J37405P9041n3978o19736
3409.1C55240097o76689K52724N29594J6403q30383o02722K4223j75667j08719K59133
3418.7C53927994Q26683k88162o34232O96030m7798l13950J14632N88646P31697l68309
$$ y = [378061066, 377125854, 376496506, 376020851, 375408363, 375384636, 375211906, 374859161, 374167252, 373122749, 372785721, 372324677, 371565628, 371315765, 370883560, 370003090, 369302216, 368749847, 368109093, 367733994, 367712059, 367230988, 366729965, 366566277, 366163864, 365777092, 364744453, 363867683, 363778458, 363608932, 363744545, 363469315, 362899361, 362203827, 361557732, 361922112, 362167015, 361939125, 361286888, 360356369, 359849396, 359589996, 359692192, 359906502, 359613609, 358997040, 358465881, 358282547, 358470116, 358499222, 358175316, 357638435, 356983681, 356435661, 355950470, 355665131, 355697365, 355834770, 355913811, 355859833, 355240097, 354563408, 354816132, 355345726, 355362129, 354531746, 353929024, 353953247, 353777580, 353668861, 353927994, 354754677, 354466515, 353832283, 354528313, 354480515, 354166565, 354281197, 354869843, 355601540, 355233231]
3428.3C55233231l58735O1074j52931J98974M10652p2708K0485O1073j50375k04277
3438C55046463k92091O1645O64673J164856j14174n44166K81753J85509J023903K89383
3447.6C57767754j43166M49333L1777O02684Q75282N54848j15242n7297L39165L03306
3457.3C60608444L88909L80134J158905O51283j38282J58806O24771J100540P29484
3466C65662994N94902J43624n9052M56047P47986M84467L50990J201935N80597m32892
3475.6C69731598Q5602N97877M78554P45583J580123J050606q7509l30391M66690L97263
3485.2C74715996K28805J322213R35173M58793Q42896L02086J47667Q39958P43828
3493.9C80537415O58187Q72193J28860K28615J040611J193924O55365Q12378Q17986
$$ y = [355233231, 354874496, 354935570, 354782639, 354981613, 355392265, 355319557, 355340042, 355401115, 355250740, 355046463, 354754372, 354816017, 355480690, 356645546, 356531372, 355987206, 356268959, 356454468, 357478371, 357767754, 357624588, 358073921, 358105698, 358708382, 359583664, 360138512, 360023270, 359965973, 360305138, 360608444, 360997353, 361377487, 362536392, 363187675, 363049393, 363208199, 363832970, 364933510, 365662994, 366257896, 366401520, 366342468, 366798515, 367546501, 368030968, 368381958, 369583893, 370164490, 369731598, 369817200, 370415077, 370893631, 371639214, 373219337, 374269943, 374182434, 373852043, 374318733, 374715996, 374944801, 376267014, 377202187, 377660980, 378503876, 378805962, 378953629, 379793587, 380537415, 381195602, 382067795, 382196655, 382425270, 383465881, 384659805, 385315170, 386127548, 386945534]
3502.6C86945534l87917J91002R28993P07932K37465J293258J822930k07443O68869
3511.3C92200623J142845N7792P9575O80618Q60749O40525P93152O01082R94377P69539
3520.9C98820877J340675J632767l79104K80456J203842J619110J254120N72357J00975
3529.6D06446075K4567P54089N85137J334534R53483J575432J554756r14688O04019
3538.3D12917404J102295Q26378R01909J506767J946564J314430R40590o6223J420135
3547D22810249L54729N15671J323471Q38585K111015o6757Q20274Q96111O70318K384491
3556.6D32658157M82025J141472J830445Q79783l03688J606751K342949l4256L508606
3565.3D44112244K083053P63J89667j739426L017655J496162P5569J314812K023811
$$ y = [386945534, 386557617, 386748619, 387677612, 388385544, 388623009, 389916267, 391739197, 391531754, 392200623, 393343468, 393401260, 393480835, 394161453, 395022202, 395662727, 396455879, 397056961, 398051338, 398820877, 400161552, 401794319, 401415215, 401695671, 402899513, 404518623, 405772743, 406345100, 406446075, 406470642, 407224731, 407809868, 409144402, 410097885, 411673317, 413228073, 412313385, 412917404, 414019699, 414846077, 415747986, 417254753, 419201317, 420515747, 421456337, 421390114, 422810249, 423164978, 423680649, 425004120, 425842705, 427953720, 427886963, 428707237, 429603348, 430273666, 432658157, 433140182, 434281654, 436112099, 436991882, 436688194, 438294945, 440637894, 440603638, 444112244, 446195297, 446196060, 446385727, 444646301, 447663956, 449160118, 449235687, 450550499, 452574310]
3574D52574310J720772J282387K137298O42930J998634K291260M20227L31916J264229
3582.6D64663963K269211M99573L355026K712479j326256K129059j310387J343651
3590.4D74336319K715034L095856K383614O85081L445626j801033M40177L844033J111717
3599D90256424L280411J147270m7608J493760J509781K210769K992706L209153j262055
3607.7E04790611K703553L66020k429123P405090L240891l098069L833123l49656L251839
3616.4E19714279N730019N34172J284103o27975m79889K895050L073082K163582J845054
3625.1E36131477K054940K694168Q015632O226998j3570748L72429M072151N374566
3632.8E51371613K714805j900444J368179K971535L294296J417275J053238K253761
$$ y = [452574310, 454295082, 455577469, 457714767, 458357697, 460356331, 462647591, 463067818, 463399734, 464663963, 466933174, 467432747, 470787773, 473500252, 472173996, 474303055, 472992668, 474336319, 477051353, 480147209, 482530823, 483215904, 486661530, 484860497, 485300674, 489144707, 490256424, 493536835, 494684105, 494636497, 496130257, 497640038, 499850807, 502843513, 506052666, 504790611, 507494164, 507860184, 505431061, 512836151, 516077042, 512978973, 516812096, 516462440, 519714279, 525444298, 525978470, 527262573, 526634598, 526154709, 529049759, 532122841, 534286423, 536131477, 538186417, 540880585, 548896217, 555123215, 541552467, 541924896, 545997047, 551371613, 554086418, 552185974, 553554153, 556525688, 559819984, 561237259, 562290497, 564544258]
3640.5E64544258K630577J360016j27525K382164M163742P290802K516327n782471
3648.2E78977890M731865K239075l250046j959190M626655M364586L654175O730766
3655.9F00115776o844025j236496M887314K081032J854134O13632J768761O86149J955605
3664.6F05881882K251854k60392M715996M124985n01862R46274o440010M59747P642937
3673.3F18821411J1082077N109596k0668602j478386O842881N311317j605491l88375
3681F23026428K712631J966973J729011L68004p53326L366813P020226q388252m029465
3689.7F27019043J0220642m671020k644082N159760J169472J680908P92961r11293
3697.4F37816391L84903M07143K576942L819580l993759m241104L999023K134552o5460
$$ y = [564544258, 567174835, 568534851, 568407326, 570789490, 574953232, 582244034, 584760361, 578977890, 583709755, 585948830, 582698784, 580739594, 585366249, 589730835, 593385010, 600115776, 593271751, 592035255, 596922569, 599003601, 600857735, 601471367, 603240128, 603926277, 605881882, 608133736, 607873344, 612589340, 616714325, 616212463, 617158737, 610718727, 611178474, 618821411, 629903488, 635013084, 614344482, 612866096, 619708977, 625020294, 623414803, 623026428, 625739059, 627706032, 629435043, 629803047, 629049721, 632416534, 639436760, 631048508, 627019043, 637239685, 632568665, 629924583, 635084343, 636253815, 637934723, 638727684, 637816391, 638201294, 638608437, 641185379, 645004959, 641011200, 636770096, 640769119, 642903671, 642838211]
3706.1F42838211M82483K553253N652161o364365K191239P550354j5547104L13148
3713.8F39669380M056282R38950Q52051K531585K986374l481140o07605O588059k071076
3722.5F51462860o254349M929810J802750p18232k975845p37381M260483J558761O701661
3731.2F60030518J32751j0830307O819687M552002q310318m057617J690750m17633
3738.9F49609833J182556L427048m290390K799682J3820801l497162k1184234P189102
3746.6F49057236N697784P641373q26035j4493637J1654511j821137j0697861L881302
3754.3F50093536L981171M722137n411987P42874P154160o824417l704376L423614
3762F54176712J501694k5330L224945l059692n335541L883896O223373K321167j0426712
$$ y = [642838211, 643320694, 645873947, 651526108, 645161743, 647352982, 654903336, 639356232, 639669380, 643725662, 644664612, 645516663, 648048248, 651034622, 647553482, 646945877, 653533936, 651462860, 645208511, 650138321, 651941071, 651222839, 648246994, 647509613, 651770096, 653328857, 660030518, 660163269, 649332962, 656152649, 660704651, 652394333, 648336716, 650027466, 649609833, 650792389, 654219437, 649929047, 652728729, 666549530, 663052368, 641868134, 649057236, 654755020, 662396393, 661570358, 647076721, 658731232, 656910095, 646212234, 650093536, 654074707, 658796844, 653384857, 654127731, 661281891, 654457474, 650753098, 654176712, 655678406, 655653076, 658878021, 655818329, 650482788, 654366684, 660590057, 662911224, 652484512]
3770.7F52484512J00022L240356l52402R18122J87378O92596r5138L005065J160431
3779.4F61340942q993759J612473K609634J079407L243484j858215j721725M67605
3787.1F57779846k57873K49481L60641M78669o18973k47727j84173J036682M369583
3795.8F62966156j799927m860992J047592L480530P366867k565231j2628708L96652
3803.5F53402939J546020N550232Q238373q687668q045501M095459K863311M45633
3811.2F59408798m05578p61185J545257O904374K706909j6665802J421737O211854
3818.9F60366364N834198N550994j7397155k530442M294510K139054L403472R63288
3826.6F62624283m368439j177063J067429L395767L178863r049682J061172Q751984
$$ y = [652484512, 652584534, 655824890, 655472488, 656390610, 656577988, 657270584, 657175446, 660180511, 661340942, 652347183, 653959656, 656569290, 657648697, 660892181, 659033966, 657312241, 657779846, 657521973, 657771454, 658132095, 658610764, 657991791, 657744064, 657559891, 658596573, 662966156, 661166229, 656305237, 657352829, 660833359, 668200226, 665634995, 653006287, 653402939, 654948959, 660499191, 668737564, 660049896, 652004395, 656099854, 658963165, 659408798, 659003220, 658242035, 659787292, 666691666, 669398575, 652732773, 654154510, 660366364, 666200562, 671751556, 654354401, 651823959, 656118469, 658257523, 661660995, 662624283, 658255844, 657078781, 658146210, 661541977, 664720840, 655671158, 656732330, 665484314]
3834.3F65484314n070725j637268R639740p100143p167664Q462296m015122k811737
3842.1F55783691P400513p90405n993195J483994J431961K53982K003632o69632J661835
3850.7F62566376P082596l987427K318649j3276749m551086R942474l09753l189926
3858.4F56595154J854324K142182K593612n532989j61362Q985138m291534q740159
3866.2F53444366K899399N657501Q157349n195160j3016815K275391O436309M932404
3873.9F65590744r800873j473617L512802K060K042923N375671l158874r457322M407654
3882.6F57041168J018448J157379Q532639j1492691k132950L720169M42657M740296
3890.3F63027115O93664q738632J03684L095398j720734Q52051K084732L031540L214187
$$ y = [665484314, 660413589, 658776321, 668416061, 661315918, 654148254, 662610550, 658595428, 655783691, 663184204, 662393799, 656400604, 657884598, 659316559, 659570541, 661574173, 660904541, 662566376, 669648972, 665661545, 667980194, 654703445, 650152359, 660094833, 659785080, 656595154, 658449478, 660591660, 663185272, 657652283, 657490921, 666476059, 662184525, 653444366, 656343765, 662001266, 670158615, 664963455, 651946640, 654222031, 660658340, 665590744, 655789871, 654316254, 657829056, 657831116, 659874039, 665249710, 662090836, 652633514, 657041168, 658059616, 659216995, 667749634, 656256943, 654123993, 657844162, 658286819, 663027115, 663720779, 654982147, 655085831, 658181229, 656460495, 657312546, 659397278, 662428818, 665643005]
3898.9F65643005j0683975L945847L947830o866303M592438k284927k904282q2321
3906.7F55307312K61765K513427k99453K27813K35214l27072p0572p32421J022644
3915.3F58138657K358856k968826l616181M847794P92770n107956J180115J788788
3923.1F57414017K372284l78266m231338M58069J876602J783294j160507j277160L295135
3931.7F60152130j707077l979645M60282Q46710O73675P9346j69067N6152n89294J154861
3941.4F56978073J697083l141861j182175J365967Q59909J287079j865616M55856P99561
3950.1F57253876l016892J493912O93893j176376O14395L63007K89078m24576k28882
3958.7F55861435j231918p5303J656113r93042l74374Q70743j11618m91105j4419P33566
$$ y = [665643005, 654959030, 658904877, 662852707, 655986404, 660578842, 658293915, 655389633, 655307312, 655569077, 658082504, 657783051, 658010864, 658246078, 657919006, 657848434, 657116013, 658138657, 660497513, 657528687, 653912506, 658760300, 659553070, 654445114, 655625229, 657414017, 659786301, 659408035, 655176697, 655634766, 657511368, 659294662, 658134155, 656856995, 660152130, 658445053, 654465408, 654925690, 655772400, 656446075, 656525421, 656356354, 656412506, 655823212, 656978073, 658675156, 655533295, 654351120, 655717087, 656576996, 657864075, 655998459, 656454315, 657253876, 654236984, 655730896, 656424789, 655248413, 655862808, 656225815, 656514893, 656090317, 655861435, 654629517, 654554214, 656210327, 655217285, 654842911, 655713654, 655602036, 655110931, 655096512, 655830078]
3968.4F55830078m79278j398087L70407P00760o0349J83487l6850K08359R1019K31705
3978F55641251J51062o562N69001j012421j179047j4343J39389L54767L80173M6692
3987.7F55069962j55106Q08792o07071r26285M15268n27954K59628K22550n16129R2469
3997.3F54136124K33154J18408k44751
4000.2F54242935
$$ y = [655830078, 655350800, 653952713, 654323120, 655023880, 654963531, 655147018, 655110168, 655318527, 655409546, 655641251, 655792313, 655785751, 656354752, 655342331, 654163284, 654148941, 654288330, 654643097, 655023270, 655069962, 654914856, 655723648, 655116577, 654190292, 654605560, 654077606, 654337234, 654559784, 654043655, 654136124, 654369278, 654487686, 654242935]
##END=$$ End of the data block
