##TITLE=$$ Begin of the data block
##JCAMP-DX=5.00 $$ ACD/SpecManager v 10.08
##SPECTROMETER/DATA SYSTEM=Varian
##DATE=08 Jan 2013 15:30:46
##DATA TYPE=INFRARED SPECTRUM
##DATA CLASS=XYDATA
##ORIGIN=
##OWNER=
##NPOINTS=3735
##FIRSTX=399.26403809
##LASTX=4000.35498047
##MAXX=4000.35498047
##MINX=399.26403809
##MAXY=77.94303131
##MINY=37.20281601
##XFACTOR=1.0000000000
##YFACTOR=0.000000100000000
##FIRSTY=55.67598724
##DELTAX=0.96440572
##XUNITS=1/CM
##YUNITS=TRANSMITTANCE
##XYDATA=(X++(Y..Y))
$$ plain form
399.3 556759872 568103676 562967949 553280640 545731430 539655838 546690140 553819237 554432716
407 554432716 561303291 564545059 556692886 549169731 548267403 557266312 562213364 559085159 568046989
415.7 568046989 573942604 563571587 544046478 538997154 545512352 547233620 548857422 556387138
423.4 556387138 559770851 560104828 566719627 567808228 558454742 553877068 553187294 551133041 552017174
432.1 552017174 557125740 562760429 563179703 562826157 560751152 555971832 553976746 554919891 556422119
440.7 556422119 555753174 560014305 565731087 561754341 559980659 558644485 551245232 551999741 553706741
449.4 553706741 552658844 555699348 560594482 565135307 562578926 560893288 563675385 564793510
457.1 564793510 565030251 557362366 551139412 552210197 554257927 555527611 559497108 557795258 550427971
$$ packed form
399.3E56759872J1343804n135727r687309p549210o075592P034302P129097O13479
407E54432716O870575L241768p852173p523155r02328Q998909M947052l128205Q961830
415.7E68046989N895615j0371017j9525109n049324O515198J721268J623802P529716
423.4E56387138L383713L33977O614799J088601r353486m577674o89774k054253Q84133
432.1E52017174N108566N634689M19274l53546k075005m779320j995086R43145J502228
440.7E56422119o68945M261131N716782l976746j773682j336174p399253P54509J707000
449.4E53706741j047897L040504M895134M540825k556381j685638K782097J118125
457.1E64793510K36741p667885o222954J070785K047730J269684L969497j701850p367287
$$ plain form
465.8 550427971 550715637 552807312 550197563 549497108 549843254 549656067 550565834 556594391 558174133
474.5 558174133 552325058 546757622 543597260 542759171 547845993 553003578 552489395 551770515 552068863
483.2 552068863 548822250 546867065 548839760 549739037 548260422 548105164 550116425 551299896 550802002
491.8 550802002 550148010 550557861 549669495 546138802 545900612 549139748 550088272 549683113 548796425
500.5 548796425 549004135 549595985 548133354 547002869 544043083 542254028 543073883 544728813 546746750
509.2 546746750 547244568 548865089 547982407 544884148 542956390 539862518 538635635 538540535 540622635
517.9 540622635 543582077 543941956 543677902 541831589 540196304 539387970 538747215 538844910 539059372
526.6 539059372 540469284 542234535 543776932 542042847 538362999 537831650 537520409 535374489 534379807
$$ packed form
465.8E50427971K87666K091675k609749p00455L46146j87187R09767O028557J579742
474.5E58174133n849075n567436l160362q38089N086822N157585n14183p18880K98348
483.2E52068863l246613j955185J972695Q99277j478615j55258K011261J183471m97894
491.8E50802002o53992M09851q88366l530693k38190L239136R48524m05159q86688
500.5E48796425K07710N91850j462631j130485k959786j789055Q19855J654930K017937
509.2E46746750M97818J620521q82682l098259j927758l093872j226883r5100K082100
517.9E40622635K959442L59879k64054j846313j635285q08334o40755R7695K14462
526.6E39059372J409912J765251J542397j734085l679848n31349l11241k145920r94682
$$ plain form
535.2 534379807 536958961 540375061 539973145 538889122 539739761 537471619 534767647 535394745 534380951
543.9 534380951 533014641 533608284 535248451 536136284 534787216 534109917 534047737 534139481 532905655
552.6 532905655 531355171 531056442 530742226 532304687 532526665 532944756 533228989 530661621 530270767
561.3 530270767 529438095 528586769 528956680 530492134 533857918 533640137 532155991 531923370 532070198
570 532070198 532367210 531385117 532099228 532990074 532717438 532051888 531255035 532446480 532145157 530733528
579.6 530733528 530032463 529194603 530379639 531419487 532001343 533218880 532724876 531737785 531309776
588.3 531309776 531334724 530933571 530381546 531267319 532169113 532135048 532640915 534518547 534524956 532373199
597.9 532373199 530191650 529302788 530601692 530825081 531066818 532129822 531800194 530798950 530157623
$$ packed form
535.2E34379807K579154L416100m01916j084023Q50639k268142k703972O27098j013794
543.9E34380951j366310N93643J640167Q87833j349068o77299o2180R1744j233826
552.6E32905655j550484k98729l14216J562461K21978M18091K84233k567368l90854
561.3E30270767q32672q51326L69911J535454L365784k17781j484146k32621J46828
570E32070198K97012r82093P14111Q90846k72636o65550p96853J191445l01323j411629
579.6E30733528p01065q37860J185036J039848N81856J217537m94004r87091m28009
588.3E31309776K4948m01153n52025Q85773R01794l4065N05867J877632O409k151757
597.9E32373199k181549q88862J298904K23389K41737J063004l29628j001244o41327
$$ plain form
606.6 530157623 529952469 528773918 528402252 529439659 529722900 528768883 526982079 526271515 525815849
615.3 525815849 526297722 527658615 527620964 527630882 528287735 529141006 528851700 528306885 528687935 529687614
624.9 529687614 531528816 532746887 533197632 532930603 532985764 534475479 535670242 536515121 538068542
633.6 538068542 539025345 539563522 541624794 543451958 542898750 542065506 543817673 546676445 548142624
642.3 548142624 547834396 547068405 547620735 548701630 550256233 552358398 553190727 552978020 553165321
651 553165321 553649940 553886375 553948593 554325752 554976158 554684982 553419647 552341919 552360458 552434540
660.6 552434540 552222519 552464485 552131462 551774292 552362976 553757439 554542465 551672668 553837776
669.3 553837776 554658546 554586449 555676041 556982765 557619591 557541275 558753662 561046638 561977272
$$ packed form
606.6E30157623k05154j178551l71666J037407K83241r54017j786804p10564m55666
615.3E25815849M81873J360893l7651R918O56853Q53271k89306n44815L81050R99679
624.9E29687614J841202J218071M50745k67029N5161J489715J194763Q44879J553421
633.6E38068542R56803N38177K061272J827164n53208q33244J752167K858772J466179
642.3E48142624l08228p65991N52330J080895J554603K102165Q32329k12707J87301
651E53165321M84619K36435O2218L77159O50406k91176j265335j077728J8539P4082
660.6E52434540k12021K41966l33023l57170N88684J394463P85026k869797K165108
669.3E53837776Q20770p2097J089592J306724O36826p8316J212387K292976R30634
$$ plain form
678 561977272 561833496 561780281 561424103 561159821 561171341 561916885 564424973 565703239 566654549 567680855
687.6 567680855 567094078 567687531 567736855 567281265 567113571 566651154 567724304 568798752 569266243 569797745
697.3 569797745 570315170 570490303 570582695 570694237 570414467 570694313 571048584 572007599 573501205 574373589
706.9 574373589 575002060 574638939 573883438 573714333 573812981 574462776 575774384 577369919 579169502
715.6 579169502 579840012 579529610 580011482 580291443 580334930 580129738 580555763 582469788 583969765 585656166
725.2 585656166 586572876 586385307 586926804 586633492 585654411 586414490 588074532 588869514 590980148
733.9 590980148 593484421 593491058 593163109 592459259 591490097 591555138 591005745 591189575 593627548 597117233
743.6 597117233 599115105 598396034 597428665 597208099 598141785 598790474 597695923 598183022 600650444
$$ packed form
678E61977272j43776n3215l56178k64282J1520P45544K508088J278266R51310J026306
687.6E67680855n86777N93453M9324m55590j67694m62417J073150J074448M67491N31502
697.3E69797745N17425J75133R2392J11542k79770K79846L54271R59015J493606Q72384
706.9E74373589O28471l63121p55501j69105R8648O49795J311608J595535J799583
715.6E79169502O70510l10402M81872K79961M3487k05192M26025J914025J499977J686401
725.2E85656166R16710j87569N41497k93312r79081P60079J660042P94982K110634
733.9E90980148K504273O637l27949p03850r69162O5041n49393J83830K437973L489685
743.6E97117233J997872p19071r67369k20566R33686O48689j094551M87099K467422
$$ plain form
752.2 600650444 602879639 603656540 603429909 603967972 604401817 604303856 604634094 605536385 607474670 610072975
761.9 610072975 611318016 611665611 612339783 611961136 610721054 610751839 611995049 611869240 612102318
770.6 612102318 613779068 614325867 614553070 614226532 613226624 612222900 611403847 611584129 612014275
779.2 612014275 612703476 614504585 616586838 616925468 616213074 615561523 614976959 614972496 615144310 616230927
788.9 616230927 618215370 620029068 620912819 621385307 621555557 620461426 619408913 618131294 616657829
797.6 616657829 616874428 618998566 619837341 619065475 619486732 619707489 618584366 615993919 613544197
806.2 613544197 612718468 613154526 614002953 613784714 613936844 614035149 612099380 608859406 606300583
814.9 606300583 604620705 604098663 605284691 606586304 607739639 608084831 608271332 607833824 607256775
$$ packed form
752.2F00650444K229195P76901k26631N38063M33845r7961L30238R02291J938285K598305
761.9F10072975J245041L47595O74172l78647j240082L0785J243210j25809K33078
770.6F12102318J676750N46799K27203l26538r99908j003724q19053J80282M30146
779.2F12014275O89201J801109K082253L38630p12394o51551n84564m463J71814J086617
788.9F16230927J984443J813698Q83751M72488J70250j094131j052513j277619j473465
797.6F16657829K16599K124138Q38775p71866M21257K20757j123123k590447k449722
806.2F13544197q25729M36058Q48427k18239J52130R8305j935769l239974k558823
814.9F06300583j679878n22042J186028J301613J153335L45192J86501m37508n77049
$$ plain form
823.6 607256775 608588028 608922005 609802589 612794914 616829414 621012688 623388634 624925385 625756264
832.3 625756264 625788307 625022430 626067009 628669243 631025047 634198112 636927109 640031662 641159058
841 641159058 640542679 639917145 638995323 639440918 640112076 642709351 645794449 647683945 648982925
849.6 648982925 649403000 649151382 648157959 648241272 648113327 650031128 653244171 655506592 658480072
858.3 658480072 659991226 661149979 661005173 659171906 657549210 657314682 658425217 659539490 661272888
867 661272888 662337341 662894592 661932678 659066772 655283661 651625900 649852066 649804230 650846634
875.7 650846634 651150055 652322617 653542252 653254623 652428970 650460663 648662720 647294388 648194656
884.4 648194656 650036163 650750885 651096497 651209259 651100159 648883514 646323471 644573135 644282303
$$ packed form
823.6F07256775J331253L33977Q80584K992325M034500M183274K375946J536751Q30879
832.3F25756264L2043p65877J044579K602234K355804L173065K728997L104553J127396
841F41159058o16379o25534r21822M45595O71158K597275L085098J889496J298980
849.6F48982925M20075k51618r93423Q3313j27945J917801L213043K262421K973480
858.3F58480072J511154J158753j44806j833267j622696k34528J110535J114273J733398
867F61272888J064453N57251r61914k865906l783111l657761j773834m7836J042404
875.7F50846634L03421J172562J219635k87629q25653j968307j797943j368332R00268
884.4F48194656J841507P14722L45612J12762j09100k216645k560043j750336k90832
$$ plain form
893 644282303 645172043 646641388 648765564 649936829 650970917 649965210 647622375 645275879 643257141
901.7 643257141 642182922 641229095 642931442 645583267 648534088 651414795 652103348 651572647 650512314
910.4 650512314 650244598 650114822 651353989 652900162 653764114 654266434 652877579 651109009 647831039
919.1 647831039 644309921 642025375 640179214 638873711 637953873 637809143 637093544 635409279 632210274
927.8 632210274 627721100 623188705 619170685 616676331 616360741 617543831 618963547 620407982 620344086
936.4 620344086 618780365 616889763 614427681 612138824 610834961 611236458 612385902 613845329 614858780
945.1 614858780 614474030 613148041 610690193 608482208 606877136 606147842 607028656 608976402 610789986
953.8 610789986 611778908 612057571 609821701 605617867 602038612 599532585 597391319 596312714 596501617
$$ packed form
893F44282303Q89740J469345K124176J171265J034088j005707k342835k346496k018738
901.7F43257141j074219r53827J702347K651825K950821K880707O88553n30701j060333
910.4F50512314k67716j29776J239167J546173Q63952N02320j388855j768570l277970
919.1F47831039l521118k284546j846161j305503r19838j44730p15599j684265l199005
927.8F32210274m489174m532395m018020k494354l15590J183090J419716J444435o3896
936.4F20344086j563721j890602k462082k288857j303863M01497J149444J459427J013451
945.1F14858780l84750j325989k457848k207985j605072p29294Q80814J947746J813584
953.8F10789986R88922K78663k235870m203834l579255k506027k141266j078605J88903
$$ plain form
962.5 596501617 597097740 597426872 596211586 593947945 590300827 586419907 584221344 582894058 582062225
971.2 582062225 581485558 582154312 582407951 580690193 577647057 573308983 569194412 565108643 561534157
979.8 561534157 559653931 559108582 557927208 555250740 552209358 547807579 542237358 536799698 532575722
988.5 532575722 530216446 528267670 525911217 524263878 523647690 522986641 520800056 517034035 513106117
997.2 513106117 509739494 507181778 505878868 505608330 505028648 504309044 503014030 499827957 496231041
1005.9 496231041 493247108 490495758 488037453 486611214 486243668 486696854 486541367 484632835 482329483
1014.6 482329483 479287148 475820580 472170334 469251823 467513084 466222839 466368599 465341873
1022.3 465341873 463131180 460210228 456527863 453873024 452060432 451332436 450842209 451551132 452699966
$$ packed form
962.5E96501617N96123L29132j215286k263641l647118l880920k198563j327286q31833
971.2E82062225n76667O68754K53639j717758l043136m338074m114571m085769l574486
979.8E61534157j880226n45349j181374k676468l041382m401779n570221n437660m223976
988.5E32575722k359276j948776k356453j647339o16188o61049k186585l766021l927918
997.2E13106117l366623k557716j302910k70538n79682p19604j295014l186073l596916
1005.9D96231041k983933k751350k458305j426239l67546M53186j55487j908532k303352
1014.6D82329483l042335l466568l650246k918511j738739j290245J45760j026726
1022.3D65341873k210693k920952l682365k654839j812592p27996m90227P08923J148834
$$ plain form
1031 452699966 453535500 453936424 453435555 452977982 452048035 451706696 451598473 453546066 457274361 459989662
1040.6 459989662 462256508 463875999 464829063 464081917 462805099 461189995 459337730 458501396 458497849
1049.3 458497849 459722328 460003395 459342003 457704659 455300941 452430573 450410576 449925728 448802948
1058 448802948 449720688 450794525 452371216 455210991 457475052 459695702 459419403 459131355 460627861
1066.6 460627861 463246689 464747887 465828438 468527603 470061035 470327454 468925209 467685089
1074.4 467685089 466762199 465895615 466465454 467397804 468845711 469633980 470876122 471141701 469090347
1083 469090347 466167603 464198837 464465942 465149803 467802925 471037331 473913422 475784721 475905685
1091.7 475905685 476397820 476228218 475262032 474722672 476302643 478710403 481261253 484439850 487076416
$$ packed form
1031D52699966Q35534M00924n00869m57573r29947l41339j08223J947593L728295K715301
1040.6D59989662K266846J619491R53064p47146j276818j615104j852265q36334l547
1049.3D58497849J224479K81067o61392j637344k403718k870368k019997m84848j122780
1058D48802948R17740J073837J576691K839775K264061K220650k76299k88048J496506
1066.6D60627861K618828J501198J080551K699165J533432K66419j402245j240120
1074.4D67685089r22890q66584N69839R32350J447907P88269J242142K65579k051354
1083D69090347k922744j968766K67105O83861K653122L234406K876091J871299J20964
1091.7D75905685M92135j69602r66186n39360J579971K407760K550850L178597K636566
$$ plain form
1100.4 487076416 488030167 486805458 486313553 485894775 486046066 487677574 489681702 492290611 493815422
1109.1 493815422 495136566 495092354 493590393 492412605 492170639 493392258 494356804 495864563 498250923
1117.7 498250923 501130981 502643623 502154121 501165771 499396935 497117004 495406837 496766281 499415474
1126.4 499415474 501537094 503991089 506463165 508089294 507397308 506739502 506797218 507397041 509731026
1135.1 509731026 512816162 515728645 518611031 521623230 523256683 523691177 523194923 521938477 521044769
1143.8 521044769 521674881 523888359 525974426 528034096 529012337 529511223 529375648 526591034 523895874
1152.5 523895874 522846794 523125839 524279785 526217194 528109627 528607941 528012314 526097679 523710747
1161.1 523710747 521381607 519985313 519943085 521636314 525754585 529786873 533188934 535461960 535879974
$$ packed form
1100.4D87076416R53751j224709m91905m18778J51291J631508K004128K608909J524811
1109.1D93815422J321144m4212j501961j177788k41966J221619R64546J507759K386360
1117.7D98250923K880058J512642m89502r88350j768836k279931j710167J359444K649193
1126.4D99415474K121620K453995K472076J626129o91986o57806N7716N99823K333985
1135.1E09731026L085136K912483K882386L012199J633453M34494m96254j256446q93708
1143.8E21044769O30112K213478K086067K059670R78241M98886j35575k784614k695160
1152.5E23895874j049080K79045J153946J937409J892433M98314n95627j914635k386932
1161.1E23710747k329140j396294m2228J693229M118271M032288L402061K273026M18014
$$ plain form
1169.8 535879974 535835381 536452827 537290573 538982506 542951279 547300987 551381454 555268364 557884407
1178.5 557884407 558927841 558531075 558084488 558632774 559716988 561877289 565468445 569192352 571694412
1187.2 571694412 572663765 572498589 571075668 569263725 568041382 568275146 569948349 571946144 574081306
1195.9 574081306 575554695 575369148 573413544 570450554 567591667 565795555 565057907 565452309 567643890
1204.5 567643890 569890785 570206642 568976898 566778564 564241562 562131348 560672684 560147514 561001282
1213.2 561001282 563028717 565075493 566009903 565861969 564495392 562033844 559597130 557937737 557556038
1221.9 557556038 558012352 559608154 561705780 562288818 561899872 560752296 558346214 555796700 553823853
1230.6 553823853 552657585 553034935 554787025 557014313 558581581 558654709 557220459 554769516 552498932
$$ packed form
1169.8E35879974m4593O17446Q37746J691933L968773M349708M080467L886910K616043
1178.5E57884407J043434l96766m46587N48286J084214K160301L591156L723907K502060
1187.2E71694412R69353j65176j422921j811943j222343K33764J673203J997795K135162
1195.9E74081306J473389j85547j955604k962990k858887j796112p37648L94402K191581
1204.5E67643890K246895L15857j229744k198334k537002k110214j458664n25170Q53768
1213.2E61001282K027435K046776R34410j47934j366577k461548k436714j659393l81699
1221.9E57556038M56314J595802K097626N83038l88946j147576k406082k549514j972847
1230.6E53823853j166268L77350J752090K227288J567268P3128j434250k450943k270584
$$ plain form
1239.3 552498932 551047897 550716019 551855316 553483734 555096016 556500397 556641121 555262337 552808723
1247.9 552808723 550243721 548747177 548618507 549350128 550943222 553121185 554727516 555023689 553977966
1256.6 553977966 552060852 550100899 548720474 548239059 549142151 551338959 554186897 556700897 557772217
1265.3 557772217 556920624 555308189 553602638 552525520 552955894 554688911 557463913 560443497 562833939
1274 562833939 564200287 564403992 563190346 561734467 561233330 561371765 562629967 565010910 568078613
1282.7 568078613 571048241 572917175 573134651 571947365 570612373 569738464 570075531 571945076 574611740
1291.3 574611740 577452354 580075684 581252480 580560570 578930397 576682091 575259743 574924316 575398560
1300 575398560 577274857 579692497 581286964 581703911 580993004 579366035 577443314 575098457 573820229
$$ packed form
1239.3E52498932j451035l31878J139297J628418J612282J404381J40724j378784k453614
1247.9E52808723k565002j496544j28670P31621J593094K177963J606331K96173j045723
1256.6E53977966j917114j959953j380425m81415R03092K196808K847938K514000J071320
1265.3E57772217q51593j612435j705551j077118M30374J733017K775002K979584K390442
1274E62833939J366348K03705j213646j455879n01137J38435J258202K380943L067703
1282.7E68078613K969628J868934K17476j187286j334992q73909L37067J869545K666664
1291.3E74611740K840614K623330J176796o91910j630173k248306j422348l35427M74244
1300E75398560J876297K417640J594467M16947p10907j626969j922721k344857j278228
$$ plain form
1308.7 573820229 574177284 575552025 577164345 577784042 577957077 576832924 574587440 571926270 569688377
1317.4 569688377 569489098 570510674 572971611 575613174 577462921 578715286 578583183 577266960 575165329
1326 575165329 573814278 573509254 574003220 575463753 576879044 578094101 578280716 577139473 575118370
1334.7 575118370 572766151 570633202 569649544 569799843 570803719 573690453 576493645 577802963 577971001
1343.4 577971001 577081985 575915146 574658470 574137764 574769135 576142998 578455238 580437660 580923195
1352.1 580923195 580212669 578235664 575314865 573230400 572700233 573416824 574700775 576408844 577688141
1360.8 577688141 577875900 576774597 573862228 572741814 571399651 570174980 569929085 570130348 571894989
1369.4 571894989 573149910 573527985 572938347 571101685 567810059 566160202 566788521 566983032 568059349
$$ packed form
1308.7E73820229L57055J374741J612320O19697J73035j124153k245484k661170k237893
1317.4E69688377j99279J021576K460937K641563J849747J252365j32103j316223k101631
1326E75165329j351051l05024M93966J460533J415291J215057J86615j141243k021103
1334.7E75118370k352219k132949r83658J50299J003876K886734K803192J309318J68038
1343.4E77971001q89016j166839j256676n20706O31371J373863K312240J982422M85535
1352.1E80923195p10526j977005k920799k084465n30167P16591J283951J708069J279297
1360.8E77688141J87759j101303k912369j120414j342163j224671k45895K01263J764641
1369.4E71894989J254921L78075n89638j836662l291626j649857O28319J94511J076317
$$ plain form
1378.1 568059349 570016708 571609001 572399445 571460648 568743248 565322762 563095055 562235184 562267799
1386.8 562267799 563172989 565414124 567093086 566564407 565084724 562885132 560470619 556387444 552755203
1395.5 552755203 552990494 553776131 553754539 551820755 551418915 550996552 548408966 545470772 542715721
1404.2 542715721 539059677 537575302 538028145 538342133 538495407 537832146 536023674 534194183 531628571
1412.8 531628571 529159775 527499237 526790199 526685791 527404747 527963142 525044479 525590210 526125641
1421.5 526125641 524870186 523138924 520743256 522198410 524228592 525476227 527341995 528391647
1429.2 528391647 528503342 528087921 528102112 527410164 527312317 529075356 529741211 529347115 532729721 536558762
1438.9 536558762 538301239 538755798 538538589 538015366 539095955 539814186 541713104 544295731 545862846
$$ packed form
1378.1E68059349J957359J592293P90444r38797k717400l420486k227707q59871L2615
1386.8E62267799R05190K241135J678962n28679j479683k199592k414513m083175l632241
1395.5E52755203K35291P85637k1592j933784m01840m22363k587586k938194k755051
1404.2E42715721l656044j484375M52843L13988J53274o63261j808472j829491k565612
1412.8E31628571k468796j660538p09038j04408P18956N58395k918663N45731N35431
1421.5E26125641j255455j731262k395668J455154K030182J247635J865768J049652
1429.2E28391647J11695m15421J4191o91948r7847J763039O65855l94096L382606L829041
1438.9E36558762J742477M54559k17209n23223J080589P18231J898918K582627J567115
$$ plain form
1447.6 545862846 545947342 546975327 548370132 547946358 547734222 547820892 549132614 550064392 550076294 550989647
1457.2 550989647 551203804 556506729 558901901 560677185 561356812 561924591 563676109 562932472 566835861
1465.9 566835861 571020470 574412804 576586075 577645988 578792992 577637863 576955910 579609795
1473.6 579609795 585493774 589672737 592058144 595748291 598568764 599855804 599827614 599278908 599754486
1482.3 599754486 601836166 604242363 606194572 608462791 608863068 608268318 608661995 605076675 603515282
1491 603515282 605448685 606912270 607578278 608361092 608475342 604645271 606356697 605543289 601661301
1499.6 601661301 601258087 599723434 598838921 599528198 601751671 602274475 593573418 589211578 592351189
1508.3 592351189 593933220 592596893 593256454 592368431 592295609 594040108 593811836 593744087 591631241
$$ packed form
1447.6E45862846Q4496J027985J394805m23774k12136Q6670J311722R31778J1902R13353
1457.2E50989647K14157N302925K395172J775284O79627N67779J751518p43637L903389
1465.9E66835861M184609L392334K173271J059913J147004j155129o81953K653885
1473.6E79609795N883979M178963K385407L690147K820473J287040k8190n48706M75578
1482.3E99754486K081680K406197J952209K268219M00277n94750L93677l585320j561393
1491F03515282J933403J463585O66008P82814J14250l830071J711426q13408l881988
1499.6F01661301m03214j534653q84513O89277K223473N22804q701057m361840L139611
1508.3E92351189J582031j336327O59561q88023p2822J744499k28272o7749k112846
$$ plain form
1517 591631241 588937073 590461578 590945091 586757164 582411957 584983025 589223633 592381363 591401749
1525.7 591401749 591143875 590757103 589304123 589540863 589614983 589594421 589548264 588810387 588462944 591398277
1535.3 591398277 592861977 593027077 593527145 586496925 580094643 583707008 584122925 585370102 589806862
1544 589806862 590960503 589728851 591937981 591726189 591228180 589242783 588712158 591751137 593301392
1552.7 593301392 594978065 592583847 592614975 594651833 594907722 588527985 572805939 582443199 588102036
1561.4 588102036 591556664 592823677 592789459 589534912 587105904 586588326 584295616 581860352 575118523
1570 575118523 576839905 577723732 576459312 575447807 573697319 571884842 559071617 558980103 557918320
1578.7 557918320 555361633 553413582 550402260 549073067 545705681 543122749 538903656 534459877
$$ packed form
1517E91631241k694168J524505M83513m187927m345207K571068M240608L157730r79614
1525.7E91401749k57874l86772j452980K36740P4120k0562m6157p37877l47443K935333
1535.3E91398277J463700J65100N00068p030220o402282L612365M15917J247177M436760
1544E89806862J153641j231652K209130k11792m98009j985397n30625L038979J550255
1552.7E93301392J676673k394218L1128K036858K55889o379737j5722046R637260N658837
1561.4E88102036L454628J267013l4218l254547k429008n17578k292710k435264o741829
1570E75118523J721382Q83827j264420j011505j750488j812477j2813225r1514j061783
1578.7E57918320k556687j948051l011322j329193l367386k582932m219093m443779
$$ plain form
1586.4 534459877 530641823 526726151 524486351 520500107 518744850 515510445 513227386 509975281
1594.1 509975281 505396576 502764053 498536568 496567459 493256264 491911964 489725075 487397957
1601.9 487397957 486050835 482585678 481208496 478112488 476588326 473546410 471910553 470517273
1609.6 470517273 468164711 468882980 467102509 466759644 464434280 464043999 462724495 454464684 457415657
1618.2 457415657 457606316 458954086 458289070 459359856 458304596 453702927 455011368 454799957 455985031
1626.9 455985031 453880386 454920959 456197128 457162819 458124046 457617264 459281311 458374748 454587173
1635.6 454587173 453817291 456596947 458714409 460537415 462962189 463239746 465201454 465106773 466780968
1644.3 466780968 467886467 465536499 466322861 465824127 471504936 474154854 477611046 479894638 476064949
$$ packed form
1586.4E34459877l818054l915672k239800l986244j755257l234405k283059l252105
1594.1E09975281m578705k632523m227485j969109l311195j344300k186889k327118
1601.9D87397957j347122l465157j377182l096008j524162l041916j635857j393280
1609.6D70517273k352562P18269j780471l42865k325364l90281j319504q259811K950973
1618.2D57415657J90659J347770o65016J070786j055260m601669J308441k11411J185074
1626.9D55985031k104645J040573J276169R65691R61227n06782J664047r06563l787575
1635.6D54587173p69882K779656K117462J823006K424774K77557J961708r4681J674195
1644.3D66780968J105499k349968P86362m98734N680809K649918L456192K283592l829689
$$ plain form
1653 476064949 476587563 478236732 482314148 483886986 486774139 488665085 490612602 492654076 494505653
1661.6 494505653 496471367 495952301 499617233 501834526 504155006 506991043 509442635 511001892
1669.4 511001892 512030983 516098022 518093834 522016106 525253487 525884132 526987534 530661926
1677.1 530661926 535362511 538273354 540812225 542281837 546686478 551178246 550532875 548033867
1684.8 548033867 552565765 559944687 564032059 567055206 570453110 573091698 576967697 580051727
1692.5 580051727 582865219 585815659 588203812 586900558 593313332 600151634 604868774 604316902
1700.2 604316902 602157974 609216728 613497314 616096840 617733841 619560013 621860161 625830536
1707.9 625830536 630302162 631885185 632571220 634401512 635984650 637418823 636772118 637517242 641079025
$$ packed form
1653D76064949N22614J649169M077416J572838K887153J890946J947517K041474J851577
1661.6D94505653J965714n19066L664932K217293K320480K836037K451592J559257
1669.4E11001892J029091M067039J995812L922272L237381O30645J103402L674392
1677.1E30661926M700585K910843K538871J469612M404641M491768o45371k499008
1684.8E48033867M531898P378922M087372L023147L397904K638588L875999L084030
1692.5E80051727K813492K950440K388153j303254O412774O838302M717140n51872
1700.2F04316902k158928P058754M280586K599526J637001J826172K300148L970375
1707.9F25830536M471626J583023O86035J830292J583138J434173o46705P45124L561783
$$ plain form
1716.6 641079025 641921387 637816734 642448425 646206131 647859192 648622818 648565445 649640427 651679535
1725.3 651679535 653347321 654865952 656731720 658034821 655593796 655680161 659023361 660441895 656742477
1734 656742477 654310684 660717697 665307541 667576523 669893723 668239517 666966553 671235428 673496628
1742.7 673496628 673274155 675096512 679100494 682421951 684570007 685856323 686807938 690974045 691020279
1751.3 691020279 691800842 697190094 700710983 704183502 706491547 706023941 708479233 711225586 713364563
1760 713364563 715303421 713188324 714427185 718489990 720701294 722720261 724914474 725611801 723489380
1768.7 723489380 726079407 729033051 726731796 724070892 725140762 729980927 732182922 732458496
1776.4 732458496 735334320 735973969 736332932 735744171 734413452 736001358 738409042 740183487 739681702
$$ packed form
1716.6F41079025Q42362m104653M631691L757706J653061P63626n7373J074982K039108
1725.3F51679535J667786J518631J865768J303101k441025Q6365L343200J418534l699418
1734F56742477k431793O407013M589844K268982K317200j654206j272964M268875K261200
1742.7F73496628k22473J822357M003982L321457K148056J286316R51615M166107M6234
1751.3F91020279P80563N389252L520889L472519K308045m67606K455292K746353K138977
1760G13364563J938858k115097J238861M062805K211304K018967K194213O97327k122421
1768.7G23489380K590027K953644k301255k660904J069870M840165K201995K75574
1776.4G32458496K875824O39649L58963n88761j330719J587906K407684J774445n01785
$$ plain form
1785.1 739681702 740669250 742528839 742834473 742922821 743661652 743263626 742900162 741374741 742708969
1793.8 742708969 747196350 748013840 747459259 749237823 750663376 749355774 747470856 749384766 749535904
1802.4 749535904 751408997 754090118 754701614 755531082 755240021 754623795 754932632 755024185 753300323
1811.1 753300323 753992538 756700363 758480377 759647598 759582062 759695587 758738327 758607483 759349899
1819.8 759349899 759311523 760374603 760953293 762923508 764104843 761125259 761589813 763728333 764667435
1828.5 764667435 762224655 758139877 760906296 764341049 765285034 766130066 766916580 766916733 765871277
1837.2 765871277 764545441 765389938 765822678 766740799 767869873 769376297 768849030 763370361 766358414
1845.8 766358414 768156357 767255783 767073364 767910843 769241638 769938889 771412582 771945648 771975021
$$ packed form
1785.1G39681702R87548J859589L05634Q8348P38831l98026l63464j525421J334228
1793.8G42708969M487381Q17490n54581J778564J425553j307602j884918J913910J51138
1802.4G49535904J873093K681121O11496Q29468k91061o16226L08837R1553j723862
1811.1G53300323O92215K707825J780014J167221o5536J13525r57260j30844P42416
1819.8G59349899l8376J063080N78690J970215J181335k979584M64554K138520R39102
1828.5G64667435k442780m084778K766419L434753R43985Q45032P86514J53j045456
1837.2G65871277j325836Q44497M32740R18121J129074J506424n27267n478669K988053
1845.8G66358414J797943r00574j82419Q37479J330795O97251J473693N33066K9373
$$ plain form
1854.5 771975021 771483078 770425415 769717789 768941269 769483795 770130844 771492538 772361679 772716217
1863.2 772716217 773181992 773185806 773171768 771745148 770793839 768488007 768571930 771630630 773683090 775070114
1872.8 775070114 774920197 774811401 774248886 773488846 773208313 773341904 773719330 774064865 775607224
1881.5 775607224 776254959 776503525 775708389 774180069 773707199 773404465 774502869 774264832 773721924
1890.2 773721924 775625916 776897659 777221680 777222366 775789185 774236832 774901581 774917908 775362930 776366272
1899.8 776366272 776800690 777497635 777754822 777511063 776097336 775423431 775200348 774946442 775504303
1908.5 775504303 776126175 777132339 777843857 778787308 778320999 777346191 776524277 776216202 777078552
1917.2 777078552 775201569 775593414 777789383 778916397 779043274 776833725 776018524 776388779 776158524
$$ packed form
1854.5G71975021m91943j057663p07626p76520N42526O47049J361694Q69141L54538
1863.2G72716217M65775L814j4038j426620r51309k305832Q3923L058700K052460J387024
1872.8G75070114j49917j08796n62515p60040k80533J33591L77426L45535J542359
1881.5G75607224O47735K48566p95136j528320m72870l02734J098404k38037n42908
1890.2G73721924J903992J271743L24021O86j433181j552353O64749J6327M45022J003342
1899.8G76366272M34418O96945K57187k43759j413727o73905k23083k53906N57861
1908.5G75504303O21872J006164P11518R43451m66309r74808q21914l08075Q62350
1917.2G77078552j876983L91845K195969J127014J26877k209549q15201L70255k30255
$$ plain form
1925.9 776158524 775913544 776645203 777706070 778425980 779098663 779297791 778727570 777212143 776629639
1934.6 776629639 775942688 775636902 776602478 777499695 778667145 779076385 779430313 777862244 775250320
1943.2 775250320 775692139 775783081 775405884 775624542 776994400 778085785 778246689 777937622 777338104
1951.9 777338104 776767502 775937042 775513763 775024338 775372009 776649017 777942429 778706055 778343048
1960.6 778343048 777729797 776591034 775743332 775211334 775123978 775423813 775421906 776578293 777404251 777392654
1970.2 777392654 776929016 775923004 774850159 774556198 774974670 775417633 776353302 777062759 777572861
1978.9 777572861 777682114 777066650 775890198 774559784 774098663 774037781 774704666 775784836 776385422
1987.6 776385422 776278229 776467590 776750793 775096817 772908478 772699585 773706741 774374161 775051041
$$ packed form
1925.9G76158524k44980P31659J060867P19910O72683J99128n70221j515427n82504
1934.6G76629639o86951l05786R65576Q97217J167450M09240L53928j568069k611924
1943.2G75250320M41819R0942l77197K18658J369858J091385J60904l09067n99518
1951.9G77338104n70602q30460m23279m89425L47671J277008J293412P63626l63007
1960.6G78343048o13251j138763q47702n31998q7356K99835j907J156387Q25958j1597
1970.2G77392654m63638j006012j072845k93961M18472M42963R35669P09457N10102
1978.9G77572861J09253o15464j176452j330414m61121o0882O66885J080170O00586
1987.6G76385422j07193J89361K83203j653976k188339k08893J007156O67420O76880
$$ plain form
1996.3 775051041 775796585 775833740 775899811 775257645 774674530 773839035 772990265 773025131 772986145 773288498
2005.9 773288498 773934784 775108109 775347824 774410248 773238449 772203064 771994781 771803741 772314301
2014.6 772314301 773150711 773515320 773613586 773869476 773682861 772452698 771385040 770204391 769895172
2023.3 769895172 770394974 771368561 772727127 773119125 773063049 772411194 771452789 770272598 769584885
2032 769584885 769482346 769705505 770749359 771235580 771505585 771352539 770699997 769994888 768926697 767771683
2041.6 767771683 767642975 768591080 769005051 769923325 770580750 770599976 770409317 769217758 768355103 767290497
2051.2 767290497 767039566 767771606 768727036 769650726 770017853 770333176 769496536 768593521 767630386 766768570
2060.9 766768570 766665039 766679001 767654419 768637238 769104004 768982468 768644791 767820511 766455460 765485611
$$ packed form
1996.3G75051041P45544L7155O6071o42166n83115q35495q48770L4866l8986L02353
2005.9G73288498O46286J173325K39715r37576j171799j035385k08283j91040N10560
2014.6G72314301Q36410L64609R8266K55890j86615j230163j067658j180649l09219
2023.3G69895172M99802R73587J358566L91998n6076o51855r58405j180191o87713
2032G69584885j02539K23159J043854M86221K70005j53046o52542p05109j068191j155014
2041.6G67771683j28708R48105M13971R18274O57425J9226j90659j191559q62655j064606
2051.2G67290497k50931P32040R55430R23690L67127L15323q36640r03015r63135q61816
2060.9G66768570j03531J3962R75418R82819M66766j21536l37677q24280j365051r69849
$$ plain form
2070.5 765485611 765230331 766089249 766682053 767621384 768562469 768551483 767992706 766782303 765958633 765166321
2080.2 765166321 764907532 765108566 765988464 767373734 768132782 768445435 767515335 766436996 765025482
2088.9 765025482 763708801 763621597 764083786 765167999 766293106 767279053 767121964 766337433 765280228
2097.5 765280228 763932114 763134537 762717361 763353882 764254303 765138550 765493088 765485153 765562820 764692078
2107.2 764692078 763479614 762354660 762239761 762643890 763459778 764636993 765279617 765453720 764524078
2115.9 764524078 763476868 762205734 761223297 761188202 761760483 762941742 763865814 764528198 764272156
2124.5 764272156 763792572 762945328 761570816 760899658 760870438 761565475 762124939 762884293 763602753 763860855
2134.2 763860855 763304825 761888809 761113434 760566864 760560226 761100693 762158127 763279800 763729782
$$ packed form
2070.5G65485611k55280Q58918N92804R39331R41085j0986n58777j210403q23670p92312
2080.2G65166321k58789K01034Q79898J385270P59048L12653r30100j078339j411514
2088.9G65025482j316681q7204M62189J084213J125107R85947j57089p84531j057205
2097.5G65280228j348114p97577m17176O36521R00421Q84247L54538p935P7667q70742
2107.2G64692078j212464j124954j14899M04129Q15888J177215O42624J74103r29642
2115.9G64524078j047210j271134r82437l5095N72281J181259R24072O62384k56042
2124.5G64272156m79584q47244j374512o71158k9220O95037N59464P59354P18460K58102
2134.2G63860855n56030j416016p75375n46570o638N40467J057434J121673M49982
$$ plain form
2142.9 763729782 763477936 762765350 762844849 762177887 761065292 760624237 760818710 761784210 762765427 763672104
2152.5 763672104 763554687 763170166 762408524 761215439 760460052 760350037 761371002 762136383 762822495
2161.2 762822495 763163528 763523865 763825150 762781906 761447449 760591202 760858765 761147385 762059937
2169.9 762059937 763158875 763355942 763853455 763528214 762571640 761356430 760730896 760575104 760902634
2178.5 760902634 762235489 763188858 764322662 764632950 763909149 762803879 761853256 761649399 761672516
2187.2 761672516 762300110 762761917 763469620 763942032 764134674 764194260 763004379 761860809 761064301
2195.9 761064301 760993729 761422729 762249985 763513184 764683228 765338898 764482803 763401718 762338791
2204.6 762338791 761470795 761168289 761602631 763015900 764262238 765222626 765460815 765358047 764535217
$$ packed form
2142.9G63729782k51846p12586P9499o66962j112595m41055J94473R65500R81217R06677
2152.5G63672104j17417l84521p61642j193085p55387j10015J020965P65381O86112
2161.2G62822495L41033L60337L01285j043244j334457q56247K67563K88620R12552
2169.9G62059937J098938J97067M97513l25241r56574j215210o25534j55792L27530
2178.5G60902634J332855R53369J133804L10288p23801j105270r50623k03857K3117
2187.2G61672516O27594M61807P07703M72412J92642N9586j189881j143570p96508
2195.9G61064301p0572M29000Q27256J263199J170044O55670q56095j081085j062927
2204.6G62338791q67996l02506M34342J413269J246338R60388K38189j02768q22830
$$ plain form
2213.3 764535217 762808304 761562805 761306610 761897812 762658844 763927307 765020905 765786667 765777969
2221.9 765777969 764301224 762646179 761648483 761764145 762085190 762836609 763766708 764542999 765207596
2230.6 765207596 764823685 764058685 762886429 762140198 761742783 761876984 763012161 764014435 764914780
2239.3 764914780 765333481 765417709 764173965 762609177 762085953 761733932 761898346 762404175 763857803
2248 763857803 765074844 765259705 764576035 763330765 762537231 761576691 761368790 761678314 762432709 763801727
2257.6 763801727 764901276 764987488 764167328 763852768 762768478 761752853 761486511 761354446 762149734
2266.3 762149734 763419342 764829712 765345764 765047989 764156570 763202438 762161407 760998230 761067200
2275 761067200 761815186 763222885 764232559 764622879 764649048 763869095 762559357 760851364 760646973
$$ packed form
2213.3G64535217j726913j245499k56195N91202P61032J268463J093598P65762q698
2221.9G65777969j476745j655045r97696J15662L21045P51419R30099P76291O64597
2230.6G65207596l83911p65000j172256p46231l97415J34201J135177J002274R00345
2239.3G64914780M18701Q4228j243744j564788n23224l52021J64414N05829J453628
2248G63857803J217041J84861o83670j245270p93534r60540k07901L09524P54395J369018
2257.6G63801727J099549Q6212q20160l14560j084290j015625k66342j32065P95288
2266.3G62149734J269608J410370N16052k97775q91419r54132j041031j163177O8970
2275G61067200P47986J407699J009674L90320K6169p79953j309738j707993k04391
$$ plain form
2283.7 760646973 761036301 761833725 763147354 763737793 764403458 764540939 763888855 762514572 761406479
2292.3 761406479 760736847 760745926 761863632 762873611 764240494 765133591 765241547 764367981 762619400
2301 762619400 761652298 760981903 761086884 762254333 764008331 765396347 766237030 766072464 764812088
2309.7 764812088 764141541 762906265 761813583 761751938 762736664 764615173 765835876 766941071 767593155
2318.4 767593155 767464142 766823883 765072403 763989716 764577255 765253143 766164932 768118210 770113983
2327.1 770113983 770757980 769004364 767856674 767450409 765685120 764913559 765450058 766671906 767294922
2335.7 767294922 768039627 769040146 768433685 766973190 765639954 765606766 766780090 767829590 767843018
2344.4 767843018 768151321 768674469 766511154 763633652 763323898 763984528 764073486 764999161 766278610
$$ packed form
2283.7G60646973L89328P97424J313629N90439O65665J37481o52084j374283j108093
2292.3G61406479o69632R079J117706J009979J366883Q93097J07956q73566j748581
2301G62619400r67102o70395J04981J167449J753998J388016Q40683j64566j260376
2309.7G64812088o70547j235276j092682o1645R84726J878509J220703J105195O52084
2318.4G67593155j29013o40259j751480j082687N87539O75888R11789J953278J995773
2327.1G70113983O43997j753616j147690m06265j765289p71561N36499J221848O23016
2335.7G67294922P44705J000519o06461j460495j333236l3188J173324J049500J3428
2344.4G67843018L08303N23148k163315k877502l09754O60630Q8958R25675J279449
$$ plain form
2353.1 766278610 768418884 770651016 772131424 773359985 772007523 771110382 768639374 766814270
2360.8 766814270 767454224 768369370 770402222 769550934 768988724 769578857 768630753 765403061 763004227
2369.5 763004227 763039627 762339630 761731796 761229477 761928177 762324600 761495209 760813904 759283981 757483902
2379.1 757483902 755132523 753774185 754322205 755489807 756257858 756296616 756574631 755908737 754234619
2387.8 754234619 752569656 751647644 751557388 751721191 753011932 754569473 755367661 755135651 754256439
2396.5 754256439 752897720 751320190 750589676 750169144 750514908 751598282 752684250 753241577 753126678
2405.2 753126678 752800140 751648788 750194855 748941879 748190918 748358459 749494781 751026764 751936722
2413.8 751936722 751975174 751090775 749843369 748198929 746940613 746657867 747253036 748555984 749400330
$$ packed form
2353.1G66278610K140274K232132J480408J228561j352462q97141k471008j825104
2360.8G66814270O39954R15146K032852q51288n62210N90133r48104l227692k398834
2369.5G63004227L5400o99997o07834n02319O98700L96423q29391o81305j529923j800079
2379.1G57483902k351379j358338N48020J167602P68051L8758K78015o65894j674118
2387.8G54234619j664963r22012r0256J63803J290741J557541P98188k32010q79212
2396.5G54256439j358719j577530p30514m20532L45764J083374J085968N57327j14899
2405.2G53126678l26538j151352j453933j252976p50961J67541J136322J531983R09958
2413.8G51936722L8452q84399j247406j644440j258316k82746N95169J302948Q44346
$$ plain form
2422.5 749400330 749941559 749949646 749442215 748080215 746359177 745408630 744627762 744980392 746098633
2431.2 746098633 747153702 747887955 748108215 747811050 746636353 745349197 743838654 743013840 743286438
2439.9 743286438 744373474 745722046 746092224 746269989 745829697 744573059 743054199 741931000 741583633
2448.6 741583633 741567459 742157516 742891235 743640823 743906937 743484344 742613678 741289444 739973831
2457.2 739973831 739160080 739270020 739443359 740085449 741229095 741739731 741373596 740182648 738888779
2465.9 738888779 737733231 737022705 736839905 737448730 738431091 739553757 740405273 739411163 737951584
2474.6 737951584 736708069 735501556 734697418 734553528 735312958 736046219 736689682 736943970 736635284
2483.3 736635284 735366058 733726578 732643738 731950531 732037964 732218246 733065262 733910904 733903198 733650894
$$ packed form
2422.5G49400330N41229Q087n07431j362000j721038r50547p80868L52630J118241
2431.2G46098633J055069P34253K20260k97165j174697j287156j510543q24814K72598
2439.9G43286438J087036J348572L70178J77765m40292j256638j518860j123199l47367
2448.6G41583633j6174N90057P33719P49588K66114m22593q70666j324234j315613
2457.2G39973831q13751J09940J73339O42090J143646N10636l66135j190948j293869
2465.9G38888779j155548p10526j82800O08825R82361J122666Q51516r94110j459579
2474.6G37951584j243515j206513q04138j43890P59430P33261O43463K54288l08686
2483.3G36635284j269226j639480j082840o93207Q7433J80282Q47016Q45642p706k52304
$$ plain form
2492.9 733650894 732582550 731373825 730181885 729256592 728773346 729059677 730247879 731300278 731805038
2501.6 731805038 731214371 730142288 729032364 728086548 727067795 726202774 726504822 727284317 728053894
2510.3 728053894 728229599 727917709 726964035 725449448 724184799 723193970 722934952 723160782 724155197
2519 724155197 725478516 726078186 725663223 724757767 723838425 722204285 720975189 720685196 721007462
2527.6 721007462 721547241 722095566 722708511 722851334 722350388 720764771 719684525 719015121 718359833
2536.3 718359833 718656464 719247055 720390701 720978851 720747375 719844513 718322830 717033081 716186447
2545 716186447 716063538 716082306 716713333 717191086 717622604 718106155 717322845 716179428 714887924 714078827
2554.6 714078827 713405991 713180847 713524857 713916855 715044708 715336761 714888916 713657837 712321777
$$ packed form
2492.9G33650894j068344j208725j191940r25293m83246K86331J188202J052399N04760
2501.6G31805038n90667j072083j109924r45816j018753q65021L02048P79495P69577
2510.3G28053894J75705l11890r53674j514587j264649r90829k59018K25830R94415
2519G24155197J323319N99670m14963r05456r19342j634140j229096k89993L22266
2527.6G21007462N39779N48325O12945J42823n00946j585617j080246o69404o55288
2536.3G18359833K96631N90591J143646N88150k31476r02862j521683j289749q46634
2545G16186447j22909J8768O31027M77753M31518M83551p83310j143417j291504q09097
2554.6G14078827o72836k25144L44010L91998J127853K92053m47845j231079j336060
$$ plain form
2563.3 712321777 711748199 711127548 711314240 711937637 712704544 712983704 712697754 712080765 711007767
2572 711007767 710084000 709115601 708587265 708501740 709040298 709459686 709622498 709889297 709288864 708406906
2581.6 708406906 707153244 706376114 705953903 705586548 706455994 707348175 707606354 707562790 707450180 706377716
2591.3 706377716 704631958 703671799 703384781 703491592 703789062 704373550 704658813 704798355 704561310
2600 704561310 703343353 702018661 701130829 700587006 700168991 700550613 701206436 702023621 702413788 701406631
2609.6 701406631 700510788 699491730 698299713 697435074 697290344 697776031 698156815 698550797 698537979
2618.3 698537979 698385010 697437897 696326370 695659714 694498672 693969650 694302979 694985352 695128860
2627 695128860 694751663 694418716 693765564 692730637 691624451 691038513 690621872 690837097 691342545 691630554
$$ packed form
2563.3G12321777n73578o20651J86692O23397P66907K79160k85950o16989j072998
2572G11007767r23767r68399n28336q5525N38558M19388J62812K66799o00433q81958
2581.6G08406906j253662p77130m22211l67355Q69446Q92181K58179m3564j12610j072464
2591.3G06377716j745758r60159k87018J06811K97470N84488K85263J39542k37045
2600G04561310j217957j324692q87832n43823m18015L81622O55823Q17185L90167j007157
2609.6G01406631q95843j019058j192017q64639j44730M85687L80784L93982j2818
2618.3F98537979j52969r47113j111527o66656j161042n29022L33329O82373J43508
2627F95128860l77197l32947o53152j034927j106186n85938m16641K15225N05448K88009
$$ plain form
2636.6 691630554 691754227 691111069 690487213 689517212 688368988 687828751 687707748 687902603 688250504
2645.3 688250504 688616714 688269272 687551346 686635361 685381699 684278412 683793793 683847504 684393311
2654 684393311 685462646 685507736 684981079 684400940 683501511 682850342 681889191 680935974 680566177 680978012
2663.6 680978012 681341705 681748886 682238693 681569214 680687180 679908676 679406052 679020386 678854904 679293671
2673.3 679293671 679226837 679294281 679430847 679028549 678361282 677570572 676738892 676053772 676075134 676094742
2682.9 676094742 676017838 676388321 676794968 676551666 675735703 674742661 673586044 672936020 672771301 673138580
2692.5 673138580 673863373 674041672 673742294 673143387 672561569 672022476 671329880 670774307 670545273 670549622
2702.2 670549622 671014404 671570969 671620941 671414413 670544815 669366989 668462143 667846069 667754898 667894363
$$ packed form
2636.6F91630554J23673o43158o23856r70001j148224n40237j21003J94855L47901
2645.3F88250504L66210l47442p17926r15985j253662j103287m84619N3711N45807
2654F84393311J069335M5090n26657n80139q99429o51169r61151r53217l69797M11835
2663.6F80978012L63693M07181M89807o69479q82034p78504n02624l85666j65482M38767
2673.3F79293671o6834O7444J36566m02298o67267p90710q31680o85120K1362J9608
2682.9F76094742p6904L70483M06647k43302q15963r93042j156617o50024j64719L67279
2692.5F73138580P24793J78299k99378n98907n81818n39093o92596n55573k29034M349
2702.2F70549622M64782N56565M9972k06528q69598j177826r04846o16074r1171J39465
$$ plain form
2711.8 667894363 668279648 668600845 668642044 668309708 667384567 666520462 665851440 665195770 665273056 665914764
2721.5 665914764 666382294 667016220 667139435 666516800 665573807 664385376 663778381 663363113 663242645
2730.2 663242645 663581009 664028854 664589615 664354019 663697662 663169632 662530136 662006836 661795197 661694260
2739.8 661694260 661786041 662161484 662206879 662311249 662395477 661584625 660530548 660090256 659812241 659591293
2749.4 659591293 659941025 660362015 660489044 660402069 660302963 659636307 658427658 658092041 658391724 658681335
2759.1 658681335 658628540 658571091 658859177 658620453 657982407 657485962 656679230 655643311 655540543 655763550
2768.7 655763550 655727158 656077499 656514130 656436844 655866318 655663300 654780197 653383865 653167343 653411713
2778.4 653411713 653530807 653369522 653377762 653296204 652871323 652127380 651051331 650703812 650331268 650015106
$$ packed form
2711.8F67894363L85285L21197M1199l32336r25141q64105o69022o55670P7286O41708
2721.5F65914764M67530O33926J23215o22635r42993j188431o06995m15268j20468
2730.2F63242645L38364M47845N60761k35596o56357n28030o39496n23300k11639j00937
2739.8F61694260R1781L75443M5395J04370Q4228q10852j054077m40292k78015k20948
2749.4F59591293L49732M20990J27029q6975r9106o66656j208649l35617K99683K89611
2759.1F58681335n2795n7449K88086k38724o38046m96445q06732j035919j02768K23007
2768.7F55763550l6392L50341M36631p7286n70526k03018q83103j396332k16522K44370
2778.4F53411713J19094j61285Q240q1558m24881p43943j076049l47519l72544l16162
$$ plain form
2788 650015106 650409164 651083145 651301346 650616531 650058365 649238281 648166275 647463455 647075806 647078018
2797.7 647078018 647113113 646948318 646437378 646214828 645993195 645136871 644086151 643154221 642382812 641878815
2807.3 641878815 642148361 642503738 642225571 641342545 640233765 639471741 638824501 638147888 637559586
2816 637559586 637284203 637065544 637061996 637166290 636378059 635284500 634727249 633892555 632449150 631688995
2825.6 631688995 631365852 630955086 630605736 630122719 629799843 628957825 627741356 626596222 625711403
2834.3 625711403 624896088 623625679 622966766 622521858 622077827 621674538 620308266 618260460 616072998
2843 616072998 613988457 612005234 610614700 609725609 608808670 607278175 605149078 603633804 602165718
2851.7 602165718 600418015 599023514 598431969 598711891 599125824 599576187 600087891 600353279 599803200
$$ packed form
2788F50015106L94058O73981K18201o84815n58166q20084j072006p02820l87649K212
2797.7F47078018L5095j64795n10940k22550k21633q56324j050720r31930p71409n03997
2807.3F41878815K69546L55377k78167q83026j108780p62024o47240o76613n88302
2816F37559586k75383k18659l548J04294p88231j093559n57251q34694j443405p60155
2825.6F31688995l23143m10766l49350m83017l22876q42018j216469j145134q84819
2834.3F25711403q15315j270409o58913m44908m44031m03289j366272k047806k187462
2843F16072998k084541j983223j390534q89091r16939j530495k129097j515274j468086
2851.7F02165718j747703j394501n91545K79922M13933M50363N11704K65388n50079
$$ plain form
2860.3 599803200 598823738 598153877 597872925 597777634 597624245 597590485 597724190 597823906 597016411 596040421
2870 596040421 595441055 594616737 594136887 593307266 592630234 592809486 593159065 593358917 593009071 592494926
2879.6 592494926 591516342 590241203 589416008 588997612 588852310 588911171 588811111 587932739 587128792 586451874
2889.3 586451874 585262184 583908691 582816620 582182274 581542778 581181335 580823135 580155296 579660721
2897.9 579660721 578992195 578133545 576830254 575288277 574598045 574618721 574785385 574837952 574393387 573813133
2907.6 573813133 572999916 571487083 569741745 567876549 566602287 565990982 565252380 564244385 563001823
2916.3 563001823 562117996 560795326 558840485 557416878 556352997 555431900 554737549 554267464 554050140
2925 554050140 554546700 555166588 555219154 555161285 554594460 553691216 553250237 553660240 554714050 555610313
$$ packed form
2860.3E99803200r79462o69861k80952r5291j53389l3760J33705R9716q07495r75990
2870E96040421n99366q24318m79850q29621o77032J79252L49579J99852l49846n14145
2879.6E92494926r78584j275139q25195m18396j45302N8861j00060q78372q03947o76918
2889.3E86451874j189690j353493j092071o34346o39496l61443l58200o67839m94575
2897.9E79660721o68526q58650j303291j541977o90232K0676J66664N2567m44565n80254
2907.6E73813133q13217j512833j745338j865196j274262o11305p38602j007995j242562
2916.3E63001823q83827j322670j954841j423607j063881r21097o94351m70085k17324
2925E54050140M96560O19888N2566n7869n66825r03244m40979M10003J053810Q96263
$$ plain form
2934.6 555610313 556337776 557250786 557692413 557748795 558432045 559040184 559634857 560956192 562164345
2943.3 562164345 562739906 563105354 563732224 564190636 563886795 563361282 563874588 564807396 565647278 566941948
2952.9 566941948 567285881 567256279 567737045 567619514 567118111 566657219 566746254 567329903 568025208 569142227
2962.6 569142227 570217628 570980606 571982231 572654381 572465477 572237167 572441940 573019066 573746567
2971.2 573746567 575023155 576722946 577722359 578201218 578812866 579036598 578621254 578880463 579510422
2979.9 579510422 579547386 579796906 580688324 581758919 582178955 582029266 581538277 580915413 580456238 580413322
2989.6 580413322 581027184 581541672 582223473 582865601 582738495 582251816 581976700 581752892 580861855 580346832
2999.2 580346832 580310173 580285530 580512810 580602646 580276375 579045906 578109627 577694168 577128372 576873245
$$ packed form
2934.6E55610313P27463R13010M41627N6382O83250O08139N94673J321335J208153
2943.3E62164345N75561L65448O26870M58412l03841n25513N13306R32808Q39882J294670
2952.9E66941948L43933k9602M80766j17531n01403m60892Q9035N83649O95305J117019
2962.6E69142227J075401P62978J001625O72150j88904k28310K04773N77126P27501
2971.2E73746567J276588J699791R99413M78859O11648K23732m15344K59209O29959
2979.9E79510422L6964K49520Q91418J070595M20036j49689m90989o22864m59175m2916
2989.6E80413322O13862N14488O81801O42128j27106m86679k75116k23808q91037n15023
2999.2E80346832l6659k4643K27280Q9836l26271j230469r36279m15459n65796k55127
$$ plain form
3008.8 576873245 576522903 576515732 576892471 576722069 576181374 575803185 575134163 573878479 572828140 572403221
3018.5 572403221 572149544 571966057 572477303 572952347 572703781 571976051 570831909 569603691 568484001
3027.2 568484001 567539520 566691093 566922340 567692795 567390785 566856079 566064720 564785118 563396454
3035.9 563396454 562359123 561933022 561434212 561211891 561702766 562056198 561567421 560826683 559994736
3044.5 559994736 558593750 557028122 556176987 556159363 556343803 556630135 556549187 555877838 554851074
3053.2 554851074 553686676 552809601 551824265 550797310 550154266 549997368 549916840 549686356 549615669 549320297
3062.9 549320297 548074570 546097984 545226631 545053291 544594994 544363136 544273758 544378891 543918266
3071.5 543918266 543037758 542531509 541870728 540829620 539881020 539507561 539813766 540219536 539749603
$$ packed form
3008.8E76873245l50342p171L76739j70402n40695l78189o69022j255684j050339m24919
3018.5E72403221k53677j83487N11246M75044k48566p27730j144142j228218j119690
3027.2E68484001r44481q48427K31247P70455l02010n34706p91359j279602j388664
3035.9E63396454j037331m26101m98810k22321M90875L53432m88777p40738q31947
3044.5E59994736j400986j565628q51135j7624J84440K86332q0948o71349j026764
3053.2E54851074j164398q77075r85336j026955o43044j56898q0528k30484p0687k95372
3062.9E49320297j245727j976586q71353j73340m58297k31858q9378J05133m60625
3071.5E43918266q80508n06249o60781j041108r48600l73459L06205M05770m69933
$$ plain form
3080.2 539749603 539203987 538832588 538074341 537131348 535883102 534968567 534307022 533911133 533927765 534189110
3089.9 534189110 534178963 533158760 531961975 530942116 530561714 530002937 528721390 528132210 528406906
3098.5 528406906 528903122 528127823 527395973 527223206 525949554 524568977 524037209 524184647 523935623
3107.2 523935623 523610687 523299789 522656021 522356033 521805420 520895767 519839020 518956947 518068123
3115.9 518068123 517583885 517874603 517830963 517461510 516807899 516047363 514894905 513552818 512565918
3124.6 512565918 511765862 511655197 511724052 511925011 511700974 510579834 509449348 508152199 506595573
3133.3 506595573 505517273 505416489 505274239 504889526 504931030 504858589 504051590 503109703 502698555 501670303
3142.9 501670303 500657158 500050011 499059143 498591919 498263016 497779922 497187195 496375694 495747910
$$ packed form
3080.2E39749603n45616l71399p58247r42993j248246r14535o61545l95889J6632K61345
3089.9E34189110j0147j020203j196785j019859l80402n58777j281547n89180K74696
3098.5E28406906M96216p75299p31850j72767j273652j380577n31768J47438k49024
3107.2E23935623l24936l10898o43768k99988n50613r09653j056747q82073q88824
3115.9E18068123m84238K90718m3640l69453o53611p60536j152458j342087r86900
3124.6E12565918q00056j10665O8855K00959k24037j121140j130486j297149j556626
3133.3E06595573j078300j00784j42250l84713M1504p2441q06999r41887m11148j028252
3142.9E01670303j013145o07147r90868m67224l28903m83094n92727q11501o27784
$$ plain form
3151.6 495747910 494742966 493602104 493217850 492813110 492013779 491577644 491228027 490886917 490232086
3160.3 490232086 488853188 487281914 486102295 485799484 485836906 485762062 485267830 484585457 483946304
3168.9 483946304 482948303 482133026 481135864 479917831 479090042 478608971 478515396 478328819 477419586 476414337
3178.6 476414337 476137962 475453110 474398842 473416252 472246361 471864204 472020340 471659279 470828590
3187.3 470828590 470393829 469896088 468820610 467837639 466919746 466312370 465833054 465480385 465208206
3195.9 465208206 464627914 463972969 463203506 462444420 461612129 460876961 460299835 459763565 459127235 458555336
3205.6 458555336 458594208 458602600 457731476 456110802 455255165 454710312 453992424 454102097 453604774 452953949
3215.2 452953949 452911301 452264977 451355095 450962296 450362282 449176331 448757133 448235512 447384987 447426491
$$ packed form
3151.6D95747910j004944j140862l84254m04740p99331m36135l49617l41110o54831
3160.3D90232086j378898j571274j179619l02811L7422p4844m94232o82373o39153
3168.9D83946304r98001q15277r97162j218033q27789m81071r3575j86577r09233j005249
3178.6D76414337k76375o84852j054268r82590j169891l82157J56136l61061q30689
3187.3D70828590m34761m97741j075478r82971r17893o07376m79316l52669k72179
3195.9D65208206n80292o54945p69463p59086q32291p35168n77126n36270o36330n71899
3205.6D58555336L8872Q392q71124j620674q55637n44853p17888J09673m97323o50825
3215.2D52953949m2648o46324r09882l92799o00014j185951m19198n21621q50525M1504
$$ plain form
3224.9 447426491 447423172 446791039 445804253 445058212 444455452 443877602 443321304 442158966 441353607 441862869
3234.5 441862869 442251816 441485481 440360756 439227791 438443413 438184662 438285751 438358116 437782974
3243.2 437782974 437167282 436420021 435958939 435801888 435051613 434333420 433183746 431931190 431909027
3251.9 431909027 432403221 432439117 432118225 431573524 430664711 429782715 429442291 429016762 428029633 427911682
3261.5 427911682 428074303 427466164 427129593 426845131 426384964 425491447 424717178 424318237 423738899 423773003
3271.2 423773003 423858719 423480759 422968636 423042374 423071251 421939316 421217422 420633774 419776382 419681015
3280.8 419681015 419844742 419815102 419678154 419410706 418892403 418319931 417770119 416942978 416120987 416127663
3290.4 416127663 416537361 416539154 416579132 416520309 416214371 415942459 415281105 414140434 413300552 413091011
$$ packed form
3224.9D47426491l319o32133r86786p46041o02760n77850n56298j162338q05359N09262
3234.5D41862869L88947p66335j124725j132965p84378k58751J01089P2365n75142
3243.2D37782974o15692p47261m61082j57051p50275p18193j149674j252556k2163
3251.9D31909027M94194L5896l20892n44701r08813q81996l40424m25529r87129j17951
3261.5D27911682J62621o08139l36571k84462m60167q93517p74269l98941n79338L4104
3271.2D23773003Q5716l77960n12123P3738K8877j131935p21894n83648q57392r5367
3280.8D19681015J63727k9640j36948k67448n18303n72472n49812q27141q21991O676
3290.4D16127663M09698J793L9978n8823l05938k71912o61354j140671q39882k09541
$$ plain form
3300.1 413091011 413298645 413094139 412518463 413058281 413387413 412364693 411347847 410897522 410673027
3308.8 410673027 410094299 410049171 410192184 409683189 409557266 409584045 409009857 407950478 406935005 405951843
3318.4 405951843 405698776 406358109 406468353 406250076 405959854 405320015 404547577 403596764 402509270
3327.1 402509270 401662254 401009941 400129547 399702797 399775620 399612808 399046860 398344879 397904091 397289696
3336.7 397289696 396196747 394956627 394123421 393972549 394173927 394187813 393601837 392970276 392672310
3345.4 392672310 391850662 390692596 390193176 389727936 389341507 389183769 388718872 388410950 388331947 388329010
3355.1 388329010 387272110 385931625 386020508 385960808 385552826 385431175 385197029 384852448 384572830 384118462
3364.7 384118462 383340225 383065758 383001823 382686920 382304840 381703072 381008987 380745544 380778618 380349579
$$ packed form
3300.1D13091011K07634k04506n75676N39818L29132j022720j016846m50325k24495
3308.8D10673027n78728m5128J43013n08995j25923K6779n74188j059379j015473r83162
3318.4D05951843k53067O59333J10244k18277k90222o39839p72438r50813j087494
3327.1D02509270q47016o52313q80394m26750P2823j62812n65948p01981m40788o14395
3336.7C97289696j092949j240120q33206j50872K01378J3886n85976o31561k97966
3345.4C92672310q21648j158066m99420m65240l86429j57738m64897l07922p9003k937
3355.1C88329010j056900j340485Q8883n9700m07982j21651k34146l44581k79618m54368
3364.7C84118462p78237k74467o3935l14903l82080o01768o94085k63443L3074m29039
$$ plain form
3374.3 380349579 379838181 379565582 379137115 378605347 378701897 378901672 378536377 378758202 378871498 378133698
3384 378133698 377126846 375973816 375554962 376034966 376244125 375981598 376159019 376459160 376019249 374725266
3393.6 374725266 373934212 373993759 373859673 373773842 373751335 374369125 374957581 374362488 373679771 373086624
3403.3 373086624 372887001 372927475 373227768 373286476 372694016 373111801 373534393 373137512 372814674 372757912
3412.9 372757912 372767143 372547951 372569046 372791328 372814445 372701759 372565880 372225571 372340889 372737808
3422.6 372737808 372472191 372175407 372028160 372226257 372848930 373425789 373660316 373882370 374528008 374678612
3432.2 374678612 374347305 374132767 374263306 374560928 374579239 374702187 375444260 376002655 375966415 376510925
3441.8 376510925 376347427 375610123 375933647 376677704 377398071 377050743 377572861 379070435 379635696
$$ packed form
3374.3C80349579n11398k72599m28467n31768R6550J99775l65295K21825J13296p37800
3384C78133698j006852j153030m18854M80004K09159k62527J77421L00141m39911j293983
3393.6C74725266p91054N9547j34086q5831k2507O17790N88456n95093o82717n93147
3403.3C73086624j99623M0474L00293N8708n92460M17785M22592l96881l22838n6762
3412.9C72757912R231k19192K1095K22282K3117j12686j35879l40309J15318L96919
3422.6C72737808k65617k96784j47247J98097O22673N76859K34527K22054O45638J50604
3432.2C74678612l31307k14538J30539K97622J8311J22948P42073N58395l6240N44510
3441.8C76510925j63498p37304L23524P44057P20367l47328N22118J497574N65261
$$ plain form
3450.5 379635696 379904556 379678535 379342346 379394684 379868774 380461197 380642281 381341629 382352257 382643318
3460.2 382643318 382738037 383488808 384011459 384182739 384801865 386009293 387177696 387477798 387736435
3468.8 387736435 387896004 388198242 388759460 389091492 389809113 390172310 390400581 391193199 392242012
3477.5 392242012 393518639 394181633 394036789 394358978 394679298 394313202 395185165 396537933 397193871
3486.2 397193871 398024712 398683357 399082184 399697800 400516624 401181374 401703568 402349815 403140335 403877487
3495.8 403877487 404594383 405502548 406299324 407092743 407821312 408972626 409799271 409495430 409490776 409956169
3505.5 409956169 410996704 411702538 412495651 413128395 413226395 414819832 416024895 416903763 418076935
3514.2 418076935 418613701 418997536 419484978 420162697 420310364 420748291 421941261 423602448 424658546
$$ packed form
3450.5C79635696K68860k26021l36189N2338M74090N92423J81084O99348J010628K91061
3460.2C82643318R4719P50771N22651J71280O19126J207428J168403L00102K58637
3468.8C87736435J59569L02238N61218L32032P17621L63197K28271P92618J048813
3477.5C92242012J276627O62994j44844L22189L20320l66096Q71963J352768O55938
3486.2C97193871Q30841O58645L98827O15616Q18824O64750N22194O46247P90520P37152
3495.8D03877487P16896R08165P96776P93419P28569J151314Q26645l03841m654M65393
3505.5D09956169J040535P05834P93113O32744R8000J593437J205063Q78868J173172
3514.2D18076935N36766L83835M87442O77719J47667M37927J192970J661187J056098
$$ plain form
3522.9 424658546 424447136 425393982 426787186 427839165 428565292 429097176 429900627 431143379 431844749
3531.5 431844749 432042389 433358955 434646072 435970688 436499786 436955910 438529854 438775368 439615059
3540.2 439615059 440736656 441390457 442816200 444453354 445526085 446001205 447276039 447692986 448867340
3548.9 448867340 450698395 451949196 452504349 452062263 454052696 455673790 457237473 459237595 459998856
3557.6 459998856 461243057 462223434 462552490 462205391 463951416 465360336 466206970 470172462 470238457
3566.2 470238457 469754410 470389900 470745468 474458771 476627846 477756920 479113388 480852394 482095261
3574.9 482095261 483638878 485378723 485599823 487721786 489289589 490067787 492032928 494195480 495594635
3583.6 495594635 496318817 499711380 500217438 498022575 499715385 500816078 504218521 507382050 510333862
$$ packed form
3522.9D24658546k11410R46846J393204J051979P26127N31884Q03451J242752P01370
3531.5D31844749J97640J316566J287117J324616N29098M56124J573944K45514Q39691
3540.2D39615059J121597O53801J425743J637154J072731M75120J274834M16947J174354
3548.9D48867340J831055J250801N55153m42086J990433J621094J563683K000122P61261
3557.6D59998856J244201R80377L29056l47099J746025J408920Q46634L965492O5995
3566.2D70238457m84047O35490L55568L713303K169075J129074J356468J739006J242867
3574.9D82095261J543617J739845K21100K121963J567803P78198J965141K162552J399155
3583.6D95594635P24182L392563N06058k194863J692810J100693L402443L163529K951812
$$ plain form
3592.3 510333862 510821304 510835686 513909187 513410873 515584450 518138618 518603973 521788597 523168106
3601 523168106 524358521 526703796 528759918 531373062 534656029 536283264 534071045 536361008 536624870
3609.6 536624870 537689018 544145241 544834023 544521294 548276863 548095818 552014503 555873489 554747124
3618.3 554747124 554625473 554780273 557388687 561912079 565596428 568228188 570898590 572072716 573349533
3627 573349533 579030876 577402000 568826370 575348969 581809654 587393188 589048347 587985344 590343018
3635.7 590343018 593827362 596462097 596830482 598196144 600732155 603363609 605727921 607407532
3643.4 607407532 609686241 612787704 617575951 616267624 614811668 621546974 620407219 617373466
3651.1 617373466 619054108 625251999 629984131 633715820 637123146 629195023 632631226 638799324
$$ packed form
3592.3E10333862M87442J4382L073501m98314K173577K554168M65355L184624J379509
3601E23168106J190415K345275K056122K613144L282967J627235k212219K289963K63862
3609.6E36624870J064148O456223O88782l12729L755569j81045L918685L858986j126365
3618.3E54747124j21651J54800K608414M523392L684349K631760K670402J174126J276817
3627E73349533N681343j628876q575630O522599O460685N583534J655159j063003K357674
3635.7E90343018L484344K634735L68385J365662K536011K631454K364312J679611
3643.4F07407532K278709L101463M788247j308327j455956O735306j139755l033753
3651.1F17373466J680642O197891M732132L731689L407326p928123L436203O168098
$$ plain form
3658.8 638799324 639945908 641556702 642692795 644985886 646721725 648507385 650272598 651182098
3666.5 651182098 655256958 656395187 654100800 654720764 650785599 654647064 663124084 670825043
3674.3 670825043 667245560 650451736 655482178 663821182 667957458 665927734 667153168 670654144
3682 670654144 672629776 673523178 674203110 675746384 680063324 685258636 674983597 671971130 678753052
3690.6 678753052 673673401 675932617 681298599 682008820 683509979 683646545 683673325 684696121 684902115
3699.3 684902115 687426758 689807892 685149231 684371414 688780289 689375992 689354858 690520859 693261261
3708 693261261 696417618 689503403 692964478 696382370 683013535 687367477 692383041 692960815 693902588
3716.7 693902588 696857986 698691635 695637741 696815414 702391663 697829819 693126144 698559113
$$ packed form
3658.8F38799324J146584J610794J136093K293091J735839J785660J765213R09500
3666.5F51182098M074860J138229k294387O19964l935165L861465Q477020P700959
3674.3F70825043l579483j6793824N030442Q339004M136276k029724J225434L500976
3682F70654144J975632Q93402O79932J543274M316940N195312j0275039l012467O781922
3690.6F78753052n079651K259216N365982P10221J501159J36566K6780J022796K05994
3699.3F84902115K524643K381134m658661p77817M408875N95703k1134J166001K740402
3708F93261261L156357o914215L461075L417892j3368835M353942N015564N77774R41773
3716.7F93902588K955398J833649l053894J177673N576249m561844m703675N432969
$$ plain form
3724.4 698559113 698824615 696564102 694357376 696730423 701061249 701492844 706380920 703631592 696742783
3733.1 696742783 703703918 700114670 691301193 694956131 698173294 699421539 702777634 705513153
3740.8 705513153 702399368 705139694 713300018 696673126 684416809 697766266 704485168 709167938
3748.5 709167938 705580063 696249390 706944809 700677261 694349365 700975723 705407715 708284225
3756.2 708284225 703354492 705950089 711252823 703163986 702108994 706167221 707483978 707715912
3763.9 707715912 709473343 706519623 703838730 707374954 711494370 710992813 702548065 704685822
3771.7 704685822 708482895 708888168 708980637 708817215 710740509 711828384 713821945 712515869 704902344
3780.3 704902344 707574692 710047226 711007462 711873245 708024673 707710571 710001526 711538086 711729507
$$ packed form
3724.4F98559113K65502k260513k206726K373047M330826M31595M888076k749328o888809
3733.1F96742783O961135l589248q813477L654938L217163J248245L356095K735519
3740.8G05513153l113785K740326Q160324j6626892j2256317J3349457O718902M682770
3748.5G09167938l587875r330673J0695419o267548o327896O626358M431992K876510
3756.2G08284225m929733K595597N302734q088837j054992M058227J316757K31934
3763.9G07715912J757431k953720k680893L536224M119416n01557q444748K137757
3771.7G04685822L797073M05273R2469j63422J923294J087875J993561j306076p613525
3780.3G04902344K672348K472534R60236Q65783l848572l14102K290955J536560J91421
$$ plain form
3789 711729507 711051254 711510696 711542435 712022476 712053604 712890625 714905014 711209946 708600464 710726852
3798.7 710726852 714442520 719492874 711933212 702321320 706745148 709626465 713785400 718242798
3806.4 718242798 707457581 704849930 711032257 713059921 712707367 712748947 712984390 714145126 718314438
3815.1 718314438 715008087 703838348 709833755 714662018 718213425 719727859 703783188 705306396
3822.8 705306396 710259628 712627029 715219803 714484634 710664368 711821671 713621140 716161118
3830.5 716161118 716707916 708060455 711059265 718022919 712887497 712910843 720017471 710253067 706462631
3839.2 706462631 713182373 707540970 709345932 716363907 713709946 710965729 714156113 715559616
3846.9 715559616 715600967 717193146 715696640 716276932 719750748 714067841 714618301 698346558 702059555
$$ packed form
3789G11729507o78253M59442L1739M80041L1128Q37021K014389l695068k609482K126388
3798.7G10726852L715668N050354p559662r611892M423828K881317M158935M457398
3806.4G18242798j0785217k607651O182327K027664l52554M1580K35443J160736M169312
3815.1G18314438l306351j1169739N995407M828263L551407J514434j5944671J523208
3822.8G05306396M953232K367401K592774p35169l820266J157303J799469K539978
3830.5G16161118N46798q647461K998810O963654n135422K3346P106628r764404l790436
3839.2G06462631O719742n641403J804962P017975k653961k744217L190384J403503
3846.9G15559616M1351J592179j496506N80292L473816n682907N50460j6271743L712997
$$ plain form
3855.6 702059555 712422028 712096024 711478424 713756714 715293045 716784363 712292404 712517166 718040085
3864.2 718040085 712649536 708723221 713431549 718718643 723308563 713072433 704507294 708958435
3871.9 708958435 714917374 716792526 707767792 710405121 714896317 715357742 717447891 720385132
3879.7 720385132 712915955 706731949 712863159 714037704 715995483 719315643 706901550 709736710
3887.4 709736710 714114304 714636002 718062668 715866318 707765961 710714264 714653015 713455048
3895.1 713455048 714377747 715605621 717649231 717646866 708895874 714153442 715178757 709682770 713937454
3903.8 713937454 710769196 709410477 710667419 711700897 713878784 713747559 713560181 713473969 713842850
3912.5 713842850 713601532 713094025 714992142 716714172 713271637 710499420 714090500 713329697 710585937
$$ packed form
3855.6G02059555J0362473l26004o17600K278290J536331J491318m491959K24762N522919
3864.2G18040085n390549l926315M708328N287094M589920j0236130q565139M451141
3871.9G08958435N958939J875152r024734K637329M491196M61425K090149K937241
3879.7G20385132p469177o184006O131210J174545J957779L320160j2414093K835160
3887.4G09736710M377594N21698L426666k196350q100357K948303L938751j197967
3895.1G13455048R22699J227874K043610k365q750992N257568J025315n495987M254684
3903.8G13937454l168258j358719J256942J033478K177887j31225j87378q6212L68881
3912.5G13842850k41318n07507J898117J722030l442535k772217L591080p60803k743760
$$ plain form
3921.1 710585937 714004593 715118713 715029984 712736435 710519257 713014069 713872299 714004974 712624359
3929.8 712624359 712409134 714703674 712236252 711246872 712812881 712819138 712988663 713333206 712636948
3938.5 712636948 712278595 712933807 714031982 714448471 711101913 711306610 713598557 713808060 714057312
3947.2 714057312 712409668 712844315 712613068 710887451 712703629 713116531 713040314 713214569 713353729
3955.8 713353729 713058929 711658859 712189941 712720413 713451843 713191071 711408463 712046967 712697601
3964.5 712697601 712079163 712232819 713116150 713172684 712661743 712697601 713435745 713578644 713153915 713177185
3974.2 713177185 712387543 711639786 711480255 711795425 712068024 712052002 712724152 713081589 713315887 713388062
3983.8 713388062 713358841 712992020 712216339 712057724 711852341 712263412 712571259 712190933 711991425 712252808
$$ packed form
3921.1G10585937L418656J114120q8729k293549k217178K494812Q58230J32675j380615
3929.8G12624359k15225K294540k467422r89380J566009O257J69525L44543o96258
3938.5G12636948l58353O55212J098175M16489l346558K04697K291947K09503K49252
3947.2G14057312j647644M34647k31247j725617J816178M12902p6217J74255J39160
3955.8G13353729k94800j400070N31082N30472P31430k60772j782608O38504O50634
3964.5G12697601o18438J53656Q83331N6534n10941L5858P38144J42899m24729K3270
3974.2G13177185p89642p47757j59531L15170K72599j6022O72150L57437K34298P2175
3983.8G13388062k9221l66821p75681j58615k05383M11071L07847l80326j99508K61383
$$ plain form
3993.5 712252808 712949677 712685242 712221146 712116394 711858673 711599655 711956558
4000.2 711956558
$$ packed form
3993.5G12252808O96869k64435m64096j04752k57721k59018L56903
4000.2G11956558
##END=$$ End of the data block
