##TITLE=$$ Begin of the data block
##JCAMP-DX=5.00 $$ ACD/SpecManager v 10.08
##SPECTROMETER/DATA SYSTEM=Varian
##DATE=08 Jan 2013 15:30:42
##DATA TYPE=INFRARED SPECTRUM
##DATA CLASS=XYDATA
##ORIGIN=
##OWNER=
##NPOINTS=3735
##FIRSTX=399.26403809
##LASTX=4000.35498047
##MAXX=4000.35498047
##MINX=399.26403809
##MAXY=78.26025391
##MINY=36.88385391
##XFACTOR=1.0000000000
##YFACTOR=0.000000100000000
##FIRSTY=56.35851288
##DELTAX=0.96440572
##XUNITS=1/CM
##YUNITS=TRANSMITTANCE
##XYDATA=(X++(Y..Y))
$$ plain form
399.3 563585129 553960342 538481560 543651276 539885902 540377121 550613632 557708168 560381241
407 560381241 558578224 557955170 549617882 544212303 545442848 547433968 555422821 559300652 561423073
415.7 561423073 557919464 542563362 532479744 541548233 542995834 546555214 548289948 544456902
423.4 544456902 544419518 553266602 562702065 560639839 555087852 551658783 549050827 548452339 546222839
432.1 546222839 547703896 551844864 554639893 561220970 562089500 554651222 550360832 553050232 554531059
440.7 554531059 553160744 555208549 555080185 555221558 555368881 554510384 551438293 547538986 552055092
449.4 552055092 557472305 555858345 552791824 552785530 554196510 553411865 554740944 555620499 549494286
458.1 549494286 548744049 549839249 552995529 556883659 557144623 560064926 561482239 553762474 545481453
$$ packed form
399.3E63585129r624787j5478782N169716l765374M91219J0236511P094536K673073
407E60381241j803017o23054q337288n405579J230545J991120P988853L877831K122421
415.7E61423073l503609j5356102j0083618R068489J447601L559380J734734l833046
423.4E44456902l7384Q847084R435463k062226n551987l429069k607956n98488k229500
432.1E46222839J481057M140968K795029O581077Q68530p438278m290390K689400J480827
440.7E54531059j370315K047805j28364J41373J47323q58497l072091l899307M516106
449.4E52055092N417213j613960l066521o294J410980p84645J329079Q79555o126213
458.1E49494286p50237J095200L156280L888130K60964K920303J417313p719765q281021
$$ plain form
466.8 545481453 542385483 543219452 544650688 546169319 545236244 544496880 549164658 548930473 547870445
475.5 547870445 545623894 539969940 540051193 541454506 540378075 541883926 546043777 548600578 545222740
484.1 545222740 545434341 547615852 543940811 541764565 541147957 541932869 545654602 547572327 547490005
492.8 547490005 546652298 545024033 543718719 543503113 544225235 544353676 545657616 546325035 544654274
501.5 544654274 545113068 546329117 543849564 541322060 543800163 544793472 542458916 541695633 541711197
510.2 541711197 543260651 542141037 541346931 541972084 539356880 538521156 538097954 538730927 540396080
518.9 540396080 539793930 540857201 540469780 538309898 537837105 537899895 534712944 532563477 537608643
527.5 537608643 541187439 541105614 538359451 535496445 536299324 535367432 532839279 532025490 532158661
$$ packed form
466.8E45481453l095970Q33969J431236J518631r33075p39364M667778k34185j060028
475.5E47870445k246551n653954Q1253J403313j076431J505851M159851K556801l377838
484.1E45222740K11601K181511l675041k176246o16608P84912L721733J917725q2322
492.8E47490005q37707j628265j305314k15606P22122J28441J303940O67419j670761
501.5E44654274M58794J216049k479553k527504K478103R93309k334556p63283J5564
510.2E41711197J549454j119614p94106O25153k615204q35724m23202O32973J665153
518.9E40396080o02150J063271l87421k159882m72793O2790l186951k149467N045166
527.5E37608643L578796q1825k746163k863006Q02879r31892k528153q13789J33171
$$ plain form
536.2 532158661 533539734 534934998 535521240 535251274 534505806 533639412 532669029 531742287 531688881 532791481
545.9 532791481 534286461 534797401 532882729 530928383 531349449 531691322 529611473 528283386 527947426
554.5 527947426 527935753 530977936 532106628 531422768 530306129 527294273 526162949 525805855 527234039
563.2 527234039 529001122 529674187 531391220 531701431 531734924 530924149 529860573 530237465 528970337
571.9 528970337 528293762 528867836 529621887 530988007 531857071 531851120 530324097 528658180 528029594 527349358
581.5 527349358 527487450 528429947 530119400 532430916 532432785 530554810 529673271 530420341 530339470 528781128
591.2 528781128 529005737 530124054 529958153 529421768 529615173 530103722 529620438 529270515 530003090 531284676
600.8 531284676 531646576 530738716 529457855 528562546 528488655 528393097 528144226 527272263 526367874 525544815
$$ packed form
536.2E32158661J381073J395264N86242k69966p45468q66394r70383r26742n3406J102600
545.9E32791481J494980N10940j914672j954346M21066L41873k079849j328087l35960
554.5E27947426j1673L042183J128692o83860j116639l011856j131324l57094J428184
563.2E27234039J767083O73065J717033L10211L3493q10775j063576L76892j267128
571.9E28970337o76575N74074P54051J366120Q69064n951j527023j665917o28586o80236
581.5E27349358J38092R42497J689453K311516J869j877975q81539P47070q0871j558342
591.2E28781128K24609J118317j65901n36385J93405M88549m83284l49923P32575J281586
600.8E31284676L61900r07860j280861q95309p3891r5558k48871q71963r04389q23059
$$ plain form
610.5 525544815 524795761 526453590 526983566 525872765 525831909 525690880 526528587 526641617 525845451 526451988
620.1 526451988 527091866 527051888 527560844 528729935 528721695 528859520 529940300 530714111 532232399 533112907
629.8 533112907 534411812 536878128 537578278 538202972 539431190 540650902 541759605 542018242 541937866
638.4 541937866 542008171 543016319 544666634 546624870 547051239 546312370 546880493 547653160 549007874
647.1 549007874 550302200 551459846 552773132 552944603 553118210 553406334 553954315 554067802 552997665
655.8 552997665 552153625 552336922 553346367 553796539 552663651 551796074 552282104 552015343 551325951
664.5 551325951 552718773 555604477 557664566 553373413 553262711 554152145 554032478 553834648 554148254
673.2 554148254 555715218 556899948 557971115 559652596 560704384 561407204 562538109 562701607 560999718
$$ packed form
610.5E25544815p49054J657829N29976j110801m0856j41029Q37707J13030p96166O06537
620.1E26451988O39878l9978N08956J169091q240J37825J080780P73811J518288Q80508
629.8E33112907J298905K466316P00150O24694J228218J219712J108703K58637q0376
638.4E41937866P0305J008148J650315J958236M26369p38869N68123P72667J354714
647.1E49007874J294326J157646J313286J71471J73607K88124N47981J13487j070137
655.8E52997665q44040J83297J009445M50172j132888q67577M86030k66761o89392
664.5E51325951J392822K885704K060089m291153j10702Q89434j19667j97830L13606
673.2E54148254J566964J184730J071167J681481J051788P02820J130905J63498j701889
$$ plain form
681.8 560999718 560353851 562526093 565179825 566144562 566416435 566672211 566779747 567184334 567315216
690.5 567315216 567405396 567618637 568340874 569601059 570032425 569613495 569613342 570887947 571848526 571538696
700.2 571538696 571094894 571035957 571285782 572018051 573209419 574221191 574815063 574743462 574499016 574816284
709.8 574816284 575649071 576385193 576190720 576284294 577788506 579837074 580455933 579290619 578862572
718.5 578862572 579562607 579634628 579455414 580784760 583486900 585477409 586116867 587063675 588340988
727.2 588340988 588345909 587123032 586628456 587881012 588917503 590083885 591710205 592699051 594274597
735.8 594274597 594753456 593590775 593881874 594690552 593491974 593358078 595558472 596665535 597396202
744.5 597396202 598222237 597721024 597289925 598562050 600025253 600576706 601422653 602672081 603776016
$$ packed form
681.8E60999718o45867K172242K653732R64737K71873K55776J07536M04587J30882
690.5E67315216R0180K13241P22237J260185M31366m18930j53J274605R60579l09830
700.2E71538696m43802n8937K49825P32269J191368J011772N93872p1601k44446L17268
709.8E74816284Q32787P36122j94473R3574J504212K048568O18859j165314m28047
718.5E78862572P00035P2021j79214J329346K702140J990509O39458R46808J277313
727.2E88340988M921j222877m94576J252556J036491J166382J626320R88846J575546
735.8E94274597M78859j162681K91099Q08678j198578j33896K200394J107063P30667
744.5E97396202Q26035n01213m31099J272125J463203N51453Q45947J249428J103935
$$ plain form
753.2 603776016 603838310 604485435 605581970 605990410 606386223 605534782 605745811 607594910 609926682
761.9 609926682 611442184 611359253 612605934 613220253 612018890 611147690 611723824 612176552 611985893
770.6 611985893 613247070 614267807 614932442 615329971 614614906 613107338 612027321 612302208 612940331
779.2 612940331 614384079 615871468 617378311 618369751 618069649 617166443 615853119 616033363 616841087
787.9 616841087 617602158 618846817 620293045 620954666 621094170 622003021 621171303 619611206 619145699
796.6 619145699 619893608 621109581 621002274 620905800 620935059 620807762 620574493 619431076 616687393 613982735
806.2 613982735 612624321 612572784 613722115 614227142 615085373 615307579 613202324 610611801 608107185
814.9 608107185 606615944 606586266 606902847 606915817 607784271 608872604 609563293 609735641 609066124 609490814
$$ packed form
753.2F03776016O2294O47125J096535M08440L95813q51441K11029J849099K331772
761.9F09926682J515502q2931J246681O14319j201363q71200N76134M52728j90659
770.6F11985893J261177J020737O64635L97529p15065j507568j080017K74887O38123
779.2F12940331J443748J487389J506843R91440l00102r03206j313324J80244Q07724
787.9F16841087P61071J244659J446228O61621J39504R08851q31718j560097m65507
796.6F19145699P47909J215973j07307r6474K9259j27297k33269j143417k743683k704658
806.2F13982735j358414n1537J149331N05027Q58231K22206k105255k590523k504616
814.9F08107185j491241k9678L16581J2970Q68454J088333O90689J72348o69517M24690
$$ plain form
824.6 609490814 609978142 611214943 613316460 615723953 620280991 624078636 625827522 626204071 626023216
833.3 626023216 626128311 627638855 630382690 632541809 635177040 637618217 639886932 641040955 640870285
841.9 640870285 640712204 640379105 641294632 642243958 643628845 646069183 648366928 650508728 652208939
850.6 652208939 652226181 650640030 649680328 648424301 648841553 652186584 656192398 659445801 661006088
859.3 661006088 661482391 660315399 658991470 657988968 657812805 658758621 660224686 662134323 662806931
868 662806931 662634125 660998535 658729248 655407410 651958542 650435867 650189896 652192612 653616333
876.7 653616333 654576492 654941788 653558426 652137604 650569687 649138870 647284241 647662430 649844894
885.3 649844894 651375580 651628418 651307449 651227264 648915100 646754913 644876099 644241180 645632629
$$ packed form
824.6F09490814M87328J236801K101517K407493M557038L797645J748886L76549j80855
833.3F26023216J05095J510544K743835K159119K635231K441177K268715J154023j70670
841.9F40870285j58081l33099R15527R49326J384887K440338K297745K141800J700211
850.6F52208939J7242j586151r59702j256027M17252L345031M005814L253403J560287
859.3F61006088M76303j166992j323929j002502j76163R45816J466065J909637O72608
868F62806931j72806j635590k269287l321838l448868j522675k45971K002716J423721
876.7F53616333R60159L65296j383362j420822j567917j430817j854629L78189K182464
885.3F49844894J530686K52838l20969q0185k312164k160187j878814o34919J391449
$$ plain form
894 645632629 647045212 649299088 650351715 651371536 651338272 648952484 646621857 644853516 643331528
902.7 643331528 642290802 643672256 645785141 648810577 651718750 652361221 652092133 650814590 650459595
911.4 650459595 650163345 650623627 652524185 653678284 654375153 653954926 652095184 648325806 644440994
920 644440994 642104034 640480804 639125595 638695869 638457146 636981239 635153770 632103043 627734070
928.7 627734070 623441582 620146599 617879295 616795120 617249870 618284340 619567184 619905434 619246750
937.4 619246750 617347908 614318199 612285080 611471901 611946144 612639046 613782158 614745941 614327164
946.1 614327164 613337555 611035652 608865280 607347298 606726265 608022575 610090141 611563072 611637917
954.8 611637917 610937881 608940048 605225525 601300888 598920555 597713242 597118568 596721001 596189423
$$ packed form
894F45632629J412583K253876J052627J019821l3264k385788k330627j768341j521988
902.7F43331528j040726J381454K112885L025436K908173O42471k69088j277543l54995
911.4F50459595k96250M60282J900558J154099O96869m20227j859742l769378l884812
920F44440994k336960j623230j355209m29726k38723j475907j827469l050727m368973
928.7F27734070m292488l294983k267304j084175M54750J034470J282844L38250o58684
937.4F19246750j898842l029709k033119q13179M74243O92902J143112R63783m18777
946.1F14327164r89609k301903k170372j517982o21033J296310K067566J472931P4845
954.8F11637917p00036j997833l714523l924637k380333j207313n94674l97567n31578
$$ plain form
963.4 596189423 596647987 596284142 594035416 590619011 586974792 584074173 582000809 581917915 582405548
972.1 582405548 582727470 582693825 580621643 577291031 573338661 569286156 565434418 561799812 559308090
980.8 559308090 558009720 556553307 554448547 551413078 547294846 542595444 537531967 533248940
988.5 533248940 530461197 528876610 527692490 526066895 524048500 522467079 520425682 517119141
996.2 517119141 513321686 509470558 506823273 505082893 504266014 504555511 504241371 502724495 500046806
1004.9 500046806 496521835 492878647 490145035 488387947 487712440 487379150 486589394 486179276 485278816
1013.6 485278816 482774048 478977509 475982361 473175735 469700661 467220612 466050606 466392441
1021.3 466392441 465910263 463784485 460430565 457115211 454823570 452580376 451237068 450629883 451590614
$$ packed form
963.4E96189423M58564l63845k248726l416405l644219k900619k073364q2894M87633
972.1E82405548L21922l3645k072182l330612l952370m052505l851738l634606k491722
980.8E59308090j298370j456413k104760l035469m118232m699402n063477m283027
988.5E33248940k787743j584587j184120j625595k018395j581421k041397l306541
996.2E17119141l797455l851128k647285j740380q16879K89497l14140j516876k677689
1004.9E00046806l524971l643188k733612j757088o75507l33290p89756m10118r00460
1013.6D85278816k504768l796539k995148k806626l475074k480049j170006L41835
1021.3D66392441m82178k125778l353920l315354k291641k243194j343308o07185R60731
$$ plain form
1030 451590614 452775459 453602066 454299126 454507217 454206543 452224922 451448212 451756477 453681984
1038.7 453681984 457363434 460639305 463661842 465079308 465468597 464478302 462667122 460399017 458520355
1047.4 458520355 458905754 459525299 460227203 460526009 459814301 457518311 455303726 453811798 451323853
1056 451323853 449413795 448624878 449982758 451617737 453243294 455219917 457309532 459769592 459943581
1064.7 459943581 459507256 459588585 460958252 463269958 466033096 469258385 470439949 470114059 468810463
1073.4 468810463 467310944 466042519 465948753 467081413 468595047 469714737 469314880 469910545 469968948
1082.1 469968948 469223976 467321091 464639931 464417915 465111580 467719841 470770950 473541489 475495682
1090.7 475495682 475881653 476254654 475297508 474188919 474061432 475983009 478608513 480935669 483741455
$$ packed form
1030D51590614J184845Q26607O97060K08091l00674j981621p76710L08265J925507
1038.7D53681984L681450L275871L022537J417466L89289r90295j811180k268105j878662
1047.4D58520355L85399O19545P01904K98806p11708k295990k214585j491928k487945
1056D51323853j910058p88917J357880J634979J625557J976623K089615K460060J73989
1064.7D59943581m36325Q1329J369667K311706K763138L225289J181564l25890j303596
1073.4D68810463j499519j268425r3766J132660J513634J119690l99857N95665N8403
1082.1D69968948p44972j902885k681160k22016O93665K608261L051109K770539J954193
1090.7D75495682L85971L73001r57146j108589j27487J921577K625504K327156K805786
$$ plain form
1099.4 483741455 486042061 487880058 488443871 487949791 486522255 486541138 488124161 489776344 492374268
1108.1 492374268 494238892 495812759 495987549 494817619 493691025 492879295 493551979 494490509 495896606
1116.8 495896606 498047409 500664558 502080498 502190094 501418114 499312019 497531738 496032372 496343613
1125.5 496343613 498354111 501368484 504958534 507112923 508209724 508281136 507956238 507107315 507556801
1134.1 507556801 510127869 512964287 516842384 520514832 522967987 524067268 523708115 522586784
1141.9 522586784 521328583 520896492 521590118 523228302 525531807 528175087 529664688 530149117 529475060
1150.5 529475060 527116623 524899979 523582344 523996925 525291939 526430550 527933121 528598175 527926102
1159.2 527926102 526397629 524150505 521459846 520198021 520846024 522722664 526123047 529684334
$$ packed form
1099.4D83741455K300606J837997N63813m94080j427536J8883J583023J652183K597924
1108.1D92374268J864624J573867J74790j169930j126594q11730O72684R38530J406097
1116.8D95896606K150803K617149J415940J09596p71980k106095j780281j499366L11241
1125.5D96343613K010498L014373L590050K154389J096801P1412l24898q48923M49486
1134.1E07556801K571068K836418L878097L672448K453155J099281l59153j121331
1141.9E22586784j258201m32091O93626J638184K303505K643280J489601M84429o74057
1150.5E29475060k358437k216644j317635M14581J295014J138611J502571O65054o72073
1159.2E27926102j528473k247124k690659j261825O48003J876640L400383L561287
$$ plain form
1166.9 529684334 532935867 535342827 536014366 535776482 536223183 537323608 538999825 542107277 546212234
1175.6 546212234 550984459 555190849 557682533 558911285 559010429 558551140 558843422 559736137 562110176
1184.3 562110176 566178856 569598198 571831703 573259735 573260918 571380234 569437790 568407249 568616753
1193 568616753 570219727 572290993 574495049 575501099 575370102 574037590 571238289 568295746 565662346
1201.6 565662346 564426231 565250664 567502480 569404449 569699516 569125290 567586479 565579414 563315887
1210.3 563315887 561076927 560661659 561816635 563427849 565134201 566311378 566542015 565379333 562943192
1219 562943192 560193253 558060150 557500534 558221474 559835739 561829834 562781258 562593727 561183968
1227.7 561183968 558596039 556021118 553966331 553108673 553772888 555416756 557659683 559141884 559036713
$$ packed form
1166.9E29684334L251533K406960O71539k37884M46701J100425J676217L107452M104957
1175.6E46212234M772225M206390K491684J228752R9144m59289K92282Q92715K374039
1184.3E62110176M068680L419342K233505J428032J183j880684j942444j030541K09504
1193E68616753J602974K071266K204056J006050j30997j332512k799301k942543k633400
1201.6E65662346j236115Q24433K251816J901969K95067n74226j538811k007065k263527
1210.3E63315887k238960m15268J154976J611214J706352J177177K30637j162682k436141
1219E62943192k749939k133103n59616P20940J614265J994095R51424j87531j409759
1227.7E61183968k587929k574921k054787q57658O64215J643868K242927J482201j05171
$$ plain form
1236.4 559036713 557829056 556063461 553817062 551780014 550997772 551638794 553556366 555651741 557112808
1245 557112808 557276649 555796509 553729057 551338921 549540710 549292145 550120583 551704865 553423615
1253.7 553423615 555128479 555654144 554352341 552775459 551122932 549145660 548269691 549492378 551691513
1262.4 551691513 554289284 556707649 558060684 557655373 555944519 554455833 553797379 553852615 555115166
1271.1 555115166 558010635 561364059 563862686 565159950 565209770 564031181 562631874 562026672 562185135
1279.8 562185135 563204155 565581360 568684654 571257133 573295441 574036713 572894173 571221428
1287.5 571221428 570453300 570834656 572249527 575159492 578197021 580424614 581508522 580910492 579427834
1296.2 579427834 577564201 576562347 576280174 576462326 577804260 580235291 582728653 583606110 582591133
$$ packed form
1236.4E59036713j207657j765595k246399k037048p82242O41022J917572K095375J461067
1245E57112808J63841j480140k067452k390136j798211k48565Q28438J584282J718750
1253.7E53423615J704864N25665j301803j576882j652527j977272q75969J222687K199135
1262.4E51691513K597771K418365J353035m05311j710854j488686o58454N5236J262551
1271.1E55115166K895469L353424K498627J297264M9820j178589j399307o05202J58463
1279.8E62185135J019020K377205L103294K572479K038308P41272j142540j672745
1287.5E71221428p68128L81356J414871K909965L037529K227593J083908n98030j482658
1296.2E79427834j863633j001854k82173J82152J341934K431031K493362Q77457j014977
$$ plain form
1304.8 582591133 580242348 577947540 575751457 574433327 574824486 576042595 577756081 578836060
1312.5 578836060 578732796 577228508 574801750 572555199 571064110 570853500 571463928 573490982 576351624
1321.2 576351624 578603249 579824371 579789543 578636093 576387634 574612923 574417953 575094337 576422768
1329.9 576422768 577896271 579023857 579424858 578322754 575879555 573296165 571282272 570624046 570499687
1338.6 570499687 571197777 573793449 576994629 579230843 579425316 578251915 576520729 575187492 575159187
1347.3 575159187 575703278 577289810 579405518 581081314 581666031 580812454 578936081 576132698 574218330
1355.9 574218330 573711586 574246635 575470848 577208290 578648224 578709068 577758293 575080833 573807411
1364.6 573807411 572355385 570808296 570564880 571006279 572917213 574421387 575001717 574596024 572870026
$$ packed form
1304.8E82591133k348785k294808k196083j318130L91159J218109J713486J079979
1312.5E78836060j03264j504288k426758k246551j491089k10610O10428K027054K860642
1321.2E76351624K251625J221122l4828j153450k248459j774711j94970O76384J328431
1329.9E76422768J473503J127586M01001j102104k443199k583390k013893o58226j24359
1338.6E70499687O98090K595672L201180K236214J94473j173401j731186j333237k8305
1347.3E75159187N44091J586532K115708J675796N84717q53577j876373k803383j914368
1355.9E74218330n06744N35049J224213J737442J439934O0844r50775k677460j273422
1364.6E73807411j452026j547089k43416M41399J910934J504174N80330m05693j725998
$$ plain form
1373.3 572870026 569397049 567323685 567809525 568140259 569080544 570865402 572782822 573760948 572731285
1382 572731285 570388374 567467651 565371056 564580193 564425011 564322968 565841713 567561874 567870102
1390.7 567870102 566851311 564610176 562495346 558113136 553939857 553912239 554296494 554695511 553316040
1399.3 553316040 552769585 552293053 549815331 546624374 543129807 539456825 538571091 539376984 539848976
1408 539848976 539916611 539469986 537643929 535295868 532518387 530285225 528787994 528060760 527920036
1416.7 527920036 528759766 529874268 526351357 526384544 527267723 525875626 524072952 522006607 523398895
1425.4 523398895 525284081 526189575 527822304 528846512 529178429 529169617 529211349 528294754 528063431 529730644
1435 529730644 530240860 530945740 534962502 538294067 539437027 539730682 539868927 539098206 539507790
$$ packed form
1373.3E72870026l472977k073364M85840L30734R40285J784858J917420R78126j029663
1382E72731285k342911k920723k096595p90863j55182j02043J518745J720161L08228
1390.7E67870102j018791k241135k114830m382210m173279k7618L84255L99017j379471
1399.3E53316040n46455m76532k477722l190957l494567l672982q85734Q05893M71992
1408E39848976O7635m46625j826057k348061k777481k233162j497231p27234j40724
1416.7E27920036Q39730J114502l522911L3187Q83179j392097j802674k066345J392288
1425.4E23398895J885186R05494J632729J024208L31917q812M1732r16595k31323J667213
1435E29730644N10216P04880M016762L331565J142960K93655J38245p70721M09584
$$ plain form
1443.7 539507790 540356216 542495880 545039673 546452026 546607895 548261833 549861298 548895950 548145943
1452.4 548145943 548579903 550549698 552301254 552854042 552756577 553034897 557969208 559812431 561396713
1461.1 561396713 562032280 563158188 565322495 564130630 567507858 571888390 575556107 577481232
1468.8 577481232 578589249 580144768 579247055 578339577 580378609 586739693 591117249 593169174 597084503
1477.5 597084503 599948997 601269836 601239853 600342026 600668373 602354584 604478264 606737442 609299316
1486.1 609299316 609895325 609443665 610438919 607280388 604461975 606179848 607719879 608616447 609828262
1494.8 609828262 609818764 605521507 607520294 606678123 602295914 601851120 600605621 599966812 600777893
1503.5 600777893 602981224 603009796 594836159 589789734 590946846 593127670 593229752 594603806 593560562
$$ packed form
1443.7E39507790Q48426K139664K543793J412353J55869J653938J599465r65348p50007
1452.4E48145943M33960J969795J751556N52788r7465K78320M934311J843223J584282
1461.1E61396713O35567J125908K164307j191865L377228M380532L667717J925125
1468.8E77481232J108017J555519q97713r07478K039032O361084M377556K051925L915329
1477.5E97084503K864494J320839k9983q97827L26347J686211K123680K259178K561874
1486.1F09299316N96009m51660R95254l158531k818413J717873J540031Q96568J211815
1494.8F09828262r498m297257J998787q42171m382209m44794j245499o38809Q11081
1503.5F00777893K203331K8572q173637n046425J157112K180824J02082J374054j043244
$$ plain form
1512.2 593560562 593347549 595341034 595438347 595588150 592309303 589070892 591612015 592782936 588349838
1520.8 588349838 583243790 585900459 590219040 593199654 591869087 592623863 592914352 590768623 591033669
1529.5 591033669 591556854 591638412 591549644 590228729 589226456 592867012 594754944 594665375 594873047
1538.2 594873047 587117271 579790459 585233765 587944260 588123589 590912437 592247581 591408081 593882904
1546.9 593882904 594098053 593484764 590905800 589738617 592751503 594561844 596191444 593253517 593830681
1555.6 593830681 596009521 595254250 586243591 569159775 582145805 588880463 592869110 594530411
1563.3 594530411 594617653 591444588 589054832 588712921 586179543 582757607 575549965 578026733 579451103
1572 579451103 578305321 576957130 574732132 572956200 560573807 560635986 560046692 557311935 554925537
$$ packed form
1512.2E93560562k13013J993485R7313J49803l278847l238411K541123J170921m433098
1520.8E88349838n106048K656669M318581K980614j330567P54776K90489k145729K65046
1529.5E91033669N23185Q1558q8768j320915j002273L640556J887932q9569K07672
1538.2E94873047p755776p326812N443306K710495J79329K788848J335144q39500K474823
1546.9E93882904K15149o13289k578964j167183L012886J810341J629600k937927N77164
1555.6E93830681K178840p55271r010659j7083816J2986030O734658L988647J661301
1563.3E94530411Q7242l173065k389756l41911k533378l421936p207642K476768J424370
1572E79451103j145782j348191k224998j775932j2382393O2179n89294k734757k386398
$$ plain form
1580.6 554925537 551719284 550401611 547113800 544069366 539692917 535890732 532116890 527659874
1588.4 527659874 525593224 521803780 519710045 516505203 514387703 511131172 506536140 503848953
1596.1 503848953 499479980 497116165 493325577 491596260 489065552 486962700 486054993 482622185
1603.8 482622185 481263924 477884941 475864143 472786522 471066551 469466019 467664986 468639717
1611.5 468639717 466484795 466168594 463854179 463267250 461318130 452176285 455928497 456376686 457738953
1620.2 457738953 457198486 458137703 456745529 453003883 454627800 453888741 454530144 451949806 453378983
1628.9 453378983 454872169 455784187 457152634 456776733 458375473 457683563 454143372 452682381 455387154
1637.5 455387154 458128242 459932327 462190475 462568321 464625931 464673042 466523399 467807274 465065765
$$ packed form
1580.6E54925537l206253j317673l287811l044434m376449l802185l773842m457016
1588.4E27659874k066650l789444k093735l204842k117500l256531m595032k687187
1596.1E03848953m368973k363815l790588j729317k530708k102852r07707l432808
1603.8D82622185j358261l378983k020798l077621j719971j600532j801033R74731
1611.5D68639717k154922l16201k314415n86929j949120r141845L752212M48189J362267
1620.2D57738953n40467R39217j392174l741646J623917p39059O41403k580338J429177
1628.9D53378983J493186R12018J368447l75901J598740o91910l540191j460991K704773
1637.5D55387154K741088J804085K258148L77846K057610M7111J850357J283875k741509
$$ plain form
1646.2 465065765 466597023 466343651 471295929 474196167 477916756 481191864 482355042 476121826
1653.9 476121826 477751045 482837448 484661331 487213326 489227219 491723175 494299507 496613884
1661.6 496613884 498175278 497023468 500534706 502831688 505515366 508156242 509730034 511411667
1669.4 511411667 513762436 517715225 519040337 523092384 526785393 527631111 528595543 532393608 536827354
1678 536827354 539600945 542679749 544532623 548659859 552431564 550994835 549323387 553942947 561278381
1686.7 561278381 565036697 567948685 571732101 575092278 579191666 581851349 584741936 588135605
1694.4 588135605 590478592 588922043 595051842 601468849 606378632 607295799 603870277 611314621
1702.1 611314621 616261330 618807678 620010185 621531372 623751221 628054581 632640610 633987312
$$ packed form
1646.2D65065765J531258k53372M952278K900238L720589L275108J163178o233216
1653.9D76121826J629219N086403J823883K551995K013893K495956K576332K314377
1661.6D96613884J561394j151810L511238K296982K683678K640876J573792J681633
1669.4E11411667K350769L952789J325112M052047L693009Q45718R64432L798065M433746
1678E36827354K773591L078804J852874M127236L771705j436729j671448M619560P335434
1686.7E61278381L758316K911988L783416L360177M099388K659683K890587L393669
1694.4E88135605K342987j556549O129799O417007M909783R17167l425522P444344
1702.1F11314621M946709K546348J202507J521187K219849M303360M586029J346702
$$ plain form
1709.9 633987312 634361229 636504784 638282471 639298630 638490372 639468803 643169403 643448639 638652229
1718.5 638652229 644495316 648685150 650258560 651046066 650850754 651622314 653695297 655461044 657000351
1727.2 657000351 658820190 660408325 658210983 657679672 661117706 662862396 657753296 655033875
1734.9 655033875 662591019 667568970 669726105 672379532 671137543 669172363 673274460 675489655
1742.7 675489655 675192947 677031860 681386490 684852066 686635818 687960739 688922806 693556595 694252548
1751.3 694252548 694520645 699737091 703071747 706430435 708899918 708269196 710672150 713626556 715888290
1760 715888290 718106766 715871887 716656113 721054230 723294601 725144958 727599335 727994614 725140305
1768.7 725140305 727902298 731316376 729584961 725976105 726803284 732526779 735030823 735067215 738004913
$$ packed form
1709.9F33987312L73917K143555J777687J016159q08258R78431L700600K79236m796410
1718.5F38652229N843087M189834J573410P87506j95312P71560K072983J765747J539307
1727.2F57000351J819839J588135k197342n31311L438034J744690n109100k719421
1734.9F55033875P557144M977951K157135K653427j241989j965180M102097K215195
1742.7F75489655k96708J838913M354630L465576J783752J324921R62067M633789O95953
1751.3F94252548K68097N216446L334656L358688K469483o30722K402954K954406K261734
1760G15888290K218476k234879P84226M398117K240371J850357K454377L95279k854309
1768.7G25140305K761993L414078j731415l608856Q27179N723495K504044L6392K937698
$$ plain form
1777.4 738004913 738568268 738607178 737930603 736795959 738537292 741012039 742861252 742294769 742862015
1786 742862015 744609756 745340881 745547714 746014557 745633926 745375290 743906555 745347137 749799805
1794.7 749799805 750572891 750118713 751952438 753248978 751853943 749835358 751702576 751851501 753282318
1803.4 753282318 755990753 757052689 757888794 757568665 756886749 757174072 757573166 756249313 757235718
1812.1 757235718 759612274 760859909 762078400 762274857 762496567 761398010 761156616 761969147 762057877
1820.8 762057877 763029175 763329239 765478668 766835480 763583984 763992996 765922165 766358719 763862152
1829.4 763862152 760893631 763807373 767004242 767971115 768727341 769432526 769484177 768540497 767089157
1838.1 767089157 767497025 768000107 769361191 770443726 771943130 771844330 765960617 768799362 770937195
$$ packed form
1777.4G38004913N63355L8910o76575j134644J741333K474747J849213n66483N67246
1786G42862015J747741P31125K06833M66843l80631k58636j468735J440582M452668
1794.7G49799805P73086m54178J833725J296540j395035k018585J867218J48925J430817
1803.4G53282318K708435J061936Q36105l20129o81916K87323L99094j323853R86405
1812.1G57235718K376556J247635J218491J96457K21710j098557k41394Q12531Q8730
1820.8G62057877R71298L00064K149429J356812l251496M09012J929169M36554k496567
1829.4G63862152k968521K913742L196869R66873P56226P05185N1651r43680j451340
1838.1G67089157M07868N03082J361084J082535J499404r8800n883713K838745K137833
$$ plain form
1846.8 770937195 769963074 769634171 770499420 771700897 772453232 774108963 774762650 774858627 774141998
1855.5 774141998 773077774 772697830 771815033 772385712 773205338 774346542 775254974 775666046 776005936
1864.2 776005936 775836639 775543213 774056320 773197327 771096420 770979004 773909073 776351318 777983932
1872.8 777983932 777957840 777710876 776662445 775737762 775480042 775801010 776610718 776912231 778140182
1881.5 778140182 778774414 779003754 778442612 777293396 776773529 776382217 777339478 776530151 775236359
1890.2 775236359 777407227 779456558 779841843 779652023 778453598 776980743 777702789 777766800 778052063
1898.9 778052063 779010544 779487534 779996796 780080948 780105438 778934174 778062744 777785721 777747726 778573914
1908.5 778573914 779305191 779864578 780369339 781489105 780839615 779737015 779058838 778760529 779479294
$$ packed form
1846.8G70937195r74121l28903Q65249J201477P52335J655731O53687R5977p16629
1855.5G74141998j064224l79944q82797N70679Q19626J141204R08432M11072L39890
1864.2G76005936j69297k93426j486893q58993k100907j17416K930069K442245J632614
1872.8G77983932k6092k46964j048431r24683k57720L20968Q09708L01513J227951
1881.5G78140182O34232K29340n61142j149216n19867l91312R57261q09327j293792
1890.2G75236359K170868K049331L85285j89820j198425j472855P22046O4011K85263
1898.9G78052063R58481M76990N09262Q4152K4490j171264q71430k77023l7995Q26188
1908.5G78573914P31277N59387N04761J119766o49490j102600o78177k98309P18765
$$ plain form
1917.2 779479294 777478714 778138123 780611649 781741791 781819382 779467392 778363342 778720932 778738022
1925.9 778738022 778872833 779766922 780483398 780937958 781664734 781927109 781764450 780432510 779371109
1934.6 779371109 778771210 778583221 779031830 779964676 781685028 782409897 782602539 780556946 777687149
1943.2 777687149 778324509 778590393 778031006 778231583 779695358 780940628 781613998 781383514 780334854
1951.9 780334854 779606628 778844147 778175507 777628479 778256149 779413528 780450745 781202621 780929871
1960.6 780929871 780231705 778934174 778298035 778017731 777840500 778022614 777973404 778935471 780084839
1969.3 780084839 780534439 779737244 778722992 778060532 777674789 777751312 777764969 778461227 779161682 779883270
1978.9 779883270 780364532 779882965 778900604 777706909 776878052 776470184 777272034 778379974 778811340
$$ packed form
1917.2G79479294k000580O59409K473526J130142P7591k351990j104050L57590J7090
1925.9G78738022J34811Q94089P16476M54560P26776K62375j62659j331940j061401
1934.6G79371109n99899j87989M48609R32846J720352P24869J92642k045593k869797
1943.2G77687149O37360K65884n59387K00577J463775J245270O73370k30484j048660
1951.9G80334854p28226p62481o68640n47028O27670J157379J037217P51876k72750
1960.6G80929871o98166j297531o36139k80304j77231J82114m9210R62067J149368
1969.3G80084839M49600p97195j014252o62460l85743P6523J3657O96258P00455P21588
1978.9G79883270M81262m81567r82361j193695q28857m07868Q01850J107940M31366
$$ plain form
1987.6 778811340 778810577 778971329 779515762 778423538 775920639 775043259 775758209 776575851 777447052 778331451
1997.2 778331451 778633728 778777161 778223419 777255554 776088257 775496140 775467606 775506210 776154251 777042618
2006.9 777042618 778024063 777883606 777172012 776272202 775078506 774587479 774631348 775149384 775713120 776568832
2016.5 776568832 776559143 776527328 776524429 774979858 773921051 772980957 772546768 772981567 773840103 775092392
2026.2 775092392 775792923 776032104 775426559 774572144 773208923 772113037 772021942 772346802 773028107
2034.9 773028107 773479614 774199600 774260178 773743134 772850342 771566696 770540771 770260010 771180267
2043.5 771180267 771843414 772870789 773373871 773026047 772740250 771633911 770936050 770418625 770213852
2052.2 770213852 770062103 770695496 772163239 772616959 772536011 771621323 770860367 770012817 769411774 769580765
$$ packed form
1987.6G78811340p63J60752N44433j092224k502899q77380P14950Q17642Q71201Q84399
1997.2G78331451L02277J43433n53742r67865j167297n92117k8534L8604O48041Q88367
2006.9G77042618R81445j40457p11594q99810j193696m91027M3869N18036N63736Q55712
2016.5G76568832r689l1815k899j544571j058807r40094m34189M34799Q58536J252289
2026.2G75092392P00531K39181o05545q54415j363221j095886r1095L24860O81305
2034.9G73028107M51507P19986O0578n17044q92792j283646j025925k80761R20257
2043.5G71180267O63147J027375N03082l47824k85797j106339o97861n17425k04773
2052.2G70213852j51749O33393J467743M53720q0948r14688p60956q47550o01043J68991
$$ plain form
2061.9 769580765 769557724 770365372 771297989 771783447 771933060 771840744 770952911 769747772 768926163 768316727
2071.5 768316727 768795471 769606476 770942993 771707687 771497421 770992584 769645081 768609543 767788315
2080.2 767788315 767642212 767783585 768405838 769761429 770706482 770975113 770013657 769210358 768275986
2088.9 768275986 767358704 767060318 767319412 768420029 769165802 769934006 769889908 769265594 768446960 767117615
2098.5 767117615 766045990 765363083 766084900 767240829 768185120 768670349 768872833 769020996 768090897
2107.2 768090897 766601562 765149155 765018082 765722961 766615601 767655563 768183060 768160782 767470627
2115.9 767470627 766769028 765529099 764543915 764378357 764855957 765926285 766771469 767435532 767275085
2124.5 767275085 766993103 766275330 765261688 764629288 764138870 764637299 765359116 766232224 766660461
$$ packed form
2061.9G69580765k3041Q07648R32617M85458J49613r2316q87833j205139q21609o09436
2071.5G68316727M78744Q11005J336517P64694k10266n04837j347503j035538q21228
2080.2G67788315j46103J41373O22253J355591R45053K68631r61456q03299r34372
2088.9G68275986r17282k98386K59094J100617P45773P68204m4098o24314q18634j329345
2098.5G67117615j071625o82907P21817J155929R44291M85229K02484J48163r30099
2107.2G68090897j489335j452407j31073P04879Q92640J039962N27497k2278o90155
2115.9G67470627p01599j239929r85184j65558M77600J070328Q45184O64063j60447
2124.5G67275085k81982p17773j013642o32400m90418M98429P21817Q73108M28237
$$ plain form
2133.2 766660461 766660919 766198044 765186996 764678268 764065170 764159241 764586792 765073471 765766754 766650162
2142.9 766650162 767155991 766298981 765857849 765156860 764253311 763780746 763795853 764797821 765989990
2151.5 765989990 767206192 767390060 766911774 765883331 764688873 763732910 763225098 764154587 765219498
2160.2 765219498 766281128 766706848 766974945 766915131 765787964 765005798 764119034 763877869 764215317
2168.9 764215317 765116730 766130676 766807938 767405930 766884460 766101151 764915237 764228821 764105453
2177.6 764105453 764403992 765622940 766651764 767850189 768087463 767454071 766432495 765364075 764527054
2186.3 764527054 764251404 765116348 765642776 766795349 767616272 767814255 767824173 766679764 765755234 764594345
2195.9 764594345 764141388 764590912 765452576 766876678 768054886 768667450 768050003 767176285 766279373
$$ packed form
2133.2G66660461M58m62875j011048n08728o13098R4071M27551M86679O93283Q83408
2142.9G66650162N05829q57010m41132p00989r03549m72565J5107J001968J192169
2151.5G65989990J216202J83868m78286j028443j194458r55963n07812R29489J064911
2160.2G65219498J061630M25720K68097n9814j127167p82166q86764k41165L37448
2168.9G64215317R01413J013946O77262N97992n21470p83309j185914o86416j23368
2177.6G64105453K98539J218948J028824J198425K37274o33392j021576j068420q37021
2186.3G64527054k75650Q64944N26428J152573Q20923J97983R918j144409r24530j160889
2195.9G64594345m52957M49524Q61664J424102J178208O12564o17447q73718q96912
$$ plain form
2204.6 766279373 765685196 765239334 765117035 766261139 767699738 768691711 768582840 768238907 767503815
2213.3 767503815 766375885 765488739 764873734 765188141 766035690 767476196 768480759 769153748 768982620
2221.9 768982620 767348480 766088638 765266495 765001755 765222626 766239471 767217484 768145218 768987427
2230.6 768987427 768431091 767748337 766423492 765298538 764985962 765202255 766183319 767247772 768498764
2239.3 768498764 768675690 768512115 767745056 766294937 765342102 764645233 765123444 766044159 767257233
2248 767257233 768284302 768584061 768267593 767265854 766296158 765123444 764512939 764699783 765856934
2256.7 765856934 767369156 768367386 768712006 768225555 767575760 766340332 765476303 765058365 765141144
2265.3 765141144 765890884 766775436 768041077 768337860 768100891 767469559 766738739 765839005 764581909
$$ packed form
2204.6G66279373n94177m45862j22299J144104J438599R91973j08871l43933p35092
2213.3G67503815j127930q87146o15005L14407Q47549J440506J004563O72989j71128
2221.9G68982620j634140j259842q22143k64740K20871J016845R78013R27734Q42209
2230.6G68987427n56336o82754j324845j124954l12576K16293R81064J064453J250992
2239.3G68498764J76926j63575p67059j450119r52835o96869M78211R20715J213074
2248G67257233J027069K99759l16468j001739r69696j172714o10505J86844J157151
2256.7G65856934J512222R98230L44620m86451o49795j235428q64029m17938Q2779
2265.3G65141144P49740Q84552J265641K96783k36969o31332p30820q99734j257096
$$ plain form
2274 764581909 764444885 765065460 766537170 767799530 768507233 768521347 767678680 766596146 765045090
2282.7 765045090 764477005 764273682 764925766 766410370 767534485 768320847 768212814 767822876 766338501
2291.4 766338501 765065460 764434052 764428864 765690613 766735077 768317108 769332123 769386978 768537216
2300 768537216 766705093 765601578 764885864 764860916 765677109 768003387 769770660 769664459 769685745 769369812
2309.7 769369812 768682022 767218323 766284866 766589127 767273026 768491898 769532318 770819473 771754074
2318.4 771754074 770950470 769693222 768857193 768273315 768983002 770001297 770975647 772583771 773403931
2327.1 773403931 774123993 773522949 771599884 769887466 768505402 768707886 769456558 770238953 771236191
2335.7 771236191 773309021 774152451 772869034 771602859 770660706 771023026 771543427 770933456 769991074
$$ packed form
2274G64581909j37024O20575J471710J262360P07703J4114q42667j082534j551056
2282.7G65045090n68085k03323O52084J484604J124115P86362j08033l89938j484375
2291.4G66338501j273041o31408n188J261749J044464J582031J015015N4855q49762
2300G68537216j832123j103515p15714k4948Q16193K326278J767273j06201K1286l15933
2309.7G69369812o87790j463699r33457L04261O83899J218872J040420J287155R34601
2318.4G71754074q03604j257248q36029n83878P09687J018295R74350J608124Q20160
2327.1G73403931P20062o01044j923065j712418j382064K02484P48672P82395R97238
2335.7G71236191K072830Q43430j283417j266175r42153L62320N20401o09971r42382
$$ plain form
2344.4 769991074 770543747 771286469 769854050 768087234 767814178 767623291 766490631 767809067 770484467
2353.1 770484467 772762604 774949188 776260147 777738724 776022415 774934845 773281403 770284500
2360.8 770284500 769626846 771026764 773804779 773082733 773084106 773351440 771480255 768689194 766805725
2369.5 766805725 766518402 764941635 764743958 764664764 764980774 765508194 765032120 765079956 763329086 761114044
2379.1 761114044 759092407 757649841 758049011 758991623 759723816 759710999 759740448 759306030 758001938
2387.8 758001938 756547394 755392609 755063400 755212936 756129379 757434082 758546524 758800201 758067245
2396.5 758067245 756643753 754934998 753986130 753681259 754345398 755431824 756582947 757417603 757103882
2405.2 757103882 756493530 755587540 754255600 752806015 752177200 752458954 753431473 754836731 755697632
$$ packed form
2344.4G69991074N52673P42722j432419j766816k73056j90887j132660J318436K675400
2353.1G70484467K278137K186584J310959J478577j716309j087570j653442k996903
2360.8G70284500o57654J399918K778015p22046J373K67334j871185k791061j883469
2369.5G66805725k87323j576767j97677p9194L16010N27420m76074M7836j750870k215042
2379.1G61114044k021637j442566L99170R42612P32193j2817K9449m34418j304092
2387.8G58001938j454544j154785l29209J49536R16443J304703J112442K53677p32956
2396.5G58067245j423492j708755r48868l04871O64139J086426J151123Q34656l13721
2405.2G57103882o10352r05990j331940j449585o28815K81754R72519J405258Q60901
$$ plain form
2413.8 755697632 756174240 755508575 754015198 752377167 751029358 750729141 751159744 752176895 752972183
2422.5 752972183 753589249 753850403 753119659 751651840 750226212 749312820 748766327 749179916 750019608
2431.2 750019608 751152573 752026062 751955185 751438522 750295868 748906860 747302017 746437378 746698303
2439.9 746698303 747715378 749040833 749735031 750113525 749640579 748742447 747560196 746084518 745318451
2448.6 745318451 745204468 745704041 746491776 747674026 748223877 747491913 746338425 745186310 744002686
2457.2 744002686 742820129 742864609 743573761 744142685 744943771 745746155 745569611 744112167 742831726
2465.9 742831726 741694031 740738144 740817184 741692963 742335052 742847595 743448639 742978821 741955948
2474.6 741955948 740765305 739725037 738914185 738409042 738828583 739483414 740432663 741110840 740813599
$$ packed form
2413.8G55697632M76608o65665j493377j638031j347809l00217M30603J017151P95288
2422.5G52972183O17066K61154p30744j467819j425628r13392n46493M13589Q39692
2431.2G50019608J132965Q73489p0877n16663j142654j389008j604843q64639K60925
2439.9G46698303J017075J325455O94198L78494m72946q98132j182251j475678p66067
2448.6G45318451j13983M99573P87735J182250N49851p31964j153488j152115j183624
2457.2G44002686j182557M4480P09152N68924Q01086Q02384j76544j457444j280441
2465.9G42831726j137695r55887P9040Q75779O42089N12543O01044m69818j022873
2474.6G41955948j190643j040268q10852n05143M19541O54831R49249O78177k97241
$$ plain form
2483.3 740813599 739391327 737739487 736594467 735619888 735604706 735925674 736546173 737472916 738050156
2492 738050156 737839737 736403427 735073395 734025040 733245468 732793045 732794647 733591461 734637375 735333176
2501.6 735333176 734905853 733872681 732651520 731604385 730453644 729548416 729919205 730675049 731750946
2510.3 731750946 732429123 732309723 731402206 729517059 727841034 727040558 726978455 727169189 728183975
2519 728183975 729444580 729981384 729762726 728772354 727459564 725812836 724651947 724095688 724503250
2527.6 724503250 725699997 726518860 727005157 726968460 726431961 724807053 723201523 722483673 722044067
2536.3 722044067 722321701 723099060 724079666 724589767 724569855 723676682 722293930 720960922 719613190
2545 719613190 719494705 719813766 720400009 721112595 721469040 721615143 720937195 720116653 719041672 717935486
$$ packed form
2483.3G40813599j422272j651840j145020r74579j5182L20968O20499R26743N77240
2492G38050156k10419j436310j330032j048355p79572m52423J602P96814J045914O95801
2501.6G35333176m27323j033172j221161j047135j150741r05228L70789P55844J075897
2510.3G31750946O78177j19400r07517j885147j676025q00476o2103J90734J014786
2519G28183975J260605N36804k18658r90372j312790j646728j160889n56259M07562
2527.6G24503250J196747Q18863M86297l6697n36499j624908j605530p17850m39606
2536.3G22044067K77634P77359R80606N10101j9912q93173j382752j333008j347732
2545G19613190j18485L19061N86243P12586L56445J46103o77948q20542j074981j106186
$$ plain form
2554.6 717935486 717106094 716813583 717518539 718450699 719035568 719066391 718630295 717256927 716147461
2563.3 716147461 715605392 714751434 714488678 715024948 716182480 716881409 716942062 716296616 715023575
2572 715023575 714020767 712964478 712365341 712492218 713248672 713688965 713760605 714070206 713623962 712579956
2581.6 712579956 711283875 710515747 710200119 710022659 710448151 710850296 711090775 711160278 710793076 709589920
2591.3 709589920 708290787 707530975 707035675 707097473 707612381 708175735 708664398 709046021 708358536 707066040
2600.9 707066040 705901871 704730759 704068222 703891525 704578552 705371323 705883026 705966263 705225525
2609.6 705225525 704168472 702771378 701971130 701345062 701101074 701721497 702105408 702408905 702499466
2618.3 702499466 702363510 701348343 699738083 698776703 698299561 698001022 698088303 698662872 698891068
$$ packed form
2554.6G17935486q29392k92511P04956R32160N84869L0823m36096j373368j109466
2563.3G16147461n42069q53958k62756N36270J157532O98929O0653o45446j273041
2572G15023575j002808j056289n99137J26877P56454M40293P1640L09601m46244j044006
2581.6G12579956j296081p68128l15628j77460M25492M02145K40479O9503l67202j203156
2591.3G09589920j299133p59812m95300O1798N14908N63354M88663L81623o87485j292496
2600.9G07066040j164169j171112o62537j76697O87027P92771N11703Q3237p40738
2609.6G05225525j057053j397094q00248o26068k43988O20423L83911L03497R0561
2618.3G02499466j35956j015167j610260r61380m77142k98539Q7281N74569K28196
$$ plain form
2627 698891068 698934326 698461456 697432175 696545334 695755310 695326462 694889221 695033569 695587845 695941620
2636.6 695941620 695949860 695210571 694186325 692826080 691939545 691660767 691537247 691865082 692448959 692667618
2646.3 692667618 692307816 691915817 690865555 689659119 688889999 688147202 687718582 687882462 688662186
2654.9 688662186 688908539 688626022 688393555 688313522 687390289 685394592 684502869 684465561 684877167 685679245
2664.6 685679245 686198120 686199188 685608444 684926147 684003677 683457108 683115082 682762985 682918701 683177872
2674.2 683177872 683650894 683931580 683558350 682525330 681384048 680475388 679783936 679606552 679634628
2682.9 679634628 679761505 680224457 680767136 680419388 679585953 678605576 677650757 677612305 677407837 677271118
2692.5 677271118 677873001 678253479 678196716 677798615 677058563 676236572 675453186 674560547 674088135 673974457
$$ packed form
2627F98891068M3258m72870j029281q86841p90024m28848m37241J44348N54276L53775
2636.6F95941620Q240p39289j024246j360245q86535k78778j23520L27835N83877K18659
2646.3F92667618l59802l91999j050262j206436p69120p42797m28620J63880P79724
2654.9F88662186K46353k82517k32467q0033r23233j995697q91723l7308M11606Q02078
2664.6F85679245N18875J068n90744o82297r22470n46569l42026l52097J55716K59171
2674.2F83177872M73022K80686l73230j033020j141282r08660o91452j77384K8076
2682.9F79634628J26877M62952N42679l47748q33435r80377r54819l8452k04468j36719
2692.5F77271118O01883L80478n6763l98101p40052q21991p83386q92639m72412j13678
$$ plain form
2702.2 673974457 674515381 675295486 675225983 675224609 674837112 673771820 672590256 671764603 671899719 672354126
2711.8 672354126 672740784 672819061 672905045 672916031 672248993 671103745 670012817 669359131 669114685 669540710
2721.5 669540710 670212479 670841064 670918884 670294647 669679108 668561630 667553940 667319412 667405701 667796555
2731.1 667796555 668294144 668417282 668155594 667677155 667107086 666836853 666373596 665698929 665121765 665186005
2740.8 665186005 666062469 666356812 666380692 666321945 665616226 664807129 664225922 663573990 663237228 663893814
2750.4 663893814 664585800 664944687 664920120 664575729 664008408 662773437 661909409 661907349 662158127 662162399
2760 662162399 662234497 662522812 662529907 662236023 661741486 660990601 659889832 659435959 659367676 659516602
2769.7 659516602 660166855 660360947 660225601 659947433 660153656 659445343 657755890 657427902 657385864 657228088
$$ packed form
2702.2F73974457N40924P80105o9503j374l87497j065292j181564q25653J35116M54407
2711.8F72354126L86658P8277Q5984J0986o67038j145248j090928o53686k44446M26025
2721.5F69540710O71769O28585P7820o24237o15539j117478j007690k34528Q6289L90854
2731.1F67796555M97589J23138k61688m78439n70069k70233m63257o74667n77164O4240
2740.8F65186005Q76464K94343K3880n8747p05719q09097n81207o51932l36762O56586
2750.4F63893814O91986L58887k4567l44391n67321j234971q64028k060K50778M272
2760F62162399P2098K88315P095k93884m94537p50885j100769m53873o8283J48926
2769.7F59516602O50253J94092j35346k78168K06223p08313j689453l27988m2038j57776
$$ plain form
2779.3 657228088 657253265 657611313 657889633 657516708 656717224 655296936 654381866 654054871 654171982 654549561
2789 654549561 654889069 655247269 654835358 654169846 653235626 652223053 651505661 650966492 650934753 651073456
2798.6 651073456 651092987 650567703 649964905 649428940 648683014 648123016 647537689 646759949 646086273 645952530
2808.3 645952530 646137695 646356201 646034622 645286331 644564133 643588333 642816696 641895905 640975113 640771790
2817.9 640771790 641140747 641251755 640371933 639568672 638992920 637771873 636337624 635660400 635416031
2826.6 635416031 635061760 634712029 634421234 634412003 633965416 632762833 631100121 629655724 628482552
2835.3 628482552 627299843 626990433 626839180 626597900 625844955 624196281 622537575 620356750 618161316
2843.9 618161316 616276970 614733582 613815346 612970543 611520538 609285927 607477036 605905952 604267197
$$ packed form
2779.3F57228088K5177L58048K78320l72925p99484j420288r15070l26995J17111L77579
2789F54549561L39508L58200m11911o65512r34220j012573p17392n39169l1739J38703
2798.6F51073456J9531n25284o02798n35965p45926n59998n85327p77740o73676j33743
2808.3F45952530J85165K18506l21579p48291p22198r75800p71637r20791r20792k03323
2817.9F40771790L68957J11008q79822q03261n75752j221047j434249o77224k44369
2826.6F35416031l54271l49731k90795r231m46587j202583j662712j444397j173172
2835.3F28482552j182709l09410j51253k41280p52945j648674j658706k180825k195434
2843.9F18161316j884346j543388r18236q44803j450005k234611j808891j571084j638755
$$ plain form
2852.6 604267197 603049927 602443695 602619019 602909393 603428688 604108925 604294243 603793259 603160706
2861.3 603160706 602720680 602152481 601751060 601773262 602118568 601805153 601055450 600771065 600434990 599643478
2870.9 599643478 598210335 597124710 596679687 596436348 596780701 597034569 597125778 597240753 596660576
2879.6 596660576 595635452 594412193 593283501 593048515 593063545 592793198 592180519 591322021 590971222
2888.3 590971222 590411949 589329758 588165741 587054558 586366386 585749779 585251350 584921608 584485855
2897 584485855 583970909 583262024 582181740 580942459 579883537 579022484 578897705 579006920 578397484
2905.7 578397484 577773399 577670059 577313194 575971222 574049568 571986504 570635185 570233231 569712105
2914.3 569712105 568712845 567245026 565856018 564715195 563461571 561985207 560092583 558664551
$$ packed form
2852.6F04267197j217270o06232J75324K90374N19295O80237J85318n00984o32553
2861.3F03160706m40026n68199m01421K2202L45306l13415p49703k84385l36075p91512
2870.9E99643478j433143j085625m45023k43339L44353K53868R1209J14975n80177
2879.6E96660576j025124j223259j128692k34986J5030k70347o12679q58498l50799
2888.3E90971222n59273j082191j164017j111183o88172o16607m98429l29742m35753
2897E84485855n14946p08885j080284j239281j058922q61053j24779J09215o09436
2905.7E78397484o24085j03340l56865j341972j921654k063064j351319m01954n21126
2914.3E69712105r99260j467819j389008j140823j253624j476364j892624j428032
$$ plain form
2922.1 558664551 558183517 558108635 558578949 559364700 559489899 558928452 558477135 558438835 558034630 557342491
2931.7 557342491 557808838 558787537 559214058 559725761 560829086 562040176 562405739 562603912 563337975
2940.4 563337975 564305725 565548820 566255493 566398849 567279015 568321686 568544350 568375282 568318176
2949.1 568318176 568588524 569022865 569824257 570778542 571530113 572020073 571971588 572022972 571780586 571297112
2958.7 571297112 571125565 570933228 571558800 572958679 574287720 575212975 576014748 576451759 576490707
2967.4 576490707 576780968 576841660 577360077 578442497 579838295 581474800 582441292 583235054 583660774
2976.1 583660774 583757057 583621178 583063278 583220825 584056396 584655914 585150795 586050987 586451721 586243324
2985.7 586243324 586394501 586289558 585571213 585193672 585660820 586398735 587106323 587502632 587382240 587103539
$$ packed form
2922.1E58664551m81034p4882M70314P85751J25199n61447m51317l8300m04205o92139
2931.7E57342491M66347R78699M26521N11703J103325J211090L65563J98173P34063
2940.4E63337975R67750J243095P06673J43356Q80166J042671K22664j69068n7106
2949.1E68318176K70348M34341Q01392R54285P51571M89960m8485N1384k42386m83474
2958.7E71297112j71547j92337O25572J399879J329041R25255Q01773M37011L8948
2967.4E76490707K90261O0692N18417J082420J395798J636505R66492P93762M25720
2976.1E83660774R6283j35879n57900J57547Q35571N99518M94881R00192M00734k08397
2985.7E86243324J51177j04943p18345l77541M67148P37915P07588L96309j20392k78701
$$ plain form
2995.3 587103539 586747589 586052933 585095711 584565811 584503517 584610062 584626427 584817696 585271111 585056725
3005 585056725 584216843 583079109 581924629 581172180 580880775 580856514 581329041 581810532 581401215 581200485
3014.6 581200485 580445938 578670120 577484207 577053185 576977005 576762238 576887360 577041016 576881371
3023.3 576881371 576310120 575111542 574431114 573623657 572656097 572218208 572137985 572388687 572338448 572017784
3033 572017784 571290474 570205154 569072342 568033409 567138710 566540871 566675339 566864243 566923943 566747513
3042.6 566747513 566003914 564790688 563270454 562238464 561716652 561265335 560986252 561037903 561102486
3051.3 561102486 560750504 559867554 558740387 557760963 556737289 555811272 555202179 554859238 554439735
3060 554439735 554088821 554246025 554147797 553304520 551906891 550875740 550165176 549295807 549207878 549294624
$$ packed form
2995.3E87103539l55950o94656r57222n29900o2294J06545J6365J91269M53415k14386
3005E85056725q39882j137734j154480p52449k91405k4261M72527M81491m09317k00730
3014.6E81200485p54547j775818j185913m31022p6180k14767J25122J53656j59645
3023.3E76881371n71251j198578o80428q07457r67560m37889q0223K50702n0239l20664
3033E72017784p27310j085320j132812j038933q94699n97839J34468J88904N9700j76430
3042.6E66747513p43599j213226j520234j031990n21812m51317k79083N1651O4583
3051.3E61102486l51982q82950j127167r79424j023674r26017o09093l42941m19503
3060E54439735l50914J57204r8228q43277j397629j031151p10564q69369q7929Q6746
$$ plain form
3069.6 549294624 548840599 548621941 548346710 547472916 546554489 545879364 545277939 544734955 544578209 544554024
3079.2 544554024 544289932 544287529 543675652 542525406 541784019 540880775 539990234 539391174 539326553 539523315
3088.9 539523315 539549713 539052582 538157921 537564812 536462746 535486908 534891701 533913727 533370514 533621864
3098.5 533621864 534185677 533783264 532819138 531900063 530792656 529617157 528486252 528236275 528391876
3107.2 528391876 528675385 528765450 527859077 526885643 526281471 525625877 524787598 523920670 523175735 523072014
3116.9 523072014 523220406 522701378 521955147 521362457 520605583 519512177 518762016 517915573 516709824
3125.5 516709824 516537971 516849442 516545334 516179810 515889015 514875755 513326302 512001801 511115723
3134.2 511115723 510534439 510204086 510277176 510519562 510354958 509155693 507953911 506717186 504945946
$$ packed form
3069.6E49294624m54025k18658k75231q73794r18427o75125o01425n42984j56746k4185
3079.2E44554024k64092k403o11877j150246p41387r03244q90541n99060o4621J96762
3088.9E39523315K6398m97131q94661n93109j102066r75838n95207r77974n43213K51350
3098.5E33621864N63813m02413r64126r19075j107407j175499j130905k49977J55601
3107.2E28391876K83509R0065r06373r73434o04172o55594q38279q66928p44935j03721
3116.9E23072014J48392n19028p46231n92690p56874j093406p50161q46443j205749
3125.5E16709824j71853L11471l04108l65524k90795j013260j549453j324501q86078
3134.2E11115723n81284l30353P3090K42386j64604j199265j201782j236725j771240
$$ plain form
3142.9 504945946 504643784 504672356 503781281 503444443 503654747 503485146 502609024 501507225 500515900 499564438
3152.5 499564438 498399849 497847710 497541428 496922913 497054176 496917305 496150856 494988708 493728943
3161.2 493728943 492732124 491377411 490473022 490159073 490025711 489838982 489432144 488638763 487290688
3169.9 487290688 486146202 485256958 484355545 483449974 483015938 482845917 482683830 482467003 481398544
3178.6 481398544 480125084 479084167 478149910 477345238 477076530 476945343 476229897 475665245 475190582
3187.3 475190582 474906235 474214592 473297043 472619858 471286697 470371819 470067482 469744759 469466705
3195.9 469466705 469324036 468662338 467438431 466722107 465887375 464882164 464060135 463813133 463656425
3204.6 463656425 463269119 463037529 462441521 461832771 460589485 459909592 459750481 458722992 458173256
$$ packed form
3142.9E04945946l02162K8572q91075l36838K10304j69601q76122j101799r91325r51462
3152.5D99564438j164589n52139l06282o18515J31263j36871p66449j162148j259765
3161.2D93728943r96819j354713r04389l13949j33362j86729m06838p93381j348075
3169.9D87290688j144486q89244r01413r05571m34036j70021j62087k16827j068459
3178.6D81398544j273460j040917r34257q04672k68708j31187p15446n64652m74663
3187.3D75190582k84347o91643r17549o77185j333161r14878l04337l22723k78054
3195.9D69466705j42669o61698j223907p16324q34732j005211q22029k47002j56708
3204.6D63656425l87306k31590n96008o08750j243286o79893j59111j027489n49736
$$ plain form
3213.3 458173256 457556458 457603798 457848053 457137070 456399040 455218697 453989525 453237686 452842484
3222 452842484 452360344 452329903 452469139 451953087 451346359 450100670 449083748 448359718 447213669 446538010
3231.6 446538010 446547203 446649895 446297798 446057625 445490227 444543419 443743439 443047218 442803383 442494316
3241.3 442494316 441730537 440786400 440422821 440167007 439774208 439595604 438636398 437592735 437093010
3249.9 437093010 436548157 436063614 436072807 436073494 435558434 435113144 434502144 433784180 432994652 431982346
3259.6 431982346 431450806 431513214 431594048 431222420 430768089 430635376 430499840 429988976 429265480 428203430
3269.2 428203430 427203217 427154045 427214355 426936989 426807213 426946220 426481667 425078316 424358101 424117928
3278.9 424117928 423523941 423069649 423123322 423416977 423240204 422644386 422021446 421514397 421146049 420582199
$$ packed form
3213.3D58173256o16798M7340K44255p10983p38030j180343j229172p51839l95202
3222D52842484m82140l0441J39236n16052o06728j245689j016922p24030j146049o75659
3231.6D46538010R193J02692l52097k40173n67398r46808p99980o96221k43835l09067
3241.3D42494316p63779r44137l63579k55814l92799j78604r59206j043663m99725
3249.9D37093010n44853m84543R193O87n15060m45290o11000p17964p89528j012306
3259.6D31982346n31540O2408Q0834l71628m54331j32713j35536n10864p23496j062050
3269.2D28203430j000213m9172O0310k77366j29776J39007m64553j403351p20215k40173
3278.9D24117928n93987m54292N3673K93655j76773n95818o22940n07049l68348n63850
$$ plain form
3288.5 420582199 419903069 419784279 419872513 419692421 419723701 419584808 419050522 418501663 417577744 416673584
3298.2 416673584 416560135 416473083 416405334 416491890 416244049 416472855 416515007 415708427 415129013 414733505
3307.8 414733505 413613205 412292595 412081032 412198410 412332802 412494583 412036552 411418533 410662460
3316.5 410662460 409784660 408741264 408050079 407859344 407591019 407434196 407161713 407006836 406673965
3325.2 406673965 405781136 404726143 403765984 403126259 402604065 401941032 401167717 401333046 401187553
3333.8 401187553 399916458 399380455 398435707 397344246 396993790 396354027 396307144 396351929 395509300 394712524
3343.5 394712524 394035034 393125534 392154121 391084976 390469627 390611649 390763588 390376129 389608345
3352.2 389608345 389288254 389226151 388564758 387544899 386903191 386636887 386388512 386016846 385510292 385439415
$$ packed form
3288.5D20582199o79130j18790Q8234j80092L1280j38893n34286n48859r23919r04160
3298.2D16673584j13449q7052o7749Q6556k47841K28806M2152q06580n79414l95508
3307.8D14733505j120300j320610k11563J17378J34392J61781m58031o18019p56073
3316.5D10662460q77800j043396o91185j90735k68325j56823k72483j54877l32871
3325.2D06673965q92829j054993r60159o39725n22194o63033p73315J65329j45493
3333.8D01187553j271095n36003r44748j091461l50456o39763m6883M4785q42629p96776
3343.5C94712524o77490r09500r71413j069145o15349J42022J51939l87459p67784
3352.2C89608345l20091o2103o61393j019859o41708k66304k48375l71666n06554p0877
$$ plain form
3361.8 385439415 385345039 384565239 383595848 382786674 382271004 381587029 380917091 380859871 380814323 380594292
3371.4 380594292 380704613 380578804 379822044 378888741 378073502 377885475 377710571 377251587 376861954 376321487
3381.1 376321487 376205978 376259880 376070404 375723991 375178719 374624710 374413338 374754257 374631348 374175529
3390.7 374175529 374212837 373898048 372881546 372156372 371948090 372036514 372019272 371612282 372107735 372832718
3400.4 372832718 372156105 371425934 371478806 371221504 370316849 369859734 370133743 370696144 370979042 370647240
3410 370647240 370028839 369532166 369655647 369834366 369620018 369169083 369319153 369717674 369413567 369480743
3419.7 369480743 369365005 369341545 369663315 369242172 368838539 369088478 370018616 370587540 370924988 371010742
3429.3 371010742 370768394 371086159 371352425 371469917 371331673 371404381 371231613 370961723 371858940 372414780
$$ packed form
3361.8C85439415r4376p79800r69391q09174n15670o83975o69938n7220m5548k20031
3371.4C80594292J10321j25809p56760r33303q15239j88027j74904m58984l89633n40467
3381.1C76321487j15509N3902j89476l46413n45272n54009k11372L40919j22909m55819
3390.7C74175529L7308l14789j016502p25174k08282Q8424j7242m06990M95453P24983
3400.4C72832718o76613p30171N2872k57302r04655m57115K74009N62401K82898l31802
3410C70647240o18401m96673J23481J78719k14348m50935J50070L98521l04107O7176
3419.7C69480743j15738k3460L21770m21143m03633K49939R30138N68924L37448Q5754
3429.3C71010742k42348L17765K66266J17492j38244P2708j72768k69890Q97217N55840
$$ plain form
3439 372414780 372387428 372798386 373201637 372624435 372622337 373247910 373372154 374049606 374442177 375108185
3448.6 375108185 375859528 376230431 376812515 376652412 376527405 376753616 377455635 378201180 378532257 379181099
3458.2 379181099 380152512 380977478 380859489 380862007 381068001 381213646 381980705 383221817 384244804 384656715
3467.9 384656715 385642471 386329956 386620865 387219429 387722855 387984619 387892685 388557472 389539452 390782356
3477.5 390782356 391707802 391947670 392500381 392672997 392634850 392636223 393544273 394724922 395581932 396728401
3487.2 396728401 397333488 398124771 398888016 399222145 399716301 400553284 401247787 401705971 402426872 402966499
3496.8 402966499 403971367 405104065 405965958 406320343 406720428 407603569 407473373 408139267 409730530
3505.5 409730530 410844650 411502190 412698593 413469048 412999916 414121933 415013084 415680618 416789780
$$ packed form
3439C72414780k7352M10958M03251n77202k098O25573J24244O77452L92571O66008
3448.6C75108185P51343L70903N82084j60103j25007K26211P02019P45545L31077O48842
3458.2C79181099R71413Q24966j17989K518K05994J45645P67059J241112J022987M11911
3467.9C84656715R85756O87485K90909N98564N03426K61764r1934O64787R81980J242904
3477.5C90782356R25446K39868N52711J72616l8147J373R08050J180649Q57010J146469
3487.2C96728401O05087P91283P63245L34129M94156Q36983O94503M58184P20901N39627
3496.8D02966499J004868J132698Q61893L54385M00085Q83141j30196O65894J591263
3505.5D09730530J114120O57540J196403P70455m69132J122017Q91151O67534J109162
$$ plain form
3514.2 416789780 417829971 419148483 419539986 420609055 421595993 421406860 421894341 423334007 424391632
3522.9 424391632 424345436 425588570 427235184 428317642 429232674 429960594 430659103 431631126 432388382
3531.5 432388382 432775993 433987770 435036201 436502342 437318153 437514038 439214020 440191002 441102943
3540.2 441102943 441741600 442661743 444204712 445440865 446383972 446704865 448391991 448987961 450407410
3548.9 450407410 452436028 453622513 454770432 453973618 455730400 457636223 459358368 461838074
3556.6 461838074 462355194 463290291 464105225 464775810 465179405 466903076 468051987 468691139 472891808
3565.3 472891808 473260880 472781944 473696671 474063873 477070503 478833542 480769157 482403755 484488373
3574 484488373 486237793 487086678 488634415 489049759 490804329 492192345 493199158 495333786 497920609
$$ packed form
3514.2D16789780J040191J318512L91503J069069R86938j89133M87481J439666J057625
3522.9D24391632m6196J243134J646614J082458R15032P27920O98509R72023P57256
3531.5D32388382L87611J211777J048431J466141Q15811J95885J699982R76982R11941
3540.2D41102943O38657R20143J542969J236153R43107L20893J687126N95970J419449
3548.9D50407410K028618J186485J147919p96814J756782J905823J722145K479706
3556.6D61838074N17120R35097Q14934O70585M03595J723671J148911O39152M200669
3565.3D72891808L69072m78936R14727L67202L006630J763039J935615J634598K084618
3574D84488373J749420Q48885J547737M15344J754570J388016J006813K134628K586823
$$ plain form
3582.6 497920609 500015678 501020546 504265404 504742584 502773437 503588524 504044456 508147278 511953087
3591.3 511953087 514631538 514954376 516629829 520630493 519227524 521126060 524095612 524605141 526994781
3600 526994781 527507019 529108200 532006683 533961334 536871605 540514183 542503052 541317368 543638077
3608.7 543638077 542743645 543281212 550468216 551568604 550261841 553577385 553529091 558552513 563189049
3617.4 563189049 562457123 562705002 562159386 564823189 569162216 572888031 576015663 578763390 580718842
3626 580718842 582545586 587488365 585876846 578264885 583288918 589208946 595278053 596566315 595669289
3634.7 595669289 598871384 602265930 604251060 604244347 605846329 609130211 612132454 613378639 614564247
3643.4 614564247 618053246 622332039 627133102 625190811 624171829 630374718 628664246 624362831
$$ packed form
3582.6D97920609K095069J004868L244858M77180j969147Q15087M55932M102822L805809
3591.3E11953087K678451L22838J675453M000664j402969J898536K969552N09529K389640
3600E26994781N12238J601181K898483J954651K910271L642578J988869j185684K320709
3608.7E43638077q94432N37567P187004J100388j306763L315544m8294N023422M636536
3617.4E63189049p31926K47879n45616K663803M339027L725815L127632K747727J955452
3626E80718842J826744M942779j611519p611961N024033N920028O069107J288262q97026
3634.7E95669289L202095L394546J985130o713J601982L283882L002243J246185J185608
3643.4F14564247L488999M278793M801063j942291j018982O202889j710472m301415
$$ plain form
3651.1 624362831 625771942 633133926 638356895 642240753 645537338 637849808 640971756 646304932
3658.8 646304932 648151627 650545197 651784134 654074631 655371246 657320099 659630203 660466461
3666.5 660466461 663961487 664942322 662967300 663257675 659036102 662932587 671734772 679413757 673685226
3675.2 673685226 655929031 662540359 672080917 677449570 675652084 676244507 679767609 682047653
3682.9 682047653 683020630 683184280 684151459 688140564 692589645 682436829 680364990 687632294 682085953
3691.6 682085953 684109039 690196915 690977402 692299500 692138138 692021713 693891068 694957581 697558823
3700.3 697558823 699226227 693873825 693021698 697702332 698603363 699030533 700580978 703275757 706893997
3709 706893997 698701935 700802536 703870239 691896210 697278519 701222916 701915512 703415756 705989990
$$ packed form
3651.1F24362831J409111P361984N222969L883858L296585p687530L121948N333176
3658.8F46304932J846695K393570J238937K290497J296615J948853K310104Q36258
3666.5F60466461L495026R80835j975022K90375m221573L896485Q802185P678985n728531
3675.2F73685226j7756195O611328R540558N368653j797486N92423L523102K280044
3682.9F82047653R72977J63650R67179L989105M449081j0152816k071839P267304n546341
3691.6F82085953K023086O087876P80487J322098j61362j16425J869355J066513K601242
3700.3F97558823J667404n352402q52127M680634R01031M27170J550445K694779L618240
3709G06893997q192062K100601L067703j1974029N382309L944397O92596J500244K574234
$$ plain form
3717.7 705989990 707711792 704287415 705949249 711611633 707260132 703057785 707490082 707529297 706142807
3726.3 706142807 703620911 704966354 709559555 710523300 714932861 711267471 704197769 711665955
3734 711665955 709281311 701605225 703013458 704815292 706869202 710765991 713796997 710810852 714358063
3742.7 714358063 724257507 710747604 695797729 706844177 713455582 718917313 714588547 704112473
3750.4 704112473 714498825 708509903 702942123 709711151 714415741 717478333 712365723 714901505
3758.2 714901505 719653244 711469193 711178284 715468750 716593704 716826782 719868851 716920776 713382645
3766.8 713382645 717466812 721210937 719721832 710939941 714058075 718175583 718047104 718369141 718195343
3775.5 718195343 719796524 720496902 722388153 720905380 713117142 716396866 718816833 720012894
$$ packed form
3717.7G05989990J721802l424377J661834N662384m351501m202347M432297L9215j386490
3726.3G06142807k521896J345443M593201R63745M409561l665390p069702P468186
3734G11665955k384644p676086J408233J801834K053910L896789L031006k986145L547211
3742.7G14358063R899444j3509903j4949875J1046448O611405N461731m328766j0476074
3750.4G04112473J0386352n988922n567780O769028M704590L062592n112610K535782
3758.2G14901505M751739q184051k90909M290466J124954K33078L042069k948075l538131
3766.8G13382645M084167L744125j489105q781891L118134M117508j28479L22037j73798
3775.5G18195343J601181P00378J891251j482773p788238L279724K419967J196061
$$ plain form
3783.2 720012894 721407242 717573471 717403107 719434357 720411148 720457230 720023117 720254211 719776230
3791.9 719776230 720172882 720487900 722185211 725321808 720696869 715948715 718583603 723780365 729453354
3800.6 729453354 720992737 711583099 715825348 718484726 723349915 727414093 715562286 713166046
3808.3 713166046 719547958 722679901 723010178 722823792 722619400 723871765 728462372 724469604 712972107
3817 712972107 719451065 724784317 728313065 727421570 709353561 713377991 720014038 722388992 724385300
3825.7 724385300 723330460 719521027 720603943 722917404 726325455 726312485 717145386 720738220 728100281
3834.3 728100281 723325195 722731628 728849792 718442688 715136642 722122116 716487274 718466721
3842.1 718466721 725667877 723035278 720199432 723327560 724919891 725199890 726299133 724518433
$$ packed form
3783.2G20012894J394348l833771j70364K031250R76791M6082m34113K31094m77981
3791.9G19776230L96652L15018J697311L136597m624939m748154K634888N196762N672989
3800.6G29453354q460617r409638M242249K659378M865189M064178j1851807k396240
3808.3G13166046O381912L131943L30277j86386k04392J252365M590607l992768j1497497
3817G12972107O478958N333252L528748q91495j8068009M024430O636047K374954J996308
3825.7G24385300j054840l809433J082916K313461L408051j2970r167099L592834P362061
3834.3G28100281m775086n93567O118164j0407104l306046O985474n634842J979447
3842.1G18466721P201156k632599k835846L128128J592331K79999J099243j780700
$$ plain form
3849.8 724518433 726862488 732244339 723412933 720762253 707226868 711731186 722404785 721477127
3857.5 721477127 719936752 723261566 726379471 727188492 720526733 721064987 726776962 720056458 716659241
3866.2 716659241 722373581 728161469 732903671 722187195 713756714 718396378 724030457 726338806
3873.9 726338806 717872009 719704895 724180527 725342178 727581940 730183334 721981812 715603867
3881.6 715603867 722728500 724162903 725111465 727726440 715370636 719101791 724045563 724560699
3889.3 724560699 727828674 725526733 717187195 719695435 723568954 722803955 723958664 724651031 726413498
3898 726413498 726918335 718688583 724401398 726077728 720674896 723053055 718662415 719164276 721515274
3906.7 721515274 722437820 723744354 723164978 723129425 723307953 724059677 723989258 723618469 724954834 725624313
$$ packed form
3849.8G24518433K344055N381851q831406k650680j3535385M504318J0673599r27658
3857.5G21477127j540375L324814L117905Q09021o661759N38254N711975o720504l397217
3866.2G16659241N714340N787888M742202j0716476q430481M639664N634079K308349
3873.9G26338806q466797J832886M475632J161651K239762K601394q201522o377945
3881.6G15603867P124633J434403R48562K614975j2355804L731155M943772N15136
3889.3G24560699L267975k301941q339538K508240L873519p64999J154709O92367J762467
3898G26413498N04837q229752N712815J676330n402832K378159m390640N01861K350998
3906.7G21515274R22546J306534n79376l5553J78528P51724p0419l70789J336365O69479
$$ plain form
3916.3 725624313 721346741 719160995 723589401 723165283 720302887 723309326 725191956 724999619 721529846
3925 721529846 719828873 722411270 723444519 723746262 722576141 722619019 724353561 721217041 719859924
3933.7 719859924 721593781 722222672 722804184 722845154 722270508 721907578 722119598 723799591 724205704
3942.3 724205704 720516739 720647354 722459946 722982178 724023895 722390442 722255402 722136536 720208206
3951 720208206 721935883 722925110 722979279 722900009 722613831 722509842 721511917 721941223 722057877 722845154
3960.7 722845154 723333740 721803741 722346649 722517090 721841660 722026978 722176514 721930466 721591949
3969.3 721591949 721998367 722412949 722231216 721857986 721850586 721920624 721700897 721173553 720811691 721222076
3979 721222076 722140884 722908096 722849121 722139130 721628342 722388535 722833176 721957703 721743774 722174301
$$ packed form
3916.3G25624313m277572k185746M428406m24118k862396L006439J882630j92337l469773
3925G21529846j700973K582397J033249L01743j170121M2878J734542l136520j357117
3933.7G19859924J733857O28891N81512M0970n74646l62930K12020J679993M06113
3942.3G24205704l688965J30615J812592N22232J041717j633453j35040j18866j928330
3951G20208206J727677R89227N4169p9270k86178j03989r97925M29306J16654P87277
3960.7G22845154M88586j529999N42908J70441o75430J85318J49536k46048l38517
3969.3G21591949M06418M14582j81733l73230p400P0038k19727n27344l61862M10385
3979G21222076R18808P67212n8975p09991n10788P60193M44641q75473k13929M30527
$$ plain form
3988.6 722174301 722547302 721859512 721430588 722183838 722556229 722664871 721893921 721686249 722557602 722592545
3998.3 722592545 722373734 722125549
4000.2 722125549
$$ packed form
3988.6G22174301L73001o87790m28924P53250L72391J08642p70950k07672Q71353L4943
3998.3G22592545k18811k48185
4000.2G22125549
##END=$$ End of the data block
