##TITLE=$$ Begin of the data block
##JCAMP-DX=5.00 $$ ACD/SpecManager v 10.08
##SPECTROMETER/DATA SYSTEM=Varian
##DATE=08 Jan 2013 15:30:38
##DATA TYPE=INFRARED SPECTRUM
##DATA CLASS=XYDATA
##ORIGIN=
##OWNER=
##NPOINTS=3735
##FIRSTX=399.26403809
##LASTX=4000.35498047
##MAXX=4000.35498047
##MINX=399.26403809
##MAXY=78.44716644
##MINY=36.67682266
##XFACTOR=1.0000000000
##YFACTOR=0.000000100000000
##FIRSTY=55.26081467
##DELTAX=0.96440572
##XUNITS=1/CM
##YUNITS=TRANSMITTANCE
##XYDATA=(X++(Y..Y))
$$ plain form
399.3 552608147 551449089 557503662 549382553 542641640 542123146 548150673 551433640 553743477 560475883
407.9 560475883 567227173 562013283 548651581 545784721 546257591 547945747 555455704 562718430
415.7 562718430 569548454 573207550 561090813 545404930 546954193 547214890 548227272 550473862
423.4 550473862 553377075 559254532 559609642 555001335 555249710 557069321 551511650 548572311 550086136
432.1 550086136 548737450 550229759 552077446 555824394 559301071 555169220 551486053 552108498 551798859
440.7 551798859 551150970 554915314 552626648 550514297 555203896 558191566 556285362 551471062 551223907
449.4 551223907 556500435 556165771 551693497 554680099 556483231 556428757 563330078 565655441 553255692
458.1 553255692 546728172 549737625 553602715 553550377 558548813 559137917 556084480 556352844 554587402
$$ packed form
399.3E52608147j159058O054573q121109o740913n18494O027527L282967K309837O732406
407.9E60475883O751290n213890j3361702k866860M72870J688156P509957P262726
415.7E62718430O830024L659096j2116737j5685883J549263K60697J012382K246590
423.4E50473862K903213N877457L55110m608307K48375J819611n557671k939339J513825
432.1E50086136j348686J492309J847687L746948L476677m131851l683167O22445l09639
440.7E51798859o47889L764344k288666k112351M689599K987670j906204m814300k47155
449.4E51223907N276528l34664m472274K986602J803132n4474O901321K325363j2399749
458.1E53255692o527520L009453L865090n2338M998436N89104l053437K68364j765442
$$ plain form
466.8 554587402 551922607 548244095 547611504 548956375 548592987 545005150 543884354 549964409 552098618
475.5 552098618 547726822 544468536 544004745 543247604 543931847 551178513 554844551 549592400 543264580
484.1 543264580 542149773 544424629 545404015 543818626 541107635 542329979 547335205 549130478 549084702
492.8 549084702 548455315 547052383 547187004 543069420 538970947 540315514 544393883 549812660 549343491
501.5 549343491 546411514 546725845 543118286 538890648 538750000 538904800 539731140 542600632 543748131
510.2 543748131 546547928 548151703 543773651 540708771 538612061 535528488 532759819 534808960
517.9 534808960 538002930 539401627 542885208 541871605 537738113 535460815 534444237 533553085 532766266
526.6 532766266 534673271 536983490 538414688 535921288 534449883 535953407 535058784 535361977 534799042
$$ packed form
466.8E54587402k664795l678512o32591J344871l63388l587837j120796O080055K134209
475.5E52098618m371796l258286m63791p57141O84243P246666L666038n252151o327820
484.1E43264580j114807K274856R79386j585389k710991J222344N005226J795273m5776
492.8E49084702o29387j402932J34621m117584m098473J344567M078369N418777m69169
501.5E49343491k931977L14331l607559m227638j40648J54800Q26340K869492J147499
510.2E43748131K799797J603775m378052l064880k096710l083573k768669K049141
517.9E34808960L193970J398697L483581j013603m133492k277298j016578q91152p86819
526.6E32766266J907005K310219J431198k493400j471405J503524q94623L03193n62935
$$ plain form
535.2 534799042 533488579 533723335 534793472 535942841 534332848 532422981 531711731 533174896 533846779
543.9 533846779 533163948 533628960 533244362 533586121 532472954 530424309 530057449 529352798 528405838
552.6 528405838 529094810 529885139 529240685 530031586 529592628 528931198 528067513 526294212 527356186
561.3 527356186 526909294 526880875 528200531 527791481 527760010 529333878 530910454 530064507 529569626 529848328
570.9 529848328 530876770 531139908 529367905 529465981 530317116 530376511 528947449 527540436 527691116
579.6 527691116 527095490 525988197 525627174 525974388 526892052 529118996 530241280 530509148 530164795
588.3 530164795 528505096 529302444 529935226 528872223 529166756 530431023 531808853 531435738 529373894
597 529373894 527456474 527486572 528026848 528138275 528816490 528479080 527856827 529199181 529689980 528141708
$$ packed form
535.2E34799042j310463K34756J070137J149369j609993j909867p11250J463165O71883
543.9E33846779o82831M65012l84598L41759j113167k048645l66860p04651r46960
552.6E28405838O88972P90329o44454P90901m38958o61430q63685j773301J061974
561.3E27356186m46892k8419J319656m09050l1471J573868J576576q45947m94881K78702
570.9E29848328J028442K63138j772003R8076Q51135N9395j429062j407013J50680
579.6E27691116n95626j107293l61023L47214R17664K226944J122284K67868l44353
588.3E30164795j659699P97348O32782j063003K94533J264267J377830l73115k061844
597E29373894j917420L0098N40276J11427O78215l37410o22253J342354M90799j548272
$$ plain form
606.6 528141708 528009796 527663193 526313286 525208626 524348602 524689407 524934921 525682449 525698776 525074768
616.3 525074768 525131836 524812469 525900650 526472130 526448364 527355118 528293610 529126472 529548302 530193253
625.9 530193253 530720673 531519394 532846603 533452263 533986511 535876007 537299843 537389717 537709694
634.6 537709694 537609940 538734360 540350266 541084938 542927818 544715347 546530952 547826195 547562752
643.3 547562752 547620964 547310486 548044472 550451622 551538620 552208252 552737923 552978020 553571434 553651924
652.9 553651924 553957062 553631706 553170319 554059334 554812431 555190010 554808540 554001579 553069305 552033463
662.5 552033463 552436790 552862167 553260612 554756203 555491829 554029541 555791817 556135712 555327454
671.2 555327454 555428848 556561356 557880440 558453484 559346962 560617104 560187035 560563431 561711159
$$ packed form
606.6E28141708j31912l46603j349907j104660q60024L40805K45514P47528J6327o24008
616.3E25074768N7068l19367J088181N71480k3766R06754R38492Q32862M21830O44951
625.9E30193253N27420P98721J327209O05660N34248J889496J423836Q9874L19977
634.6E37709694r9754J124420J615906P34672J842880J787529J815605J295243k63443
643.3E47562752N8212l10478P33986K407150J086998O69632N29671K40097N93414Q0490
652.9E53651924L05138l25356m61387Q89015P53097L77579l81470q06961r32274j035842
662.5E52033463M03327M25377L98445J495591P35626j462288J762276L43895q08258
671.2E55327454J01394J132508J319084N73044Q93478J270142m30069L76396J147728
$$ plain form
679.9 561711159 561832657 562647820 563491058 564250870 565662498 566996040 567989159 568164215 567198677
688.6 567198677 566820030 568139038 568639603 567717018 567620201 568836250 570024948 570615501 570734711
697.3 570734711 570349045 570769348 571382408 571320496 571908722 572419395 572604256 573813896 575705414 576281204
706.9 576281204 575695686 575687981 576065102 576254501 575963631 576170845 577239876 578421135 580019493 581556931
716.6 581556931 581629066 580630531 580815010 580929260 580796890 582451019 584321098 586031837 587235374
725.2 587235374 586974258 586800613 588155785 588524284 587703896 589356842 591658020 593502007 594560165
733.9 594560165 594045143 594063721 594299660 593995590 593880501 595048828 596013298 596208954 596225853 596811028
743.6 596811028 598379440 598208961 598207207 598840714 599697609 601128540 601595573 602196007 602135086 603824959
$$ packed form
679.9E61711159J21498Q15163Q43238P59812J411628J333542R93119J75056r65538
688.6E67198677l78647J319008N00565r22585r6817J216049J188698N90553J19210
697.3E70734711l85666M20303O13060o1912N88226N10673J84861J209640J891518N75790
706.9E76281204n85518p705L77121J89399k90870K07214J069031J181259J598358J537438
716.6E81556931P2135r98535J84479J14250j32370J654129J870079J710739J203537
725.2E87235374k61116j73645J355172L68499q20388J652946K301178J843987J058158
733.9E94560165n15022J8578K35939l04070j15089J168327R64470J95656J6899N85175
743.6E96811028J568412j70479j754O33507Q56895J430931M67033O00434o0921J689873
$$ plain form
753.2 603824959 606293869 606263237 605844955 605482521 605588112 605670662 607350235 610027580 611636200
761.9 611636200 612700996 613176460 613951797 613254395 612238426 612803001 614010963 614231720 613961372
770.6 613961372 615149384 615662270 616386948 617213173 616937103 615550957 613521271 613638611 614118805
779.2 614118805 614723816 616734428 618643456 619272842 618951721 618729439 618205986 617758369 617428894
787.9 617428894 617838249 619547234 621656265 622534752 622388992 622426872 621674538 620703125 619635696
796.6 619635696 619543266 620499268 621174088 621721115 622215805 622752342 621369019 619143257 617123375
805.3 617123375 615495644 614917030 614769669 614994659 614452896 614641647 614654655 613292770 611122971
814 611122971 608193512 607149124 607129250 607508545 608505096 609903755 611197090 610984802 610467224 610205498
$$ packed form
753.2F03824959K468910l0632m18282l62434J05591Q2550J679573K677345J608620
761.9F11636200J064796M75464P75337o97402j015969N64575J207962K20757k70348
770.6F13961372J188012N12886P24678Q26225k76070j386146k029686J17340M80194
779.2F14118805O05011K010612J909028O29386l21121k22282n23453m47617l29475
787.9F17428894M09355J708985K109031Q78487j45760L7880p52334r71413j067429
796.6F19635696r2430R56002O74820N47027M94690N36537j383323k225762k019882
805.3F17123375j627731n78614j47361K24990n41763J88751J3008j361885k169799
814F11122971k929459j044388j9874L79295R96551J398659J293335k12288n17578k61726
$$ plain form
823.6 610205498 610413284 610401115 611679382 614921455 617791595 620867615 624160347 626937981 627789040
832.3 627789040 627776451 628434525 629190865 630314674 632874222 636382980 638596115 640888824 642245636
841 642245636 642612000 642595978 641314697 641166306 641719131 643955765 646827850 649361877 652139893
849.6 652139893 652936401 652370071 650894623 649881668 650148468 651730728 653928604 656847000 660195923
858.3 660195923 661365128 661481781 661001358 660212708 659140167 658966370 660370331 661765823 663041306
867 663041306 663662796 664222794 663321075 660939026 657472763 653865662 651891785 650852432 651803360
875.7 651803360 653720932 655126648 654779510 653876038 653127289 651435852 650315247 649188919 649392776
884.4 649392776 650354996 651664963 652665787 652636108 652910156 650473862 647331772 644996567 643802261
$$ packed form
823.6F10205498K07786j2169J278267L242073K870140L076020L292732K777634Q51059
832.3F27789040j2589O58074P56340J123809K559548L508758K213135K292709J356812
841F42245636L66364j6022j281281j48391N52825K236634K872085K534027K778016
849.6F52139893P96508n66330j475448j012955K66800J582260K197876K918396L348923
858.3F60195923J169205J16653m80423p88650j072541j73797J403961J395492J275483
867F63041306O21490N59998r01719k382049l466263l607101j973877j039353R50928
875.7F51803360J917572J405716l47138r03472p48749j691437j120605j126328K03857
884.4F49392776R62220J309967J000824k9679K74048k436294l142090k335205j194306
$$ plain form
893 643802261 644408112 646529160 650202866 651692123 651998062 651183319 648927307 646706619 644355621
901.7 644355621 642765961 642846527 645420456 647723465 650147324 652467041 652788162 652487259 651694794
910.4 651694794 651496277 651052094 651550980 652883987 653684998 654207077 653383331 652055130 649037476
919.1 649037476 645270157 642422333 640408478 639054070 638369217 638298759 637207069 635957985 633828049
927.8 633828049 629720306 624647522 619955025 617290649 616987343 618100395 619102211 620120926 620106773
936.4 620106773 618621979 617205276 615559845 613729095 612488670 612440071 613030548 614155998 614941330
945.1 614941330 614785957 613759918 611280365 609112892 607491646 607285995 608404198 609262276 610851822
953.8 610851822 612136192 611996002 609624290 605479317 601991615 599754562 598063927 597203445 597039070
$$ packed form
893F43802261O05851K121048L673706J489257L05939q14743k256012k220688k350998
901.7F44355621j589660Q0566K573929K303009K423859K319717L21121l00903p92465
910.4F51694794j98517m44183M98886J333007Q01011N22079q23746j328201l017654
919.1F49037476l767319k847824k013855j354408o84853p0458j091690j249084k129936
927.8F33828049m107743n072784m692497k664376l03306J113052J001816J018715j4153
936.4F20106773j484794j416703j645431j830750j240425m8599N90477J125450P85332
945.1F14941330j55373j026039k479553k167473j621246k05651J118203Q58078J589546
953.8F10851822J284370j40190k371712m144973l487702k237053j690635q60482j64375
$$ plain form
962.5 597039070 596861687 596963615 596075516 593608932 590313072 586844177 584578667 583624992 583046799
971.2 583046799 582583580 582714119 582480431 580832558 577353020 572751999 568955612 565517235 562133293
979.8 562133293 559659500 558353767 556816864 554248085 551019020 546721840 541778030 536750565
987.6 536750565 532787170 530443611 528428001 526627350 525500488 524306984 522827530 520630074
995.3 520630074 517156296 513091888 509970703 507330933 504808960 504842491 505680084 504970016 503037453
1004 503037453 500462151 497445564 493339386 490219460 488684769 488134499 487471504 486709213 486550293
1012.6 486550293 484797783 482559433 479726219 476352730 473031616 469356079 467527466 467161598
1020.3 467161598 466672935 465063782 463865929 462019348 458248253 454703445 452366371 451687622 451162567
$$ packed form
962.5E97039070j77383J01928q88099k466584l295860l468895k265510r53675n78193
971.2E83046799m63219J30539k33688j647873l479538m601021l796387l438377l383942
979.8E62133293k473793j305733j536903k568779l229065m297180m943810n027465
987.6E36750565l963395k343559k015610j800651j126862j193504j479454k197456
995.3E20630074l473778m064408l121185k639770k521973L3531Q37593p10068j932563
1004E03037453k575302l016587m106178l119926j534691n50270o62995p62291j58920
1012.6D86550293j752510k238350k833214l373489l321114l675537j828613l65868
1020.3D67161598m88663j609153j197853j846581l771095l544808k337074o78749n25055
$$ plain form
1029 451162567 452241020 453962631 454647217 454980583 454573135 453557854 452243271 452504959 452563286
1037.7 452563286 453868065 457448349 460152359 462528305 464344177 464917450 463843765 462356339
1045.4 462356339 460683708 459710045 459821129 459902496 460411453 459660378 459016914 457677536 455460434
1054.1 455460434 453505936 451372643 450599213 450198936 451472702 453284912 455232162 456981354 458338318
1062.8 458338318 460244446 460067940 460023689 460657158 462004128 463767319 466104050 469300804 470851250
1071.5 470851250 471307716 469364510 467422256 466501999 465477524 465748405 466945763 469564743 470893135
1080.1 470893135 471077957 471132584 470132446 468025551 466262207 465856705 466186943 468619995 471211357
1088.8 471211357 474449883 476665726 476699409 476808968 475493202 474484787 474476967 476083679 478111763
$$ packed form
1029D51162567J078453J721611O84586L33366m07448j015281j314583K61688N8327
1037.7D52563286J304779L580284K704010K375946J815872N73273j073685j487426
1045.4D62356339j672631r73663J11084Q1367N08957p51075o43464j339378k217102
1054.1D55460434j954498k133293p73430m00277J273766J812210J947250J749192J356964
1062.8D58338318J906128j76506m4251O33469J346970J763191K336731L196754J550446
1071.5D70851250M56466j943206j942254r20257j024475K70881J197358K618980J328392
1080.1D70893135J84822N4627j000138k106895j763344m05502L30238K433052K591362
1088.8D71211357L238526K215843L3683J09559j315766j008415p820J606712K028084
$$ plain form
1097.5 478111763 480403214 484221497 486755753 488114204 488087463 487466850 486902161 486657562 487847557
1106.2 487847557 490335655 493401909 495308495 496386414 496034355 495113640 494376526 493728523 493989830
1114.9 493989830 495048676 497524033 499517250 501177483 502325478 502516975 502009850 499799652 497885094
1123.5 497885094 497138596 498199921 499887924 501626968 504276733 506739388 508728180 509246216 508756447
1132.2 508756447 507822609 507798157 509601936 512615356 516325798 519521751 522346115 523849792 524159737
1140.9 524159737 523309402 521747513 521480331 522505226 524549675 526679153 528774261 529855728 529868050
1149.6 529868050 529710960 527987671 525364609 523587151 523615417 524943542 526651459 527839050 528195229
1158.3 528195229 528127289 526561737 524448662 522702522 521591492 521610069 522656136 525510063 529303741
$$ packed form
1097.5D78111763K291451L818283K534256J358451k6741o20613n64689k44599J189995
1106.2D87847557K488098L066254J906586J077919l52059r20715p37114o48003K61307
1114.9D93989830J058846K475357J993217J660233J147995J91497n07125k210198j914558
1123.5D97885094p46498J061325J688003J739044K649765K462655J988792N18036m89769
1132.2E08756447r33838k4452J803779L013420L710442L195953K824364J503677L09945
1140.9E24159737q50335j561889k67182J024895K044449K129478K095108J081467J2322
1149.6E29868050j57090j723289k623062j777458K8266J328125J707917J187591L56179
1158.3E28195229o7940j565552k113075j746140j111030J8577J046067K853927L793678
$$ plain form
1166.9 529303741 532618027 534882317 536215706 536459312 536619835 537503128 539301338 542583237 546681938
1175.6 546681938 551426506 555423203 558145485 559885750 559574890 558636208 558969193 560214233 562762413
1184.3 562762413 566442299 569675865 571997681 573172760 572763519 571035805 569239006 568165932
1192 568165932 568735924 570525246 572272034 574236336 575845680 576188278 574733582 571621170 568305855
1200.7 568305855 566371765 565520096 565815811 567993088 569817352 570029221 569416847 567912827 565705528
1209.4 565705528 563386459 561809387 561299591 561888771 563457413 565327911 566539917 566554146 565385971
1218 565385971 563144417 560625458 558522224 557810555 558704414 560523338 562621994 563637962 563241844
1226.7 563241844 561583977 559175835 557045822 555006523 553733177 554049301 555671692 557951965
$$ packed form
1166.9E29303741L314286K264290J333389K43606J60523Q83293J798210L281899M098701
1175.6E46681938M744568L996697K722282J740265l10860r38682L32985J245040K548180
1184.3E62762413L679886L233566K321816J175079m09241j727714j796799j073074
1192E68165932N69992J789322J746788J964302J609344L42598j454696l112412l315315
1200.7E68305855j934090q51669K95715K177277J824264K11869o12374j504020k207299
1209.4E65705528k319069j577072n09796N89180J568642J870498J212006J4229j168175
1218E65385971k241554k518959k103234p11669Q93859J818924K098656J015968l96118
1226.7E63241844j657867k408142k130013k039299j273346L16124J622391K280273
$$ plain form
1234.4 557951965 559146729 558955460 557857704 556082153 554155235 552241554 551389847 552218552 554215012
1243.1 554215012 556477318 557778854 557662888 556524658 554392967 551620827 550052795 550023384 550886765
1251.8 550886765 552811050 554588776 555833778 556344185 555373154 553670807 551836090 549942703 548868370
1260.5 548868370 549861374 552205582 555147781 557891922 558861465 557834473 556331940 555071526 554168510
1269.2 554168510 554275513 555714111 558335953 561419640 563944931 565170631 565068665 563873177 562423973
1277.8 562423973 561717567 562057724 563753128 566555824 569316139 571744270 573835602 574261780 573337746
1286.5 573337746 572216568 571317215 571568413 572984352 575339890 578093224 580544167 581610718 581053467
1295.2 581053467 579564095 577712402 576886063 576348457 576535416 578416367 581054344 583356895 583984146
$$ packed form
1234.4E57951965J194764j91269j097756j775551j926918j913681q51707Q28705J996460
1243.1E54215012K262306J301536j15966j138230k131691k772140j568032k9411Q63381
1251.8E50886765J924285J777726J245002N10407r71031j702347j834717j893387j074333
1260.5E48868370R93004K344208K942199K744141R69543j026992j502533j260414r03016
1269.2E54168510J07003J438598K621842L083687K525291J225700j01966j195488j449204
1277.8E62423973p06406L40157J695404K802696K760315K428131K091332M26178r24034
1286.5E73337746j121178q99353K51198J415939K355538K753334K450943J066551n57251
1295.2E81053467j489372j851693q26339n37606J86959J880951K637977K302551O27251
$$ plain form
1303.9 583984146 583285599 581525726 579134178 576730270 575435677 575782204 577042122 578600349 579684296
1312.5 579684296 580036583 578662109 576146736 573746452 571754646 571131973 571866150 573866196 576659012
1321.2 576659012 579139557 580194931 580002327 578860207 576739388 575304909 574995461 575415497 576637344
1329.9 576637344 578244247 579504585 579738693 578765678 576636925 574192047 571962547 571351509 571593056
1338.6 571593056 571998367 574502716 577651863 579488182 579562073 578504524 577131233 576042442 575626335
1347.3 575626335 575885239 577793274 580277863 582068825 582558517 581725235 580008698 577188873 575150108
1355.9 575150108 574236946 574781685 576475830 577853279 578642044 578880234 578220558 575505676 574486580
1364.6 574486580 573108063 571504631 571237717 571314316 573314285 574994507 575541954 575332794 573566246
$$ packed form
1303.9E83984146o98547j759873k391548k403908j294593L46527J259918J558227J083947
1312.5E79684296L52287j374474k515373k400284j991806o22673P34177K000046K792816
1321.2E76659012K480545J055374j92604j142120k120819j434479l09448M20036J221847
1329.9E76637344J606903J260338K34108r73015k128753k444878k229500o11038K41547
1338.6E71593056M05311K504349L149147J836319P3891j057549j373291j088791m16107
1347.3E75626335K58904J908035K484589J790962M89692q33282j716537k819825k038765
1355.9E75150108r13162N44739J694145J377449P88765K38190o59676k714882j019096
1364.6E74486580j378517j603432k66914P6599J999969J680222N47447k09160j766548
$$ plain form
1373.3 573566246 569899178 567548676 568016205 568547554 569646988 571842613 573796082 574634590 573833466
1382 573833466 571720200 568814545 566480064 565485687 565228539 565277939 567136269 568641930 568427849
1390.7 568427849 567297058 565073814 562692223 558303528 554318771 554058571 554494247 554859543 553547096
1399.3 553547096 553357811 552505608 549743958 547106209 544008408 540171127 539313965 540192146 540700302
1408 540700302 540774193 540387497 538924179 536543388 533497772 531214638 529537506 528886185 528877182 529426117
1417.7 529426117 529954071 526900368 527654152 528081169 526495132 524927864 522835846 524277344 526351700
1426.3 526351700 527574844 529502678 530416603 529886513 529548416 529772644 529182205 529264908 531101532
1435 531101532 532056465 531299553 534882736 539019775 540210533 540387764 540404167 539726486 540229492 540713272
$$ packed form
1373.3E73566246l667068k350502M67529N31349J099434K195625J953469Q38508q01124
1382E73833466k113266k905655k334481r94377k57148M9400J858330J505661k14081
1390.7E68427849j130791k223244k381591m388695l984757k60200M35676L65296j312447
1399.3E53547096j89285q52203k761650k637749l097801l837281q57162Q78181N08156
1408E40700302P3891l86696j463318k380791l045616k283134j677132o51321r003N48935
1417.7E29426117N27954l053703P53784M27017j586037j567268k092018J441498K074356
1426.3E26351700J223144J927834R13925n30090l38097K24228n90439Q2703J836624
1435E31101532R54933p56912L583183M137039J190758J77231J6403o77681N03006M83780
$$ plain form
1444.7 540713272 542828712 545305138 546764145 547358513 548998032 550689163 549850540 549255219 549633904
1453.3 549633904 551134186 552773933 553910332 553734055 553840561 559105263 561021919 562443924 562837563
1462 562837563 563652191 565323181 564218597 568093987 572200050 576010323 578372993 579587326 581253052
1470.7 581253052 580288811 579076347 581456718 587542305 591896133 593868637 597488480 600545654
1478.4 600545654 601839333 601845360 601131935 601407547 603140564 605294571 607810249 610195007 610652924
1487.1 610652924 610854454 611328545 607400436 604837608 606882629 608623199 609323654 610340462 610261574
1495.8 610261574 606338387 608599205 607716484 603599701 602939835 600859528 600357170 601854095 604378929
1504.5 604378929 605308456 596332169 589628143 592357903 594191399 593665924 595078964 594292908 593862457
$$ packed form
1444.7E40713272K115440K476426J459007N94368J639519J691131q38623n95321L78685
1453.3E49633904J500282J639747J136399j76277J06506N264702J916656J422005L93639
1462E62837563Q14628J670990j104584L875390M106063L810273K362670J214333J665726
1470.7E81253052r64241j212464K380371O085587M353828J972504L619843L057174
1478.4F00545654J293679O027p13425K75612J733017K154007K515678K384758M57917
1487.1F10652924K01530M74091l928109k562828K045021J740570P00455J016808p8888
1495.8F10261574l923187K260818q82721m116783o59866k080307n02358J496925K524834
1504.5F04378929R29527q976287o704026K729760J833496n25475J413040p86056m30451
$$ plain form
1513.1 593862457 596081848 596596260 596723442 594286537 590600510 592320023 593200455 589678459 586293221
1521.8 586293221 587985992 591406784 594197845 593305397 593780365 593860359 592206497 592481728 592636833
1530.5 592636833 592253571 592158737 591976509 591658211 594368706 595975380 596487465 597028122 588934555
1539.2 588934555 581628380 585779037 587897987 589809303 592888031 593506813 592918968 595352249 595400238
1547.9 595400238 594715118 591812859 591230736 594909286 596912575 598412056 595619087 596318245 598347702
1556.5 598347702 598451653 590745354 567839622 583787117 590982361 594300423 595647659 595744057
1564.2 595744057 592775574 590563698 590350647 588108253 584873161 577251396 579401169 580721054
1572 580721054 579553146 578421936 576182251 573020554 561091919 561992836 560877991 558029594 555704346
$$ packed form
1513.1E93862457K219391N14412J27182k436905l686027J719513Q80432l521996l385238
1521.8E86293221J692771L420792K791061q92448M74968P9994j653862K75231J55105
1530.5E92636833l83262r4834j82228l18298K710495J606674N12085N40657q093567
1539.2E88934555p306175M150657K118950J911316L078728O18782n87845K433281M7989
1547.9E95400238o85120k902259n82123L678550K003289J499481k792969O99158K029457
1556.5E98347702J03951p706299k2905732J5947495P195244L318062J347236R6398
1564.2E95744057k968483k211876k13051k242394l235092p621765K149773J319885
1572E80721054j167908j131210k239685l161697j1928635R00917j114845k848397k325248
$$ plain form
1580.6 555704346 552550659 551244698 547898216 545254440 540989113 536780128 532924080 528514862
1588.4 528514862 526008148 521975060 520163307 516934013 514756317 511390762 506631851 504067993
1596.1 504067993 499738770 497434158 493602257 491924934 489721222 487571602 486231728 482379341
1603.8 482379341 480852966 477326050 475412445 472765121 471086731 469372864 467304268 468052940
1611.5 468052940 465877571 465390549 463109436 462689590 461239166 453195686 455903625 455612488 456956596
1620.2 456956596 456415634 457378426 455991745 451650276 453466835 453255653 454219627 451564217 452636566
1628.9 452636566 454137230 454777527 455767059 455751686 457561493 456657181 453799591 452603302 455060196
1637.5 455060196 457624397 459601784 461804504 462022133 464410362 464776115 466445885 467602158 465610428
$$ packed form
1580.6E55704346l153687j305961l346482k643776m265327m208985l856048m409218
1588.4E28514862k506714m033088j811753l229294k177696l365555m758911k563858
1596.1E04067993m329223k304612l831901j677323k203712k149620j339874l852387
1603.8D82379341j526375l526916j913605k647324j678390j713867k068596P48672
1611.5D68052940k175369m87022k281113m19846j450424q043480K707939k91137J344108
1620.2D56956596n40962R62792j386681m341469J816559k11182R63974k655410J072349
1628.9D52636566J500664O40297R89532j5373J809807r04312k857590j196289K456894
1637.5D55060196K564201J977387K202720K17629K388229L65753J669770J156273j991730
$$ plain form
1646.2 465610428 466546059 466272507 471811333 474466248 478242226 481419029 479258347 475439987 477750092
1654.9 477750092 482871056 485047760 487814827 489639473 492185593 494929276 496860809 498155441
1662.6 498155441 497656860 501584206 504226761 506853371 509264145 511014671 512191086 514384880
1670.3 514384880 519068222 520780487 524654198 528141174 529066849 530205765 533889847 538146591
1678 538146591 540735817 543528709 545084496 549532166 553794518 552300835 551587029 556091194 562989235
1686.7 562989235 566735420 569782677 573647690 576538391 580474167 583716965 586741905 590149689
1694.4 590149689 592812004 590326576 595910683 602540283 608404083 608573837 603542061 612070808
1702.1 612070808 617508812 620605698 621607780 622704430 625129128 629454002 633817444 635332527
$$ packed form
1646.2D65610428R35631k73552N538826K654915L775978L176803k160682l818360K310105
1654.9D77750092N120964K176704K767067J824646K546120K743683J931533J294632
1662.6D98155441m98581L927346K642555K626610K410774J750526J176415K193794
1670.3E14384880M683342J712265L873711L486976R25675J138916L684082M256744
1678E38146591K589226K792892J555787M447670M262352j493683p13806M504165O898041
1686.7E62989235L746185L047257L865013K890701L935776L242798L024940L407784
1694.4E90149689K662315k485428N584107O629600N863800J69754n031776Q528747
1702.1F12070808N438004L096886J002082J096650K424698M324874M363442J515083
$$ plain form
1709.9 635332527 636215401 638362389 640126419 640906754 639727974 641201630 645368423 646262131 641641617
1718.5 641641617 646634521 650204926 651767120 652579498 652037506 652519989 654465714 656567001 658404388
1727.2 658404388 660416183 662134247 660156631 660067139 663302460 664819717 660038452 657689285 664669189
1735.9 664669189 669366531 671723862 673950119 672257462 670788116 674921875 676937485 676708679
1743.6 676708679 679222183 683245316 686312103 688429108 689555511 690952530 695951462 696243134
1751.3 696243134 696034393 700958633 704222107 707638168 710337372 710061798 712447510 715541687 717898941
1760 717898941 720078201 718003693 718620682 722558212 724614868 726702957 729353867 729920197 727042313
1768.7 727042313 729764862 733374023 731380005 727988510 729297791 734501190 736766739 736805649 739509354
$$ packed form
1709.9F35332527Q82874K146988J764030P80335j178780J473656M166793Q93708m620514
1718.5F41641617M992904L570405J562194Q12378n41992M82483J945725K101287J837387
1727.2F58404388K011795J718064j977616q9492L235321J517257m781265k349167O979904
1735.9F64669189M697342K357331K226257j692657j469346M133759K015610k28806
1743.6F76708679K513504M023133L066787K117005J126403J397019M998932K91672
1751.3F96243134k08741M924240L263474L416061K699204k75574K385712L094177K357254
1760G17898941K179260k074508O16989L937530K056656K088089K650910N66330k877884
1768.7G27042313K722549L609161j994018l391495J309281N203399K265549L8910K703705
$$ plain form
1777.4 739509354 740213470 740647430 740160675 738996964 740446472 742766342 744495468 743930588 744924927
1786 744924927 746724701 747405701 747647171 748022995 747556152 747006226 745303955 746726074 751423950
1794.7 751423950 752595062 751872025 753374710 754835815 753934174 752063293 753909531 754249420 755683441
1803.4 755683441 758074036 758649216 759461975 759375839 759134979 759812088 759883575 758017120 758519669 760579300
1813 760579300 762106247 763685532 764122467 764557266 763541260 763119354 763734741 763792267 764973373
1821.7 764973373 765530396 767445526 768371429 765255585 765902786 767720718 768414841 766537781 763055344
1830.4 763055344 765528793 768774796 769756546 770571136 771317749 771212387 770147629 769013977 770017471
1839.1 770017471 770568924 771373291 772264557 773559952 773203201 768140259 771197205 773224106 772115784
$$ packed form
1777.4G39509354P04116M33960m86755j163711J449508K319870J729126n64880R94339
1786G44924927J799774O81000K41470L75824m66843n49926j702271J422119M697876
1794.7G51423950J171112p23037J502685J461105r01641j870881J846238L39889J434021
1803.4G55683441K390595N75180Q12759q6136k40860O77109P1487j866455N02549K059631
1813G60579300J526947J579285M36935M34799j016006m21906O15387N7526J181106
1821.7G64973373N57023J915130R25903l115844O47201J817932O94123j877060l482437
1830.4G63055344K473449L246003R81750Q14590P46613j05362j064758j133652J003494
1839.1G70017471N51453Q04367Q91266J295395l56751n062942L056946K026901j108322
$$ plain form
1847.8 772115784 771685638 772575531 773935547 774584122 775775223 776354141 776606522 776264572 775481415
1856.4 775481415 775052948 774231567 774375992 775054779 776568069 777381973 777655411 777889099 777645340
1865.1 777645340 777239075 775723114 775293732 773259277 772933578 775798035 778104935 779710236 779640503
1873.8 779640503 779347916 778468628 777762604 777537460 777793655 778619308 779074020 780365295 780870056
1882.5 780870056 781012573 780335312 779167709 778759460 778288269 779199066 778542709 777753143 780213165
1891.2 780213165 782059860 782211685 781660995 780069427 778624649 779356995 779539719 780080338 781196594
1899.8 781196594 781748428 782185440 782040329 781913071 780871506 780226974 780253143 780258102 780735168 781210403
1909.5 781210403 781591568 781964951 783099365 782964325 782194672 781190720 780627899 781169128 779256973
$$ packed form
1847.8G72115784m30146Q89893J360016O48575J191101N78918K52381l41950p83157
1856.4G75481415m28467q21381J44425O78787J513290Q13904K73438K33688k43759
1865.1G77645340m06265j515961m29382k034455l25699K864457K306900J605301o9733
1873.8G79640503k92587q79288p06024k25144K56195Q25653M54712J291275N04761
1882.5G80870056J42517o77261j167603m08249m71191R10797o56357p89566K460022
1891.2G80213165J846695J51825n50690j591568j444778P32346J82724N40619J116256
1899.8G81196594N51834M37012j45111j27258j041565o44532K6169M959M77066M75235
1909.5G81210403L81165L73383J134414j35040p69653j003952n62821N41229j912155
$$ plain form
1918.2 779256973 779967728 782423096 783771515 783727951 781260834 780409470 780810013 780466690 780293427
1926.8 780293427 781260910 782171478 782996521 783860855 783930740 783307571 781704407 781125488 780622940 780212402
1936.5 780212402 780766449 781748199 783453217 784126663 784471664 782859879 780212479 780656509 780725861
1945.2 780725861 780132751 780228729 781579971 782635956 783047333 783046265 782398758 781414566 780370789 780031586
1954.8 780031586 779613190 779926224 780834045 782000046 782862244 782480927 782120743 781071777 780122070
1963.5 780122070 779587860 779529877 780046539 780134506 780957794 781850662 782480087 782202911 781105270 780195389
1973.1 780195389 779712219 779654236 779779587 780691605 781539536 782184677 782431335 781899796 780951462 779742432
1982.8 779742432 778929825 778513489 779261551 780508041 781086197 780924911 780843887 781235504 780105057
$$ packed form
1918.2G79256973P10755K455368J348419m3564k467117q51364M00543l43323j73263
1926.8G80293427R67483R10568Q25043Q64334O9885o23169j603164n78919n02548m10538
1936.5G80212402N54047R81750J705018O73446L45001j611785k647400M44030O9352
1945.2G80725861n93110R5978J351242J055985M11377j068o47507r84192j043777l39203
1954.8G80031586m18396L13034R07821J166001Q62198l81317l60184j048966r49707
1963.5G80122070n34210n7983N16662Q7967Q23288Q92868O29425k77176j097641r09881
1973.1G80195389m83170n7983J25351R12018Q47931O45141K46658n31539r48334j209030
1982.8G79742432q12607m16336P48062J246490N78156j61286q1024L91617j130447
$$ plain form
1991.5 780105057 777567673 776807175 777851410 778801041 779633865 780260620 780406494 780727539 780043106
2000.1 780043106 779188461 778325272 777495270 777215271 777227402 778017807 778886185 779791794 779910583 779280243
2009.8 779280243 778221283 776886215 776281662 776060257 776459808 777212448 778025208 778121567 778165588 778110580
2019.4 778110580 777014465 776272736 775308533 774812241 775071945 775905151 777165222 777552567 777581177
2028.1 777581177 777109833 776368713 775176468 774275208 774137115 774338531 774914474 775254822 776089325
2036.8 776089325 776412735 775924759 774986954 773600311 772430115 772294312 773274689 773684540 774575348
2045.5 774575348 775278320 775146866 774914551 773779907 772939377 772201080 772137222 772682648 773341827 774228439
2055.1 774228439 774817505 775140762 774328690 773182755 771943436 771264420 771113434 771208725 772311783
$$ packed form
1991.5G80105057k537384p60498J044235R49631Q32824O26755J45874L21045o84433
2000.1G80043106q54645q63189q30002k79999J2131P90405Q68378R05609J18789o30340
2009.8G79280243j058960j335068o04553k21405L99551P52640Q12760R6359M4021n5008
2019.4G78110580j096115p41729r64203m96292K59704Q33206J260071L87345K8610
2028.1G77581177m71344p41120j192245r01260j38093K01416N75943L40348Q34503
2036.8G76089325L23410m87976r37805j386643j170196j35803R80377M09851Q90808
2045.5G74575348P02972j31454k32315j134644q40530p38297o3858N45426O59179Q86612
2055.1G74228439N89066L23257q12072j145935j239319o79016j50986R5291J103058
$$ plain form
2063.8 772311783 773163834 773793411 773792877 773411560 772669067 771556549 770710602 770181732 770782547 771571579
2073.4 771571579 772668152 773347549 773530273 773511887 772121964 770779419 769917831 769818649 770029678
2082.1 770029678 770834198 772129898 772660904 772890091 772416306 771615601 770166855 769029922 768956223
2090.8 768956223 769406204 770401382 771068802 771826782 771934280 771526184 770610046 769175339 768113632
2099.5 768113632 767716446 768845749 769834976 770442581 770932007 770964355 770643539 769794235 768784256
2108.1 768784256 767450409 767336044 768052368 768900146 769784927 770123367 770164261 769501495 768824692 767569504
2117.8 767569504 766515732 766526489 766899796 767689819 768784790 769905396 769878235 769545212 768697052
2126.5 768697052 767362061 766509399 766104889 766809387 767444916 768279495 769197693 769413300 768849792
$$ packed form
2063.8G72311783Q52051O29577n34l81317p42493j112518q45947n28870O00815P89032
2073.4G71571579J096573O79397J82724j8386j389923j342545q61588r9182K11029
2082.1G70029678Q04520J295700N31006K29187m73785q00705j448746j136933p3699
2090.8G68956223M49981R95178O67420P57980J07498m08096r16138j434707j061707
2099.5G68113632l97186J129303R89227O07605M89426L2348l20816q49304j009979
2108.1G68784256j333847j14365P16324Q47778Q84781L38440M0894o62766o76803j255188
2117.8G67569504j053772J0757L73307P90023J094971J120606k7161l33023q48160
2126.5G68697052j334991q52662m04510P04498O35529Q34579R18198K15607n63508
$$ plain form
2135.1 768849792 767663345 766691971 765845413 766060028 766740799 767430038 768263931 769044724 769333725
2143.8 769333725 768771667 768437653 767558517 766699371 766166077 766275330 767413406 768475952 769491653
2152.5 769491653 769741135 769540329 768315125 766950378 766355515 766035843 766790619 767508087 768286514
2161.2 768286514 768763657 769143677 769044113 767801590 766788177 766073380 766252594 766438217 767453842
2169.9 767453842 768972092 769596100 770001450 769415665 768631592 767367325 766506119 766544495 766868439
2178.5 766868439 767746887 768526840 769661407 770053253 769571915 768541412 767636414 767184906 766961288
2187.2 766961288 767767334 768360214 769256439 770059280 770354614 770295410 769359207 768265305 766966476
2195.9 766966476 766732788 767228470 768343277 769673996 770559235 771377182 770806656 769596939 768245468
$$ packed form
2135.1G68849792j186447r71374q46558K14615O80771O89239Q33893P80793K89001
2143.8G69333725n62058l34014q79136q59146n33294J09253J138076J062546J015701
2152.5G69491653K49482k00806j225204j364747n94863l19672P54776P17468P78427
2161.2G68286514M77143L80020r9564j242523j013413p14797J79214J85623J015625
2169.9G67453842J518250O24008M05350n85785p84073j264267q61206L8376L23944
2178.5G66868439Q78448P79953J134567L91846m81338j030503r04998m51508k23618
2187.2G66961288Q06046N92880Q96225Q02841K95334n9204r36203j093902j298829
2195.9G66966476k33688M95682J114807J330719Q85239Q17947n70526j209717j351471
$$ plain form
2204.6 768245468 767615280 767445602 767451477 768518372 769606171 770774307 771132812 770784531 769974060
2213.3 769974060 768854218 768040619 767374649 767746811 768584671 769839096 771059952 771651840 771503754
2221.9 771503754 770557709 769432678 768050385 767523575 767941818 769044037 770110245 770715408 771156082
2230.6 771156082 771018753 770385742 768971481 768255768 768112259 768179550 768826981 769755402 771132660
2239.3 771132660 771514359 771172562 769989624 768539047 767595901 767092896 767618866 768285294 769706421
2248 769706421 770956116 771394501 770901489 769416962 768473969 767397308 766644211 766982727 768414764
2256.7 768414764 769722595 770649109 771290588 770805511 770200119 768888474 767817459 767362976 767268677
2265.3 767268677 768103027 769495163 771272049 771691360 771285095 770035629 768411179 767642059 767014923
$$ packed form
2204.6G68245468o30188j69678N875J066895J087799J168136L58505l48281q10471
2213.3G69974060j119842q13599o65970L72162Q37860J254425J220856N91888j48086
2221.9G71503754r46045j125031j382293n26810M18243J102219J066208O05163M40674
2230.6G71156082j37329o33011j414261p15713j43509O7291O47431R28421J377258
2239.3G71132660L81699l41797j182938j450577r43146n03005N25970O66428J421127
2248G69706421J249695M38385m93012j484527r42993j076661p53097L38516J432037
2256.7G68414764J307831R26514O41479m85077o05392j311645j071015m54483r4299
2265.3G67268677Q34350J392136J776886M19311m06265j249466j624450p69120o27136
$$ plain form
2274 767014923 767164078 767840195 769012070 770004120 770714188 771035690 770337067 769014587 767238998
2282.7 767238998 766755600 767031937 767945251 769369278 770418549 771255646 770901184 770077133 768722458
2291.4 768722458 767378387 766588745 766794739 768187408 769097137 770232239 771362381 771711121 770853119
2300 770853119 769141388 768014603 767322693 767249680 768146667 770564346 772406845 772968140 772812958
2308.7 772812958 771618805 771002197 770080948 769223557 768882065 769425354 771227646 772460861 773695297
2317.4 773695297 774305038 773394775 772410965 771297684 770532837 771185837 771793976 772771378 775011063
2326.1 775011063 776214981 776724396 776227417 774921646 773666382 772139740 771552048 771841965 773273849
2334.8 773273849 774675446 776345215 776930542 775047989 773492126 772393417 771962891 772578201 773182526
$$ packed form
2274G67014923J49155O76117J171875R92050P10068L21502o98623j322480j775589
2282.7G67238998m83398K76337R13314J424027J049271Q37097l54462q24051j354675
2291.4G68722458j344071p89642K05994J392669R09729J135102J130142L48740q58002
2300G70853119j711731j126785o91910p3013Q96987K417679J842499N61295j55182
2308.7G72812958j194153o16608r21249q57391l41492N43289J802292J233215J234436
2317.4G73695297O09741r10263r83810j113281p64847O53000O08139R77402K239685
2326.1G75011063J203918N09415m96979j305771j255264j526642n87692K89917J431884
2334.8G73273849J401597J669769N85327j882553j555863j098709m30526O15310O04325
$$ plain form
2343.4 773182526 773419266 773913345 773939590 772069168 770159454 770077133 770618973 770464783 771234970 772710190
2353.1 772710190 774991913 778017044 779277344 779772110 778495560 777420807 776232300 774804687
2360.8 774804687 773915558 773403549 775163651 776291199 777136841 776712418 774431915 771896439 770084381
2369.5 770084381 769106598 767544556 766551971 766213531 766933746 767849731 768316345 768090668 766284409
2378.2 766284409 763948898 761203232 759868698 760403748 761409225 762534866 763138580 763248291 762384491
2386.8 762384491 760784607 759146957 757996826 757402344 757490997 758880081 760548477 761601181 761548996
2395.5 761548996 760747223 759390106 757862091 756940765 756464615 756834259 757551041 758787918 759923935
2404.2 759923935 759873276 759365616 758343964 756979065 755730743 755199661 755248260 755852051 757128830
$$ packed form
2343.4G73182526K36740M94079K6245j870422j909714q2321N41840j54190P70187J475220
2353.1G72710190K281723L025131J260300M94766j276550j074753j188507j427613
2360.8G74804687q89129n12009J760102J127548Q45642m24423k280503k535476j812058
2369.5G70084381r77783j562042r92585l38440P20215R15985M66614k25677j806259
2378.2G66284409k335511k745666j334534N35050J005477J125641O03714J09711q63800
2386.8G62384491j599884j637650j150131n94482Q8653J389084J668396J052704n2185
2395.5G61548996q01773j357117j528015r21326m76150L69644P16782J236877J136017
2404.2G59923935n0659n07660j021652j364899j248322n31082M8599O03791J276779
$$ plain form
2412.9 757128830 758317261 758673096 757835083 756352386 754525146 753688889 753451614 753298416 754312668
2421.6 754312668 755550919 756547928 756645203 756065826 754877243 753073730 751763306 751119080 751667404
2430.2 751667404 752594147 753684387 754500122 754480667 754238281 753280716 751772537 750281754 749750824
2438.9 749750824 749833908 750476761 751543884 752299728 753147659 752510681 750875549 749666061 748647156
2447.6 748647156 747982483 747868652 748574524 749676208 750709534 750732727 750035629 749161148 747664871
2456.3 747664871 746084366 745364227 745655518 746286926 747288513 747760315 747660599 747516327 746777878
2465 746777878 745561981 744186172 743674850 743712540 744278641 745337677 746241837 746578522 745569000
2473.6 745569000 744495392 743179474 741657562 740869064 740742493 741344986 741963577 742848587 743581161
$$ packed form
2412.9G57128830J188431L55835q38013j482697j827240q36257k37275j53198J014252
2421.6G54312668J238251R97009R7275n79377j188583j803513j310424o44226N48324
2430.2G51667404R26743J090240Q15735j9455k42386r57565j508179j490783n30930
2438.9G49750824Q3084O42853J067123P55844Q47931o36978j635132j209488j018905
2447.6G48647156o64673j13831P05872J101684J033326K3193o97098q74481j496277
2456.3G47664871j580505p20139K91291O31408J001587M71802r9716j44272p38449
2465G46777878j215897j375809n11322L7690N66101J059036R04160L36685j009522
2473.6G45569000j073608j315918j521912p88498j26571O02493O18591Q85010P32574
$$ plain form
2482.3 743581161 743421555 742124100 740348053 738932190 738044815 738303223 738813019 739481430 740122223
2491 740122223 740168686 739922409 739276352 738144608 736693802 735927734 735551987 735823288 736829071 737693176
2500.6 737693176 738004761 737320175 736574402 735463104 734053955 732744064 732197342 733140411 734033127
2509.3 734033127 734591293 734797440 734539261 733468018 732030258 731140442 730420151 729952316 729795609
2518 729795609 730786285 732111816 732700882 732364349 731177597 730128479 728623886 727350845 727086792
2526.7 727086792 727453461 728051605 728902206 729727402 729468079 728653183 727143555 725743942 725071030
2535.4 725071030 724578476 724648056 725265274 726347427 727020111 726980057 726143494 725101700 723846436
2544 723846436 722397232 722149506 722448425 723286972 723971710 724106827 724123459 723695831 723030243 721687698
$$ packed form
2482.3G43581161j59606j297455j776047j415863q87375K58408N09796O68411O40793
2491G40122223M6463k46277o46057j131744j450806p66068l75747K71301J005783Q64105
2500.6G37693176L11585o84586p45773j111298j409149j309891n46722R43069Q92716
2509.3G34033127N58166K06147k58179j071243j437760q89816p20291m67835j56707
2518G29795609R90676J325531N89066l36533j186752j049118j504593j273041k64053
2526.7G27086792L66669N98144Q50601Q25196k59323q14896j509628j399613o72912
2535.4G25071030m92554O9580O17218J082153O72684m0054q36563j041794j255264
2544G23846436j449204k47726K98919Q38547O84738J35117J6632m27628o65588j342545
$$ plain form
2553.7 721687698 720727921 719998550 719564133 720142517 720849915 721581802 721894989 721692810 720653381
2562.4 720653381 719370346 718401794 717855072 718019943 718360367 719216766 719775314 719766846 719186172 718024445
2572 718024445 716895599 715690842 715052185 714983368 715586624 716187668 716533585 716760178 716156006 715267487
2581.6 715267487 713990860 712997131 712584610 712493591 713216019 714143448 714336472 713847885 713492432 712553940
2591.3 712553940 711211929 710375137 709782104 709586563 710114594 710908279 711111755 711197586 710854416 709775925
2600.9 709775925 708598862 707708435 707148209 706713257 706960220 707578583 708386078 708590469 708040085
2609.6 708040085 707123489 705506134 704771729 704268036 703773651 704211349 704910965 705601959 705549393 704866409
2619.3 704866409 703685455 702608261 702015762 701332703 700863419 701042557 701583710 701832886 701966095
$$ packed form
2553.7G21687698r59777p29371m34417N78384P07398P31887L13187k02179j039429
2562.4G20653381j283035r68552n46722J64871L40424Q56399N58548q468n80674j161727
2572G18024445j128846j204757o38657o8817O03256O01044L45917K26593o04172q88519
2581.6G15267487j276627r93729m12521r1019P22428R27429J93024m88587l55453r38492
2591.3G12553940j342011q36792n93033j95541N28031P93685K03476Q5831l43170j078491
2600.9G09775925j177063q90427n60226m34952K46963O18363Q07495K04391n50384
2609.6G08040085r16596j617355p34405n03693m94385M37698O99616O90994n2566o82984
2619.3G04866409j180954j077194n92499o83059m69284J79138N41153K49176J33209
$$ plain form
2627.9 701966095 701435699 700290451 699110641 698148270 697494507 697101135 697699356 698108368 698381882
2636.6 698381882 698784485 698237762 697135544 695893555 695225830 694567795 694191742 694674072 695122681
2645.3 695122681 695386200 695424347 694937439 693545837 692296524 691497879 691019821 690866394 690870743 691507034
2654.9 691507034 691792831 691513367 691028595 690607147 689724731 688376236 687768707 687383347 687587509
2663.6 687587509 688217392 688795319 689045105 688386536 687414474 686510849 685960464 685252380 685126495 685754852
2673.3 685754852 686047745 686427078 686702728 686291504 685105057 683998871 683187561 682649231 682371826
2681.9 682371826 682405853 682870407 682829590 682829437 682506027 681848373 681330032 680410843 680054245 679825745
2691.6 679825745 679857254 680685425 681156311 680983810 680556564 679751663 678582306 677824249 677426987 677052155
$$ packed form
2627.9G01966095n30396j145248j179810r62371o53763l93372N98221M09012K73514
2636.6F98381882M02603n46723j102218j241989o67725o58035l76053M82330M48609
2645.3F95122681K63519L8147m86908j391602j249313p98645m78058j53427M349O36291
2654.9F91507034K85797k79464m84772m21448q82416j348495o07529l85360K04162
2663.6F87587509O29883N77927K49786o58569r72062r03625n50385p08084j25885O28357
2673.3F85754852K92893L79333K75650m11224j186447j106186q11310n38330k77405
2681.9F82371826L4027M64554m0817j53l23410o57654n18341r19189l56598k28500
2691.6F79825745L1509Q28171M70886j72501m27246q04901j169357p58057l97262l74832
$$ plain form
2701.2 677052155 676807022 677381210 678366776 678498535 677852631 676803665 675909729 675081863 674700546
2709.9 674700546 674715958 674779053 675458832 675988312 675972214 675519104 674752655 673803940 673044434 672594223
2719.5 672594223 672582779 673132706 673187332 673374481 673395462 672910004 672328186 670916748 669867630 669858856
2729.2 669858856 670319672 670555649 670858307 671193390 670936432 670500259 670004196 669918289 669497986 668864975
2738.8 668864975 668350449 668008957 668546219 669036789 669420776 669124527 668483887 668075562 667455215 666875992
2748.5 666875992 666266632 666490097 666981277 667478256 667655182 667128296 666713028 665656586 664799957
2757.2 664799957 664820557 665060349 664951019 664694366 664798203 664865417 664953613 664473038 663772812 663100739
2766.8 663100739 662368011 662169495 662536011 663201218 663228607 663099213 663098068 662687454 661702042 660525284
$$ packed form
2701.2F77052155k45133N74188R85566J31759o45904j048966q93936q27866l81317
2709.9F74700546J5412O3095O79779N29480j6098m53110p66449r48715p59506m50211
2719.5F72594223j1444N49927N4626J87149K0981m85458n81818j411438j049118q774
2729.2F69858856M60816K35977L02658L35083k56958m36173m96063q5907m20303o33011
2738.8F68864975n14526l41492N37262M90570L83987k96249o40640m08325o20347n79223
2748.5F66875992o09360K23465M91180M96979J76926n26886m15268j056442q56629
2757.2F64799957K0600K39792j09330k56653J03837O7214Q8196m80575p00226o72073
2766.8F63100739p32728j98516L66516O65207K7389j29394j145m10614r85412j176758
$$ plain form
2776.4 660525284 659938507 659740982 659902420 660080414 660332794 660421600 660073471 659347305 658107224 657422943
2786.1 657422943 656836853 656349335 656757126 657534561 657929535 657521896 656976242 656335297 655469666 654542694
2795.7 654542694 654082108 653897476 653520432 653585281 653587723 653278656 652712250 651999054 651130295 650032806
2805.4 650032806 649369736 648918686 648861923 649151077 649233627 649066849 648287201 647075653 646120453 645266876
2815 645266876 644332047 643751450 643532181 643637619 643562241 643332901 642859726 641661530 640438385 639170151
2824.7 639170151 638302155 637991714 637982712 638013535 637571373 637146416 636171150 634732170 633343544 632197304
2834.3 632197304 631387825 630700340 630205421 629519081 629252396 628596840 627047424 625351448 623530464
2843 623530464 621840401 619539757 617751579 616979942 615899277 614134216 612012100 610316277 608363991
$$ packed form
2776.4F60525284n86777j97525J61438J77994K52380Q8806l48129p26166j240081o84281
2786.1F57422943n86090m87518M07791P77435L94974m07639n45654o40945q65631r26972
2795.7F54542694m60586j84632l77044O4849K442l09067n66406p13196q68759j097489
2805.4F50032806o63070m51050n6763K89154Q2550j66778p79648j211548r55200q53577
2815F45266876r34829n80597k19269J05438p5378k29340m73175j198196j223145j268234
2824.7F39170151q67996l10441r002L0823m42162m24957r75266j438980j388626j146240
2834.3F32197304q09479o87485m94919o86340k66685o55556j549416j695976j820984
2843F23530464j690063k300644j788178p71637j080665j765061k122116j695823j952286
$$ plain form
2851.7 608363991 606584740 605637321 605186501 605068512 605118179 605867920 606824760 607235527 606700668 605807037
2861.3 605807037 605279427 604725189 604156952 603992424 604344330 604430809 604070320 603680916 603300056 602272911
2870.9 602272911 600824203 600175934 599884453 599614677 599607544 599973717 600068474 599774590 599455833 598140030
2880.6 598140030 596880875 596532364 595883064 595189476 595255928 595042267 594277115 593722229 592750702 591694069
2890.2 591694069 590423317 589073868 588451500 587873344 587516289 587578087 587601929 586893044 586042633 585251656
2899.9 585251656 583796349 582561264 581688271 581598282 582020721 581641998 580778809 580267982 579638748
2908.6 579638748 578142624 576657524 575090637 573746948 573014603 572180557 571274261 570085983 569224396
2917.2 569224396 568059959 565938835 564122734 562904320 561883087 561148224 561369820 561607056 561302452
$$ packed form
2851.7F08363991j779251r47419m50820j17989M9667P49741R56840M10767n34859q93631
2861.3F05807037n27610n54238n68237j64528L51906Q6479l60489l89404l80860j027145
2870.9F02272911j448708o48269k91481k69776p133L66173R4757k93884l18757j315803
2880.6E98140030j259155l48511o49300o93588O6452k13661p65152n54886r71527j056633
2890.2E91694069j270752j349449o22368n78156l57055O1798K3842p08885q50411p90977
2899.9E85251656j455307j235085q72993q9989M22439l78723q63189n10827o29234
2908.6E79638748j496124j485100j566887j343689p32345q34046r06296j188278q61587
2917.2E69224396j164437k121124j816101j218414j021233p34863K21596K37236l04604
$$ plain form
2925.9 561302452 561219254 561189156 561337967 561364708 560612984 559944496 560556984 562001877 563133316 563451805
2935.6 563451805 563826103 564554482 564717178 564873428 565673065 567009850 568187790 568836136 569573288
2944.2 569573288 570540657 571468544 571725693 571225929 570944099 571455994 572088852 573002129 573983269 574247780
2953.9 574247780 574648018 574785042 574626961 574376450 573953209 574336052 574906349 575367699 576409721
2962.6 576409721 577684326 578347931 578813095 579284401 579484520 579663773 579709473 580489235 581866341
2971.2 581866341 583361244 584730911 585438232 586026421 586257820 586357002 586611671 586801376 586831436 587027206
2980.9 587027206 587680893 588282776 589140701 589895744 589999466 589500885 588833542 588308067 588218155 588959885
2990.5 588959885 589625626 590325813 590650177 590447159 590152626 589556999 589335899 588817711 588078346 587712708
$$ packed form
2925.9E61302452q3198l0098J48811K6741p51724o68488O12488J444893J131439L18489
2935.6E63451805L74298P28379J62696J56250P99637J336785J177940O48346P37152
2944.2E69573288R67369R27887K57149m99764k81830N11895O32858R13277R81140K64511
2953.9E74247780M00238J37024j58081k50511m23241L82843N70297M61350J042022
2962.6E76409721J274605O63605M65164M71306K00119J79253M5700P79762J377106
2971.2E81866341J494903J369667P07321N88189K31399R9182K54669J89705L0060J95770
2980.9E87027206O53687O01883Q57925P55043J03722m98581o67343n25475q9912P41730
2990.5E88959885O65741P00187L24364k03018k94533n95627k21100n18188p39365l65638
$$ plain form
3000.2 587712708 588090363 588612900 588269920 588138580 587707253 586889839 586070824 585178833 584635353 584116592
3009.8 584116592 583993454 584307060 584624290 584423218 583968697 583239174 581926193 580900917 580260201
3018.5 580260201 579829788 579547997 579900818 580545006 580597382 580088959 578940048 577570992 576486931
3027.2 576486931 575986824 575565834 575302544 575201073 574881248 574908752 574540672 573553467 572348557 571358223
3036.8 571358223 570623360 569985466 569984741 570108528 570057487 569431763 568585129 568071632 566996536 565465851
3046.5 565465851 564537010 564418983 564255753 564071732 563883133 563532906 562992935 562180252 561336746 560186272
3056.1 560186272 559356041 558679619 558198051 558101921 557748375 557813988 557639275 556670876 555211372 553919220
3065.7 553919220 553525810 553208847 552581978 552210922 552305908 552247620 552042389 551519241 550274239 549178429
$$ packed form
3000.2E87712708L77655N22537l42980j31340m31327q17414q19015q91991n43480n18761
3009.8E84116592j23138L13606L17230k01072m54521p29523j312981j025276o40716
3018.5E80260201m30413k81791L52821O44188N2376n08423j148911j369056j084061
3027.2E76486931n00107m20990k63290j01471l19825K7504l68080r87205j204910r90334
3036.8E71358223p34863o37894p25J23787n1041o25724q46634n13497j075096j530685
3046.5E65465851r28841j18027j63230j84021j88599l50227n39971q12683q43506j150474
3056.1E60186272q30231o76422m81568r6130l53546O5613j74713r68399j459504j292152
3065.7E53919220l93410l16963o26869l71056R4986n8288k05231n23148j245002j095810
$$ plain form
3075.4 549178429 548653679 548250847 547986946 548092422 547719650 547239685 546856461 545870132 544838142
3084.1 544838142 543874779 543111954 542356033 542068787 542236710 542153931 542065010 541698074 541110077 539984627
3093.7 539984627 539122543 538389053 537153931 537024727 537458229 537410316 536395988 535311279 534778557
3102.4 534778557 534002647 532964706 531705627 531488037 531879463 531904449 531691971 531116829 530940285
3111.1 530940285 530394592 528875313 527468033 526587715 526128235 526303215 526370239 525895996 525447731
3119.8 525447731 524886131 524025917 522482834 521693459 521601562 520475883 519693336 519869995 520212860
3128.4 520212860 519615707 518151627 517227402 516885719 516203690 514618721 513666191 513785973 513810120
3137.1 513810120 513424149 512996292 512559662 511619873 510630417 509570084 508403931 507544785 507018166
$$ packed form
3075.4E49178429n24750m02832k63901J05476l72772m79965l83224r86329j031990
3084.1E44838142r63363p62825p55921k87246J67923q2779q8921l66936n87997j125450
3093.7E39984627q62084p33490j235122j29204M33502m7913j014328j084709n32722
3102.4E34778557p75910j037941j259079k17590L91426K4986k12478n75142j76544
3111.1E30940285n45693j519279j407280q80318m59480J74980O7024m74243m48265
3119.8E25447731n61600q60214j543083p89375r1897j125679p82547J76659L42865
3128.4E20212860n97153j464080r24225l41683o82029j584969r52530J19782K4147
3137.1E13810120l85971m27857m36630r39789r89456j060333j166153q59146n26619
$$ plain form
3145.8 507018166 506814270 506386337 505712929 505209618 504715271 503916588 502893410 501874313 501061630
3154.5 501061630 500320168 499922485 499669418 499102440 498856163 497910194 496606789 495844383 494750214
3163.1 494750214 493757439 493387146 493743248 493384972 492499886 491921883 490954208 490149040 488838768
3171.8 488838768 487436829 486577721 486111183 485899696 485467415 485158577 484450951 483996315 483161697
3180.5 483161697 481647224 480706406 479866447 479749374 479684219 479310608 479000816 478001480 476636543
3189.2 476636543 475375633 474899445 474274673 473011475 472434959 472136574 471862221 472025948 471734009
3197.9 471734009 470735779 469803810 468943748 467834740 466726341 466439133 466401596 466260719 465992126
3206.5 465992126 465156670 464627914 463933334 462988930 461972046 461008949 460995445 460696564 460167503 459825974
$$ packed form
3145.8E07018166k03896m27933o73408n03311m94347p98683j023178j019097q12683
3154.5E01061630p41462l97683k53067n66978k46277r45969j303405p62406j094169
3163.1D94750214r92775l70293L56102l58276q85086n78003r67675q05168j310272
3171.8D88838768j401939q59108m66538k11487m32281l08838p07626m54636q34618
3180.5D83161697j514473r40818q39959j17073o5155l73611l09792r99336j364937
3189.2D76636543j260910m76188o24772j263198n76516k98385k74353J63727k91939
3197.9D71734009r98230r31969q60062j109008j108399k87208l7537j40877k68593
3206.5D65992126q35456n28756o94580r44404j016884r63097j3504k98881n29061l41529
$$ plain form
3216.2 459825974 459005165 457894287 456960297 456344376 455778885 455502586 454692841 453668900 453647156
3224.9 453647156 454110947 454133606 453083496 452145920 451775131 450689049 449449768 449180222 449037628
3233.5 449037628 448625603 448153839 447587280 447234116 446348877 445180473 444145164 443603706 443680763
3242.2 443680763 443410759 442974243 442193909 441845779 441677361 440938911 440130310 438970451 438594704
3250.9 438594704 438309708 437732353 437877655 438012619 438164597 437730713 436518745 435536003 434965134
3259.6 434965134 434399872 433677864 433124580 432964745 432782555 432104034 431640587 431412010 430701714 429823303
3269.2 429823303 429757042 429716682 429308739 429563065 429566917 429604492 429210243 427854004 426892471 426007538
3278.9 426007538 425414505 425011864 425031013 425293198 425087776 424788857 424208221 423753891 423411102 422941437
$$ packed form
3216.2D59825974q20809j110878r33990o15921n65491k76299q09745j023941k1744
3224.9D53647156M63791K2659j050110r37576l70789j086082j239281k69546j42594
3233.5D49037628m12025m71764n66559l53164q85239j168404j035309n41458P7057
3242.2D43680763k70004m36516p80334l48130j68418p38450q08601j159859l75747
3250.9D38594704k84996n77355J45302J34964J51978m33884j211968r82742n70869
3259.6D34965134n65262p22008n53284j59835j82190o78521m63447k28577p10296q78411
3269.2D29823303o6261m0360m07943K54326L852L7575l94249j356239r61533q84933
3278.9D26007538n93033m02641J9149K62185k05422k98919n80636m54330l42789m69665
$$ plain form
3288.5 422941437 422224998 421835136 421959763 422045364 422136536 421500854 420779839 420223160 419754410 419253731
3298.2 419253731 418317871 418027306 418255157 418681602 418652992 418265457 417805290 417025299 416741333 416260834
3307.8 416260834 415309181 414702377 414597130 414073639 413717079 414037285 413838463 413621941 412537918
3316.5 412537918 411038437 410035210 409343338 409523582 409385223 409225616 409174194 408689728 407780724
3325.2 407780724 406753960 405906410 404590874 403966789 403560905 402581482 402081833 402061920 401709290
3333.8 401709290 400677910 399851494 399086990 398640594 398381233 397592163 396895370 396441994 396404839 396137352
3343.5 396137352 394804344 393055801 391924934 391236916 390955238 391373253 391444511 391073952 390508499
3352.2 390508499 389851151 389122887 388208618 387378502 386656494 386057320 385383110 385451889 385922127 385626831
$$ packed form
3288.5D22941437p16439l89862J24627Q5601R1172o35682p21015n56679m68750n00679
3298.2D19253731r35860k90565K27851M26445k8610l87535m60167p79991k83966m80499
3307.8D16260834r51653o06804j05247n23491l56560L20206j98822k16522j084023
3316.5D12537918j499481j003227o91872J80244j38359j59607n1422m84466r09004
3325.2D07780724j026764q47550j315536o24085m05884r79423m99649j9913l52630
3333.8D01709290j031380q26416p64504m46396k59361p89070o96793m53376l7155k67487
3343.5C96137352j333008j748543j130867o88018k81678M18015P1258l70559n65453
3352.2C90508499o57348p28264r14269q30116p22008n99174o74210O8779M70238k95296
$$ plain form
3361.8 385626831 385058022 384423943 383480530 382227020 381591187 381530609 381418953 381367912 380894165 380103035
3371.4 380103035 379708290 379157066 378141136 377791710 377388916 376682281 376276321 375978470 376163597
3380.1 376163597 375866013 375410118 374912720 374238167 374038925 373435745 373078880 372914505 373025398 373003616
3389.8 373003616 371980553 372009239 372344284 371382103 370515633 370268974 370133591 369883842 369675026 369656219
3399.4 369656219 369760933 369607849 369243164 368965340 368709984 367987480 367491074 367961349 368569565 368461533
3409.1 368461533 367783775 367833214 367905006 367395744 367108765 367030754 367316322 367200241 367005768 367334518
3418.7 367334518 367473221 367224121 367159920 367293434 366831169 366768227 366969986 366944733 367302704 367715607
3428.3 367715607 368385353 368510323 367980080 368059959 368378830 368111801 367919273 368638535 369349709 369614105
$$ packed form
3361.8C85626831n68809o34079r43413j253510o35833o0578j11656n1041m73747p91130
3371.4C80103035l94745n51224j015930l49426m02794p06635m05960k97851J85127
3380.1C76163597k97584m55895m97398o74553j99242o03180l56865j64375J10893k1782
3389.8C73003616j023063K8686L35045r62181q66470k46659j35383k49749k08816j8807
3399.4C69656219J04714j53084l64685k77824k55356p22504m96406M70275O08216j08032
3409.1C68461533o77758M9439P1792n09262k86979p8011K85568j16081j94473L28750
3418.7C67334518J38703k49100o4201J33514m62265o2942K01759k5253L57971M12903
3428.3C67715607O69746J24970n30243P9879L18871k67029j92528P19262P11174K64396
$$ plain form
3438 369614105 369862480 370151520 370615311 371040916 370927200 370711250 370637131 370742607 371153374 371441650
3447.6 371441650 372376595 373304176 373762131 374389610 374813271 375499992 375963097 375949898 376335258 376937141
3457.3 376937141 377251282 377838821 378938370 379012451 378761749 379100418 379784393 380308037 380356979 381196327
3466.9 381196327 382295647 383517227 384381638 384431686 384763832 385122414 386260490 387355232 387493553
3475.6 387493553 388193207 389051857 389831657 390929222 391499214 391815453 391720505 391144333 392374382
3484.3 392374382 393697128 393853836 394556084 395370827 396389313 397549362 398392868 398470497 398670578
3493 398670578 399925003 401239700 402162933 402128906 402426758 403660355 404826469 405693817 406387939
3501.6 406387939 406993561 406988487 407705269 408746109 409340820 410433540 412218399 413322716 412965088
$$ packed form
3438C69614105K48375K89040M63791M25605j13716k15950p4119J05476M10767K88276
3447.6C71441650R34945R27581M57955O27479M23661O86721M63105j3199L85360O01883
3457.3C76937141L14141N87539J099549P4081k50702L38669O83975N23644M8942Q39348
3466.9C81196327J099320J221580Q64411N0048L32146L58582J138076J094742J38321
3475.6C87493553O99654Q58650P79800J097565N69992L16239r4948n76172J230049
3484.3C92374382J322746J56708P02248Q14743J018486J160049Q43506P7629K00081
3493C98670578J254425J314697R23233l4027K97852J233597J166114Q67348O94122
3501.6D06387939O05622n074P16782J040840N94711J092720J784859J104317l57628
$$ plain form
3510.3 412965088 413489037 414209518 414908066 415956116 416903267 418087387 418854141 420055885 421255188
3519 421255188 421461906 421632614 422536430 423545074 424052925 425692787 427482796 428897095 429746666
3527.7 429746666 429635849 429852524 430819588 431798401 432326584 433512840 434936409 436653252 437956009
3536.4 437956009 438569145 440206375 441022339 441295090 441939392 443038445 444466553 446109962 447123604
3545 447123604 446891022 448439598 449842262 451500931 453301735 454401970 455457077 454802055 456452446
3553.7 456452446 458754272 460538712 461988449 462137947 464088974 465902977 466020584 465804138 467561722
3562.4 467561722 469217834 470958290 475293236 475964165 475522575 475075798 475641022 479278717 480960197
3571.1 480960197 482421684 483524094 485187874 487405014 489474869 491313019 491564026 493735390
$$ packed form
3510.3D12965088N23949P20481O98548J048050R47151J184120P66754J201744J199303
3519D21255188K06718J70708R03816J008644N07851J639862J790009J414299Q49571
3527.7D29746666j10817K16675R67064R78813N28183J186256J423569J716843J302757
3536.4D37956009O13136J637230Q15964K72751O44302J099053J428108J643409J013642
3545D47123604k32582J548576J402664J658669J800804J100235J055107o55022J650391
3553.7D56452446K301826J784440J449737J49498J951027J814003J17607k16446J757584
3562.4D67561722J656112J740456M334946O70929m41590m46777N65224L637695J681480
3571.1D80960197J461487J102410J663780K217140K069855J838150K51007K171364
$$ plain form
3578.8 493735390 495062714 495711861 497708511 499752579 501660805 503068962 506762085 507251434 504473686
3587.5 504473686 506040039 507697334 511523666 515045776 518420715 519260368 519725838 523207779 522430038
3596.1 522430038 524410820 527726288 528513451 530703659 531529427 533188744 535855484 537973709 540687866
3604.8 540687866 544295464 546669617 545063477 547390862 547008057 547464333 554489174 555499077 555221252
3613.5 555221252 559651108 559182587 563651466 568667603 568029366 568018265 567344093 569942894 574587212
3622.2 574587212 578201485 580770378 582590103 584046249 586307144 590933342 588911209 582148972
3629.9 582148972 588096542 594480362 599801216 601216812 600837326 603557587 607162895 609637260
3637.6 609637260 610039978 612108765 615182648 617637291 619393158 621058502 623638420 627332535
$$ packed form
3578.8D93735390J327324O49147J996650K044068J908226J408157L693123M89349k777748
3587.5E04473686J566353J657295L826332L522110L374939Q39653M65470L481941p77741
3596.1E22430038J980782L315468P87163K190208Q25768J659317K666740K118225K714157
3604.8E40687866L607598K374153j606140K327385l82805M56276P024841J009903k77825
3613.5E55221252M429856m68521M468879N016137o38237j1101o74172K598801M644318
3622.2E74587212L614273K568893J819725J456146K260895M626198k022133o762237
3629.9E82148972N947570O383820N320854J415596l79486K720261L605308K474365
3637.6F09637260M02718K068787L073883K454643J755867J665344K579918L694115
$$ plain form
3645.3 627332535 632992134 631042328 628181572 634266319 632271576 629850693 632882996 639711647
3653 639711647 644555130 648579483 652114563 643554764 646799240 652649612 654167099 656353836 657120819
3661.7 657120819 659193878 661061783 663034592 664744339 665580826 669462967 670231857 668603516 668310852
3670.4 668310852 664311218 669449005 677823868 685899734 681533432 661934814 669242477 678428879
3678.1 678428879 682274017 680372391 682266464 685639267 687302170 688347092 688887939 690219650
3685.8 690219650 694221878 699135132 689737930 686454086 692735748 688528137 691332932 696490021
3693.5 696490021 696596680 697879181 698028870 697849503 699477997 700588684 702879028 704723206 700083389
3702.2 700083389 698878479 703277969 704648285 705111694 706394882 709143829 711875916 704354019
$$ packed form
3645.3F27332535N659599j949806k860756O084747j994743k420883L032303O828651
3653F39711647M843483M024353L535080q559799L244476N850372J517487K186737P66983
3661.7F57120819K073059J867905J972809J709747Q36487L882141P68890j628341k92664
3670.4F68310852l999634N137787Q374863Q075866m366302j9598618P307663R186402
3678.1F78428879L845138j901626J894073L372803J662903J044922N40847J331711
3685.8F90219650M002228M913254r397202l283844O281662m207611K804795N157089
3693.5F96490021J06659J282501J49689j79367J628494J110687K290344J844178m639817
3702.2G00083389j204910M399490J370316M63409J283188K748947K732087p521897
$$ plain form
3709.9 704354019 708113480 710152969 696412659 702929230 707776489 708191528 709675140 711961594
3717.7 711961594 713198166 709905243 711425781 717219772 712579498 708664246 714140625 714914551
3725.4 714914551 713144684 709424133 710675659 715215530 716506195 721924133 719237366 712173843
3733.1 712173843 719077225 716261444 706904755 708632355 712346878 713804169 716900558 720764008
3740.8 720764008 717559509 720051041 729866791 715322723 700543213 712974548 720405655 725793457
3748.5 725793457 721585236 712096939 722014389 714712067 709096909 715846252 719880524 722336426
3756.2 722336426 717908401 721663437 727277298 718136368 717121506 721070023 722313690 723675537
3763.9 723675537 726793365 723763657 719526138 723107376 727995529 726419220 716419907 719502487
$$ packed form
3709.9G04354019L759461K039489j3740310O516571M847259M15039J483612K286454
3717.7G11961594J236572l292923J520538N793991m640274l915252N476379P73926
3725.4G14914551j769867l720551J251526M539871J290665N417938k686767p063523
3733.1G12173843O903382k815781r356689J727600L714523J457291L096389L863450
3740.8G20764008l204499K491532R815750j4544068j4779510J2431335P431107N387802
3748.5G25793457m208221r488297R917450p302322n615158O749343M034272K455902
3756.2G22336426m428025L755036N613861r140930j014862L948517J243667J361847
3763.9G23675537L117828l029708m237519L581238M888153j576309r999313L082580
$$ plain form
3771.7 719502487 723809586 724105377 724459000 724439621 726147156 726852188 728286514 726305466 719508667
3780.3 719508667 722894592 724874725 725994415 727670441 723839493 722906876 724373779 725603180
3788 725603180 726483917 726566544 726781693 725992737 726170120 726634674 728241653 730752716 725998688 722250977
3797.7 722250977 724859085 729604568 735612183 727516251 717478714 721935501 724703751 728901215
3805.4 728901215 732578049 721652985 719642334 725876770 728367920 728572617 728659363 728399811 730000763
3814.1 730000763 735390015 732464981 719942474 725867691 730481873 732270355 731824265 716076431
3821.8 716076431 719700851 726282043 728742065 730963745 729982758 726075592 727320175 729529266
3829.5 729529266 732105637 731989670 723912888 727711334 735040359 728628693 727728577 735912552 727298508
$$ packed form
3771.7G19502487M307099K95791L53623j9379J707535P05032J434326j981048o796799
3780.3G19508667L385925J980133J119690J676026l830948r32617J466903J229401
3788G25603180Q80737Q2627K15149p88956J77383M64554J606979K511063m754028l747711
3797.7G22250977K608108M745483O007615q095932j0037537M456787K768250M197464
3805.4G28901215L676834j0925064k010651O234436K491150K04697Q6746k59552J600952
3814.1G30000763N389252k925034j2522507N925217M614182J788482m46090j5747834
3821.8G16076431L624420O581192K460022K221680r80987l907166J244583K209091
3829.5G29529266K576371j15967q076782L798446P329025o411666r00116Q183975q614044
$$ plain form
3838.2 727298508 722531052 729040604 724264679 725235977 731461639 728785782 726236649 730123978
3845.9 730123978 731359253 730447235 731119995 729519958 731957550 736664047 728077698 726638260 712850571
3854.6 712850571 717654495 728674393 728459091 727506027 730124893 731813736 732068634 726616745 729024963
3863.3 729024963 735068741 726008987 722165756 728360519 734048996 738427429 727655334 720149155
3871 720149155 725305405 730838242 731900635 721800232 724449234 729862976 730736160 732999496 736197205
3879.7 736197205 728241577 722081299 729060593 731191711 732648163 734737854 722012558 725607071
3887.4 725607071 730356979 731006851 735456009 733360748 723218384 725540085 729428406 728992920
3895.1 728992920 730462875 731117554 732686539 732932205 723892365 729002914 730876999 725870361 730008774
$$ packed form
3838.2G27298508m767456O509552m775925R71298O225662k675857k549133L887329
3845.9G30123978J235275r12018O72760j600037K437592M706497q586349j439438j3787689
3854.6G12850571M803924J1019898k15302r53064K618866J688843K54898n451889K408218
3863.3G29024963O043778r059754l843231O194763N688477M378433j0772095p506179
3871G20149155N156250N532837J062393j0100403K649002N413742Q73184K263336L197709
3879.7G36197205p955628o160278O979294K131118J456452K089691j2725296L594513
3887.4G25607071M749908O49872M449158k095261j0142364K321701L888321m35486
3895.1G28992920J469955O54679J568985K45666r039840N110549J874085n006638M138413
$$ plain form
3903.8 730008774 727081146 725550766 726654587 727728577 729636459 729337616 729212646 729128265 729540710
3912.5 729540710 729635696 729466476 730913544 731941833 728196106 725524139 729267502 729065552 726754074
3921.1 726754074 729916611 731580505 731858292 729115143 726793671 729106598 729780197 729802780 729233322
3929.8 729233322 728929138 729651108 726391754 725293961 727515030 728770294 729714966 730421982 730055466
3938.5 730055466 729141388 729142532 730517044 730433426 726572571 726387634 728570633 729879913 730414886
3947.2 730414886 728115082 728127365 728136139 726321869 727448196 727943420 728577347 729230576 729165497 728895569
3956.8 728895569 727755890 728347015 728663635 728533325 728209229 727399673 728419876 728770142 728385162
3965.5 728385162 728735199 728694687 727854080 727438507 728406830 729299622 729096222 728529053 728443298 728509674
$$ packed form
3903.8G30008774k927628j530380J103821J073990J907882k98843j24970q4381M12445
3912.5G29540710R4986j69220J447068J028289l745727k671967L743363k01950k311478
3921.1G26754074L162537J663894K77787k743149k321472K312927O73599K2583n69458
3929.8G29233322l04184P21970l259354j097793K221069J255264R44672P07016l66516
3938.5G30055466r14078J144J374512q3618l860855j84937K182999J309280N34973
3947.2G30414886k299804J2283Q774j814270J126327M95224O33927O53229o5079k69928
3956.8G28895569j139679N91125L16620j30310l24096q09556J020203L50266l84980
3965.5G28385162L50037m0512q40607m15573R68323Q92792k03400n67169q5755O6376
$$ plain form
3975.1 728509674 728414993 728157272 728076782 728067627 728342667 728636322 728549728 728905563 728716507 728761520 728867874
3985.7 728867874 727915955 727604752 727931290 728847961 729117279 728651733 728831329 728944168 728916473 728503265
3995.4 728503265 728239441 728548660 729306335 729215164 728372879
4000.2 728372879
$$ packed form
3975.1G28509674r4681k57721q0490r155K75040K93655q6594L55835j89056M5013J06354
3985.7G28867874r51919l11203L26538R16671K69318m65546J79596J12839k7695m13208
3995.4G28503265k63824L09219P57675r1171q42285
4000.2G28372879
##END=$$ End of the data block
