##TITLE=$$ Begin of the data block
##JCAMP-DX=5.00 $$ ACD/SpecManager v 10.08
##SPECTROMETER/DATA SYSTEM=Varian
##DATE=08 Jan 2013 15:30:34
##DATA TYPE=INFRARED SPECTRUM
##DATA CLASS=XYDATA
##ORIGIN=
##OWNER=
##NPOINTS=3735
##FIRSTX=399.26403809
##LASTX=4000.35498047
##MAXX=4000.35498047
##MINX=399.26403809
##MAXY=78.67585754
##MINY=36.57265472
##XFACTOR=1.0000000000
##YFACTOR=0.000000100000000
##FIRSTY=56.36981964
##DELTAX=0.96440572
##XUNITS=1/CM
##YUNITS=TRANSMITTANCE
##XYDATA=(X++(Y..Y))
399.3E63698196k7725334L506203P849121N842705j830101l89519N143623J651268
407E57746162j999740J516914J198273k741737r83162J950836q51517o579895M933205
415.7E54189339Q916778j0304527j9138489J0181961M322472J930199N133132N53246
423.4E55784111j397362J289597M70772n77660j359787O25572K10037l31611j983605
432.1E52730064k591362K504731N453415L820877l340187l937264k9602J624222r23310
440.7E55311584l997612M615403K680015k480545K282257J546707n129737o258164
448.4E48569908R78661M948158J638451k8267M31595j230545l397141N5466J361541
457.1E53327827n324668j409989K939797L843422R51385o36444P03545l84140l502541
$$ plain form
399.3 563698196 535972862 539479065 547328186 553170891 551340790 550951271 556094894 557746162
407 557746162 555746422 557263336 558461609 555719872 554736710 556687546 555836029 549256134 554189339
415.7 554189339 563106117 552801590 533663101 543845062 548167534 550097733 555230865 555784111
423.4 555784111 554386749 555676346 556147118 555569458 554209671 554835243 555045280 554713669 552730064
432.1 552730064 550138702 552643433 558096848 561917725 558577538 554640274 554610672 556234894 555311584
440.7 555311584 551313972 555929375 558609390 556128845 558411102 559957809 554828072 548569908
448.4 548569908 549548569 554496727 556135178 556106911 556538506 555307961 551910820 551966286 553327827
457.1 553327827 548003159 546593170 549532967 553376389 554327774 553691330 554394875 554010735 550508194
465.8E50508194o296158m423675P225227N577431j887741Q18328n263061r47266N090218
474.5E50401497j653214k631759k449265j340980J696891J764832M45900N67245J639710
483.2E48440857m248390k299919M303665O96602m265747m745408L052903P023353K138634
491.8E50096550N69878j072617k520142j387443l134308k767448J093330L729553K810860
500.5E47418213J412468l84445m807587l963470q16956K336197R27544k483635l92533
509.2E39245796J937027L840676j174012m743004l96766k821694l597335P79075L218804
517.9E36288567L923797K364197J601410k75078k221909l252258m101829j389428J032639
526.6E33970108J225586K087746O86607j057091o17523o27098j297455k470398q93822
$$ plain form
465.8 550508194 544212036 539788361 547013588 552591019 550703278 551521606 546258545 545311279 550401497
474.5 550401497 548748283 546116524 543667259 542326279 544023170 545788002 546233902 546801147 548440857
483.2 548440857 544192467 541892548 546196213 546892815 542627068 537881660 540934563 547957916 550096550
491.8 550096550 550666428 549593811 547073669 545686226 542551918 539784470 540877800 544607353 547418213
500.5 547418213 548830681 548446236 543638649 539675179 538858223 541194420 542121964 539638329 539245796
509.2 539245796 541182823 545023499 543849487 539106483 538709717 535888023 532290688 533069763 536288567
517.9 536288567 540212364 542576561 544177971 543902893 541680984 538428726 534326897 532937469 533970108
526.6 533970108 535195694 537283440 537970047 536912956 536295433 535668335 534370880 531900482 531006660
535.2E31006660K693100J479989k07749j28555j151047j825752p59812j22451j691323
543.9E29293060m65088J696930J595803J865196Q15086j617164j595955L92112k288856
552.6E29691124k997704K89307P52335J333046K12440K6322k80076k744331j601906
561.3E24680557m66995R3498J162148J590080J626282J419983l76740j868477j28364
570E27731972J160507o7940q59184Q12759J166039n17311j152840j174393n58471j62812
579.6E26378326j232032n51796K516861J764030J39504J736946K24609p31773K31895
588.3E30476570j79367p79228j526J064949j82686j003151j516189M95605J803131
597E30178108l33099j183357j059838J042099Q69179o63185n52025m64210J072616
$$ plain form
535.2 531006660 533699760 535179749 534972000 534843445 533692398 531866646 531106834 530984383 529293060
543.9 529293060 528827972 530524902 532120705 533985901 534800987 533183823 531587868 531979980 529691124
552.6 529691124 526693420 526982727 527735062 529068108 529280548 529306870 529026794 526282463 524680557
561.3 524680557 524213562 524307060 525469208 527059288 528685570 530105553 529728813 527860336 527731972
570 527731972 528892479 528824539 527965355 528778114 529944153 529426842 528274002 527099609 526541138 526378326
579.6 526378326 525146294 524594498 527111359 528875389 529014893 530751839 530976448 530244675 530476570
588.3 530476570 530297203 529517975 529516449 530581398 530398712 529395561 527879372 528374977 530178108
597 530178108 529845009 528661652 527601814 528643913 529513092 528849907 528297882 527833672 528906288
605.6E28906288j12152j491165j024246j067391m25758j8616R30290J43891j189842
614.3E24651299m67148J94549j43394l93486J274948K202415R53637m35219n13649
623E27323952R3689P52487R52911N16625P19833J133614J360740J763687J539078N03197
632.7E36659813Q34007J123467M42657J363182J401024m05846k13813J535606J404724
641.3E44144821J319695J250724R9259k60964O25267K861748J684418Q1406J592712
650E53399086M15268K88162J240921n8822m82483k64778j55488O3096L89480O36559
659.7E55471001j179200k473831j050033R34295J002922M23279J934929K449265j089096
668.3E56423531K56309n62172p16324M59290M03824k30789O18095K679901K054939
$$ plain form
605.6 528906288 528794136 527302971 526278725 525211334 524785576 524766960 525697250 525841141 524651299
614.3 524651299 524184151 524378700 524235306 523841820 525116768 527319183 528272820 527837601 527323952
623 527323952 527417641 528170128 529123039 529639664 530359497 531493111 532853851 534617538 536156616 536659813
632.7 536659813 537493820 538617287 539059944 540423126 541824150 541418304 541204491 542740097 544144821
641.3 544144821 545464516 546715240 546814499 546553535 547178802 550040550 551724968 551806374 553399086
650 553399086 553814354 554102516 555343437 555284615 554802132 554537354 554381866 554444962 554834442 555471001
659.7 555471001 554291801 551817970 550767937 551702232 552705154 553128433 555063362 557512627 556423531
668.3 556423531 556679840 556117668 555401344 555860634 556264458 556033669 556651764 559331665 561386604
677E61386604J512642R02901m56543m80728n83344j86538J226577K850914J467743
685.7E67640228Q11043J403771J22413l853j090126k79541O11458r346J938019J182442
695.3E72326508o78292j101036n96962J254845J055183L1700n5847K3384N06707J209831
705E73976021J622200J346474j06240m12979O01540O19278O10389M43383J198272J828156
714.6E81726494M48799k50015n5275K80037K62489Q507j11389J46064J467247K093201
724.3E86016159K089996J211701m14086L0518P4577l39431J632766K033043R97772
733E93333015J184922Q56514M61425J73150m23089N9662L45536r53522l09334J455536
742.6E96183815K147675K417411Q87642q04825j646843j61399J640014P87621P79953
$$ plain form
677 561386604 562899246 563802147 563345604 562864876 562281532 562094994 563321571 566172485 567640228
685.7 567640228 568451271 569855042 569977455 569973602 568883476 568603935 569215393 569206047 571144066 572326508
695.3 572326508 571648216 570547180 569950218 571205063 572260246 572291946 572236099 572259483 572766190 573976021
705 573976021 575598221 576944695 576838455 576425476 577027016 577646294 578256683 578700066 579898338 581726494
714.6 581726494 582175293 581925278 581870003 582150040 582412529 582421036 582309647 582455711 583922958 586016159
724.3 586016159 588106155 589317856 588903770 588934288 589008865 588669434 590302200 592335243 593333015
733 593333015 594517937 595374451 595835876 596009026 595585937 595645599 595991135 595037613 594728279 596183815
742.6 596183815 598331490 600748901 601636543 600831718 599184875 599023476 600663490 601451111 602231064
751.3F02231064R09271J675720K018318P61986M30756m94270o65474M65698J129951
760F08463020J329956K108956J656723l45917q4305M67911j12724J20048N41039j29013
769.6F14015694O12182J782723J371536Q21915o31714p50694j096383j069908J93520
778.3F15248871j16997Q41675J595802J928215R50508j121292r59587n29899N20935
787F18358231J346473J003762O68068J273384J132507R7122l97987j448212j079369
795.6F20953979o91528l73878O12716J289864J326218L14560l80555j536560j913528
804.3F19601288j938706j410179n83343l96614R65881R13391k24380q76122j484108
813F14567108k380867k421913j850700j224099N76973J045800J340255J260910O66275
$$ plain form
751.3 602231064 603140335 604816055 606834373 607596359 608027115 607532845 606867371 607333069 608463020
760 608463020 609792976 611901932 613558655 613212738 613128433 613596344 613483620 613603668 614144707 614015694
769.6 614015694 614627876 616410599 617782135 618604050 617972336 617221642 616125259 615055351 615248871
778.3 615248871 615131874 615973549 617569351 619497566 620448074 619326782 618367195 617837296 618358231
787 618358231 619704704 620708466 621376534 622649918 623782425 623879547 623481560 622033348 620953979
795.6 620953979 620262451 619888573 620501289 621791153 623117371 623431931 623051376 621514816 619601288
804.3 619601288 617662582 616252403 615669060 615272446 616238327 617151718 616927338 616051216 614567108
813 614567108 612186241 609764328 607913628 606689529 607266502 608312302 609652557 610913467 611579742
821.7F11579742K48337n58204K06832M71344J279221K262611L666649M541779J979980
830.4F25678291J127091J040764L18832J40533J627617K733155K057953K480163K564964
839F39769363K645111J047593j00785j069717j614990M98962J174011K703247K820511
847.7F47873306K471390K207642J36795r05381j080398L18069k212J060409K851258
856.4F54930878L416595L356400J236572Q31680q97979j682358j122589n35355N42145
865.1F60075989J220245K553024J211091j63880j418915k642135l919754l535385r32694
873.8F52447586o88248N77851J353836J045837L79029l9979m57000j879425j548157
882.4F51191330k238464n96314J878510K095642J603241Q93783l42025l648148k635803
$$ plain form
821.7 611579742 611828079 611269875 611476707 611948051 613227272 615489883 619156532 623698311 625678291
830.4 625678291 626805382 627846146 628164978 628305511 629933128 632666283 634724236 637204399 639769363
839 639769363 642414474 643462067 643361282 642291565 640676575 641175537 642349548 645052795 647873306
847.7 647873306 650344696 652552338 652689133 651783752 650703354 651021423 651019211 652079620 654930878
856.4 654930878 658347473 661703873 662940445 663772125 662874146 661191788 660069199 659533844 660075989
865.1 660075989 661296234 663849258 665060349 664896469 663477554 660835419 656915665 653380280 652447586
873.8 652447586 651759338 652337189 653691025 654736862 655115891 655075912 654618912 652739487 651191330
882.4 651191330 648952866 648356552 650235062 652330704 653933945 654827728 654485703 650837555 648201752
891.1F48201752j185990j190338J16577J828843K997512J232376J263428l22571k703628
899.8F50237961k968521k954941j342545k32772J650161K741471L122406K270355N50384
908.5F53073959l43322j175995J74865j21688K47268J404038J257248K58636j636429
917.2F53138580j389923k675094l389588k536392k083588j195640n36843l34434j065445
925.8F37931633j832047l413543l729134l879127m001122k286491p57675Q59832J003228
934.5F19895554N00717n64308j053200q36792k408486k171363r59053J06811Q97026
943.2F13406906J370697J091576l46985r15451k745514k925682r23691j34582L91120
951.9F08268394J190911J965408J130905r6283j647262l987122m545212k886734j533050
$$ plain form
891.1 648201752 647015762 645825424 645942001 647770844 650768356 652000732 653264160 652941589 650237961
899.8 650237961 647269440 644314499 642971954 642739182 644389343 647130814 650253220 652523575 653073959
908.5 653073959 652730637 651554642 651729507 651607819 651855087 653259125 654516373 654775009 653138580
917.2 653138580 651748657 649073563 645683975 643147583 641063995 639868355 639331512 638997078 637931633
925.8 637931633 636099586 632686043 628956909 625077782 621076660 618790169 618032494 618892326 619895554
934.5 619895554 620396271 619831963 618778763 617941971 615533485 613362122 612403069 612509880 613406906
943.2 613406906 614777603 615869179 615522194 614606743 611861229 608935547 608011856 607877274 608268394
951.9 608268394 609459305 611424713 612555618 612459335 610812073 606824951 602279739 599393005 597859955
960.6E97859955r93462l63960o2218N0850o49338j703300k765236l468285k918968
969.2E84986038k094078j023712l1242O76345L86925j378097l436470m225617l889389
977.9E69970703m136925l525200k413825k012520j991082j940383k401772m113121
985.6E47435875n189858n176544m102859k634278k247161j529885p37152j390800j972809
994.3E22454529k380753l064193m039803l722115k027473j132278k91062n43671p18040
1003E04535141j216011k829361l114319l084984k661400k073440r09691o09894o44378
1011.7D87391663m17061j926575k405357l186188l120728l071594l595466k091866
1019.4D67576828j056862m654j087074k130814k458267k923317k467995k364501r75228
$$ plain form
960.6 597859955 596866493 596502533 596440315 596491165 595841827 594138527 591373291 587905006 584986038
969.2 584986038 582891960 581868248 581837006 582513351 582900276 581522179 578085709 573860092 569970703
977.9 569970703 565833778 562308578 559894753 557882233 555891151 553950768 551548996 547435875
985.6 547435875 542246017 537069473 532966614 530332336 528085175 526555290 525818138 524427338 522454529
994.3 522454529 520073776 517009583 512969780 509247665 507220192 506087914 505796852 505253181 504535141
1003 504535141 503319130 500489769 497375450 494290466 491629066 489555626 488645935 488036041 487391663
1011.7 487391663 486974602 485048027 482642670 479456482 476335754 473264160 469668694 467576828
1019.4 467576828 466519966 466515312 465428238 463297424 460839157 457915840 455447845 453083344 452108116
1028.1D52108116l96576M55094O94732O93398J015281M82445l33824j928253n15823
1036.7D52274590N47027J586609K862167K666436L350029K216148J02234j672249j629600
1045.4D62303391j681481j415214o8016L40538J324844R3956r19838j997833k210198
1054.1D55770149j237106j962814j156922p26356J98211R46694K433891L115692J807633
1062.8D59189072J329994n36003j87378J318588J767998J761436K165833K354240J352158
1071.5D70515938L67317j028175o78673j443482j160507L99704N43022J978760J450729
1080.1D70944633O89774p41310k071228j732864r51615Q9417N63697K238121K680779
1088.8D71709404L135185J710816M10919O41861j076622j219063p88383J181030K206344
$$ plain form
1028.1 452108116 451711540 452166634 452861366 453554764 454570045 455052490 454718666 452790413 452274590
1036.7 452274590 452821617 454408226 457270393 459936829 463286858 465503006 465605240 463932991 462303391
1045.4 462303391 460621910 459206696 459138680 459479218 460804062 460898018 459978180 457980347 455770149
1054.1 455770149 454533043 452570229 451413307 450686951 450885162 451831856 454265747 457381439 459189072
1062.8 459189072 460519066 459983063 459795685 461114273 462882271 464643707 466809540 469163780 470515938
1071.5 470515938 470883255 469855080 469176407 467732925 466572418 466972122 467515144 469493904 470944633
1080.1 470944633 471634407 470893097 468821869 467089005 466137390 466226807 466790504 469028625 471709404
1088.8 471709404 474844589 476555405 476966324 477608185 476531563 475312500 474524117 475705147 477911491
1097.5D77911491L008347M324684K379036Q33130m39110o32591k72713M34036R42917
1106.2D88489227J506996L452340K506942R79538k36129j018677o30646n57632l75557
1114.9D94116402P12776K324829K339439K764130J326256p34177o78253j727486k090721
1123.5D98353195r73129Q53195K131844K472534K242699K236671J528168k52915m72030
1132.2E08120232j27945J221008J660423K189713L609848L507919L321724J110764
1139.9E24613686l13492j74675r39179j266021m76571J534119K638931K850037J763916
1148.6E30230751K55966n47600j799736k294731j374702J13716J296272K072754J455727
1157.3E29408417J36566r27429j652298j920967k513428j242294N76858J669235K972451
$$ plain form
1097.5 477911491 480919838 485244522 487623558 488456688 488017578 487384987 487112274 487546310 488489227
1106.2 488489227 489996223 493448563 495955505 496935043 496698914 495680237 495049591 494491959 494116402
1114.9 494116402 494829178 497154007 499493446 502257576 503583832 502849655 502171402 500443916 498353195
1123.5 498353195 497380066 498233261 500365105 502837639 505080338 507317009 508845177 508592262 508120232
1132.2 508120232 507992287 509213295 510873718 513063431 516673279 520181198 523502922 524613686
1139.9 524613686 524300194 524125519 523186340 521920319 521443748 522977867 525616798 528466835 530230751
1148.6 530230751 530486717 529939117 528139381 525844650 524469948 524583664 525879936 527952690 529408417
1157.3 529408417 529544983 528617554 526965256 525044289 522530861 521288567 521865425 523534660 526507111
1166E26507111L465347L328018K016487R95636L12958N2338O64939K142716L693199
1174.6E43178749M473953N050812L626289J878624R20601L2807m47045M33541J941414
1183.3E61089745K316474L173676L575974K470970J152610k52571j558113j642227
1191E70326538p13539O41289J503067J648750J784859J170921J9722j539879k716217
1199.7E72125511l130264k567406o67229O90728J895904J925965J99813n06858j422120
1208.4E68544044k587318k597580j534233j45493N70374J655960K452965J201477n73082
1217.1E66987114j315231k114640k439193j741448o63452P95784J705055J882744J057091
1225.8E64153824n01938j532021k417259k552795j926270q86879M16642J307525K086449
$$ plain form
1166 526507111 529972458 533300476 535316963 536312599 536625557 536677895 537342834 539485550 543178749
1174.6 543178749 547652702 552703514 556329803 558208427 559129028 559161835 558714790 559148331 561089745
1183.3 561089745 563406219 566579895 570155869 572626839 573779449 573526878 571968765 570326538
1191 570326538 569612999 570254288 571757355 573406105 575190964 576361885 576381607 574841728 572125511
1199.7 572125511 568995247 566427841 565760612 566451340 568347244 570273209 570473022 569966164 568544044
1208.4 568544044 565956726 563359146 561824913 561679420 562249794 563905754 566358719 567560196 566987114
1217.1 566987114 565671883 563557243 561118050 559376602 558713150 559508934 561213989 563096733 564153824
1225.8 564153824 563651886 562119865 559702606 557149811 555223541 554336662 554753304 556060829 558147278
1234.4E58147278J612511J36871j195755k182541k574425j777229k19803R89571J858902
1243.1E54795380J623573J492004P79381j274109k254333k493859j783180p38411L13721
1251.8E50460167J822967K250634J986122N21087j117095j821862j939392j502533
1259.5E50660095j104316N82809K510490L088875K111588P38678m32206j053504j046753
1268.2E56055756j078225j89018J246643K553482L302460K518234J311684M95148p55310
1276.9E65460854j732712j244545J89018J434975K487144L004952K336807J842651
1284.6E73779144J130028m97360j461678j142349J21727J485252K600747L037262K758407
1293.3E81811180J144943p59315j561966k037621j184501k28653O69441J916046K296028
$$ plain form
1234.4 558147278 559759789 559896660 558700905 556518364 553943939 552166710 551946907 552936478 554795380
1243.1 554795380 556418953 557910957 558690338 557416229 555161896 552668037 550884857 550146446 550460167
1251.8 550460167 552283134 554533768 556519890 557040977 555923882 554102020 552162628 550660095
1259.5 550660095 549555779 550138588 552649078 555737953 557849541 558588219 558156013 557102509 556055756
1268.2 556055756 554977531 554788513 556035156 558588638 561891098 564409332 565721016 566216164 565460854
1276.9 565460854 563728142 562483597 562672615 564107590 566594734 569599686 571936493 573779144
1284.6 573779144 574909172 574411812 572950134 571807785 571929512 573414764 576015511 579052773 581811180
1293.3 581811180 582956123 582196808 580634842 578597221 577412720 577184067 577853508 579769554 582065582
1301.9E82065582J646767L66020o91452j786613k151108k072029j286698o4964J346130
1310.6E77371635K123909R37005J86767j022262k563286k638512j985435p87240K21062
1319.3E71843643K272797L549003K475625Q48731l46145j193237j789475j383476m38461
1328E75839005O00395J112289J082993J272735N30052r19532j919480k322540k660828
1336.7E72615089j302795L25470J059265K527199L152847K125130K83012j191978j618500
1345.3E77974739j413765m74319N77240J674270K409134K160950M80652j059075j790237
1354E80539589k641449k092819r89990L25851J401977K032052J565589P0687j039925
1362.7E79171562l288116j314926q29964j096840l48206Q7853J613502J568757P47604
$$ plain form
1301.9 582065582 583712349 584078369 583386917 581600304 579449196 577377167 576090469 576025505 577371635
1310.6 577371635 579495544 580432549 580619316 579597054 577033768 574395256 572409821 571622581 571843643
1319.3 571843643 574116440 577665443 580141068 580989799 580643654 579450417 577660942 576277466 575839005
1328 575839005 576439400 577551689 578634682 579907417 580437469 579517937 577598457 575275917 572615089
1336.7 572615089 571312294 571637764 572697029 575224228 578377075 580502205 580785217 579593239 577974739
1345.3 577974739 576560974 576086655 576663895 578338165 580747299 582908249 583388901 582329826 580539589
1354 580539589 577898140 575805321 574815331 575141182 576543159 578575211 580140800 580211487 579171562
1362.7 579171562 575883446 574568520 573738556 572641716 572293510 572381363 573994865 575563622 576311226
1371.4E76311226n66559j836815l148956k025299L50036L33786J074677K137451J891213
1380.1E74520760N90210p26204j605072k542458k241859j549759q10662K04888K114105
1388.7E67953949J708679k13585j377372k274704j906395m322014m515190J33476M82330
1397.4E55669174J83182j477814m77447p20978k778664k658004k591973l762474j332207
1406.1E40052795R50394O80199R765j025962j883393j737900k805442k325516j326409
1414.8E30588531o32591j81198O98166J336975l653145k59094R24606j415138j844749
1423.4E25562363k246895J278076K122917J492768K115249R22012o58493l76434L58620
1432.1E30570183n69153O4697J672745K02332r29337L952064M087830J472817N42945
$$ plain form
1371.4 576311226 575744667 573907852 570758896 568733597 569083633 569417419 570492096 572629547 574520760
1380.1 574520760 575110970 574384766 572779694 570237236 567995377 566445618 565634956 565839844 567953949
1388.7 567953949 569662628 569449043 568071671 565796967 563890572 559568558 555053368 555186844 555669174
1397.4 555669174 555852356 554374542 553897095 553176117 550397453 547739449 545147476 541385002 540052795
1406.1 540052795 541003189 541683388 541693153 540667191 538783798 537045898 534240456 531914940 530588531
1414.8 530588531 529955940 529774742 530472908 531809883 528156738 527897644 528822250 527407112 525562363
1423.4 525562363 523315468 524593544 526716461 528209229 530324478 531246490 530587997 530211563 530570183
1432.1 530570183 530001030 530065727 531738472 531940804 531011467 534963531 539051361 540524178 541067123
1440.8E41067123L19786n35545O26145K50244J635284K835846J971550N23834J185036
1449.5E49879303J078262o32591k32887J91726J680336J725770J472015P16400j614456
1458.2E54263878M583549K241478J920853Q42628Q16460J821594j025161L435936M361381
1466.8E73262596L707008J961899J173096J657944o65016j628762J908226P004433
1474.6E88381424M690247K178688L695678L077050J252174l38478p78999J77345J536407
1483.2F03871536K228546K388840K657890Q97789j42250O84052l629379l121415J543770
1491.9F07379379J943093J300811Q41332j91765l895225J460952j232643l886833k55356
1500.6F03463745j397781l63655J063995K288666J022033q489341o836586L180618
$$ plain form
1440.8 541067123 541386909 540851364 541477509 541727753 543363037 546198883 548170433 548694267 549879303
1449.5 549879303 550957565 550324974 550092087 550283813 551964149 553689919 555161934 555878334 554263878
1458.2 554263878 558847427 561088905 563009758 563852386 564668846 566490440 565465279 568901215 573262596
1466.8 573262596 576969604 578931503 580104599 581762543 581097527 579468765 581376991 588381424
1474.6 588381424 593071671 595250359 598946037 602023087 603275261 602936783 602157784 602335129 603871536
1483.2 603871536 606100082 608488922 611146812 612044601 611902351 612586403 608957024 605835609 607379379
1491.9 607379379 609322472 610623283 611464615 611272850 607377625 608838577 607605934 603719101 603463745
1500.6 603463745 602065964 601702309 602766304 605054970 606077003 597587662 590751076 593931694
1508.3E93931694K126999j089134J121406o96754m40178K178650K52037n0469k568473
1517E94765778l356362J940804N15594m410057l251839L179665L383217K044640n06669
1525.7E94304771Q89092j57318j910439L07007N56412k73171k55851p47681p70531
1534.3E91942291L306313J731262O49300R64508p779236o235924L478127J636085J343880
1543E91036606K669449J178131m67377K329826K88430j80703k451095j373444L293839
1551.7E96323662J716499J330795k881240M34913K353516j98631o799126j4624100
1559.4E77656288Q782463N432129L748398J517639l95164l193016j981926j59111k377205
1568.1E89030495l510018p522659J843719J354523n41382r28077k075196k369842j2707558
$$ plain form
1508.3 593931694 596058693 594969559 596090965 595394211 594954033 597132683 597384720 597334251 594765778
1517 594765778 591409416 593350220 593865814 589455757 586203918 589383583 592766800 594811440 594304771
1525.7 594304771 595193863 595036545 593126106 593433113 593989525 593716354 593460503 592712822 591942291
1534.3 591942291 595248604 596979866 597629166 598593674 590814438 584578514 588056641 589692726 591036606
1543 591036606 593706055 594884186 594416809 596746635 597035065 596854362 594403267 593029823 596323662
1551.7 596323662 598040161 599370956 596489716 596924629 599278145 599079514 592280388 577656288
1559.4 577656288 586438751 591870880 595619278 597136917 596741753 593548737 591566811 591407700 589030495
1568.1 589030495 585520477 577997818 579841537 581196060 580654678 579726601 577651405 575281563 562574005
1576.8E62574005K52419j265068l019829k049637k753143j285172l488235k810326
1584.5E46155014m363785m210663l887786m394112k393227l951645j699295l234214
1592.2E18020287k306595l294068n008392k941360m128190k141571l907547j754226
1599.9D92538338k499161k191925j077232l918686j486740l191491k063942l363838
1607.6D72745323j776581j377182j952781J042022j954078n81932k430878o34575j816025
1616.3D61263313q865089K979812j3580J298638m97895J070099j361008m026527J754990
1625D53602753l49961R22165k706108R46655J233178O90574J455956K22091J654397
1633.7D57671700j355210l360367n71327K877426K162514J532707K670479P20139K121315
$$ plain form
1576.8 562574005 562826424 561561356 558541527 556491890 553738747 552453575 548965340 546155014
1584.5 546155014 541791229 537580566 533692780 529298668 526905441 522953796 521254501 518020287
1592.2 518020287 515713692 512419624 507411232 504469872 500341682 498200111 494292564 492538338
1599.9 492538338 490039177 487847252 486770020 482851334 481364594 478173103 476109161 472745323
1607.6 472745323 470968742 469591560 467638779 468680801 466726723 466144791 463713913 463079338 461263313
1616.3 461263313 452398224 455378036 455364456 456663094 456165199 457235298 455874290 451847763 453602753
1625 453602753 453252792 454174957 451468849 452415504 453648682 454339256 455795212 456017303 457671700
1633.7 457671700 456316490 452956123 452384796 455262222 457424736 458957443 461627922 462348061 464469376
1642.4D64469376O8245J841239J001397k995911J999245J9951N300331L103408L720284
1651D78527565K489128l041305k111016K204438N117340K480468L002510J874009K442588
1659.7D92985725K659417K242622J667175n61485L635788K193603K555275K962647
1667.4E10340767K442055J294784J724739M395523J381188L615494L498954O07567
1675.1E29301071N23987M299736N030861L262482L423538J662407M248886M030647
1682.9E55783615j508446j180153M227562P202416L899841K936707L454513K627449
1690.6E77443504L907776L182221K998237K799988K089958j040573N812912O906357
1698.3F04100380N925102J302757n058174P378846N151901K788238J038361J922645
$$ plain form
1642.4 464469376 464537621 466378860 467380257 464384346 466383591 466403542 471703873 474807281 478527565
1651 478527565 481016693 477975388 475864372 478068810 483186150 485666618 488669128 490543137 492985725
1659.7 492985725 495645142 497887764 499554939 498993454 502629242 504822845 507378120 510340767
1667.4 510340767 512782822 514077606 515802345 520197868 521579056 525194550 528693504 529301071
1675.1 529301071 529825058 534124794 539155655 542418137 545841675 547504082 551752968 555783615
1682.9 555783615 554275169 553095016 557322578 564524994 568424835 571361542 574816055 577443504
1690.6 577443504 581351280 584533501 587531738 590331726 592421684 591381111 597194023 604100380
1698.3 604100380 610025482 611328239 606270065 613648911 618800812 621589050 622627411 624550056
1706F24550056K615929L763695M310684J889839P90329J617012J879463J840821q14820
1714.7F42443008M44642L667144J33286n234604N902328M308014J257782N50385J43509
1723.4F53615494Q69293J871567J672134J758576K000885J394806j900330n9967L499069
1732F64721527K050247m778442l505631P064743N088196K374573K407379j305923j608124
1740.7F72508545M259262K005539o46210K474823M301605K913132K020874J780091
1748.4F91617661R72900L853455L23562R35516N075531L404313L611526K627640n69916
1757.1G11852188K263336L037491K143707J977311k283402P18460M234543K424774
1764.8G26368408K145539K378463P43485k303848K568054L179321k038956l107605
$$ plain form
1706 624550056 627165985 630929680 635240364 637130203 637920532 639537544 641417007 643257828 642443008
1714.7 642443008 642887650 646554794 646688080 641453476 647355804 651663818 652921600 653471985 653615494
1723.4 653615494 654484787 656356354 658028488 659787064 661787949 663182755 661282425 661222458 664721527
1732 664721527 666771774 661993332 658487701 665552444 670640640 673015213 675422592 674116669 672508545
1740.7 672508545 676767807 678773346 678127136 680601959 684903564 687816696 689837570 691617661
1748.4 691617661 692590561 696444016 696767578 697703094 702778625 706182938 709794464 712422104 711852188
1757.1 711852188 714115524 717153015 719296722 721274033 718990631 719709091 723943634 726368408
1764.8 726368408 728513947 730892410 731635895 729332047 731900101 735079422 733040466 729932861
1772.5G29932861J035996N403747K217560m30450K705917Q69141N69229l93219j233673
1781.2G40677109J584091K548904J713333o11190J171417J877670M44336J83106M12292
1789.9G50001068o37894l26156j868210J393661M565201O82144k31170J823807J199111
1798.6G56601562q52737j549683J493836k33383J599350K660446R85107Q97599k77710
1807.3G61324387m70505M44259M61197j697311O34460K509079J423111J268464L08990
1815.9G66206131K47269j283341p4768R82437j1825R12704J91803J974335R42535l164291
1825.6G66922989J044617K070770N24597k581787l894272K989960L779983J085053
1833.3G71941910P42492O96030q8806q89359j328887O74209M68979R25598R20334J647644
$$ plain form
1772.5 729932861 730968857 736372604 738590164 738159714 740865631 741734772 742304001 741910782 740677109
1781.2 740677109 742261200 744810104 746523437 745912247 747083664 748961334 749405670 749588776 750001068
1789.9 750001068 749363174 749037018 747168808 748562469 753127670 753809814 753578644 755402451 756601562
1798.6 756601562 755748825 754199142 755692978 755459595 757058945 759719391 760704498 761602097 761324387
1807.3 761324387 760853882 761298141 761759338 760062027 760696487 763205566 764628677 765897141 766206131
1815.9 766206131 766453400 765170059 765095291 766077728 766065903 766978607 767170410 769144745 770087280 766922989
1825.6 766922989 767967606 770038376 770562973 767981186 764086914 767076874 770856857 771941910
1833.3 771941910 772684402 773380432 773291626 772402267 771073380 771747589 772216568 773142166 774062500 775710144
1842.9G75710144P6294n606079L022919J877441j333237l58581R94491J432648O62384
1851.6G76478424J487503N63965o9275m18243p53022m56390o99615M21295N42602J434174
1861.3G78531418Q15430L11355M74777j67617k52457j589356m24041j900864o02951
1869.9G75195694K920685K074280J310043J45645N9052q89512j148605m83475K96631
1878.6G79480438Q67691N64347J249160M38538L55148p24563j322937k38114k29568
1887.3G80440140J090393n46189r77630J929245J664734K31704m87060j076737j168136
1896G81100464N71060k4948L10745J115265O28204M61655j28708o9580r20181o47125
1905.6G82396851l10212j82724N97458O45447Q74252M73481Q90426l36609j051025
$$ plain form
1842.9 775710144 775786438 770180359 773203278 775080719 773747482 773388901 774383392 775816040 776478424
1851.6 776478424 777965927 778529892 778460617 778042374 777289352 776832962 776133347 776554642 777097244 778531418
1861.3 778531418 779346848 779658203 780132980 779965363 779712906 778123550 777699509 775798645 775195694
1869.9 775195694 778116379 780190659 781500702 781646347 781705399 780815887 779667282 779183807 779480438
1878.6 779480438 780348129 780912476 782161636 782600174 782955322 782230759 780907822 780669708 780440140
1887.3 780440140 781530533 780984344 780006714 781935959 783600693 783832397 783345337 782268600 781100464
1896 781100464 781671524 781646576 781957321 783072586 783700790 784162445 784033737 783964157 783043976 782396851
1905.6 782396851 782086639 781903915 782501373 783146820 784021072 784494553 785384979 785048370 783997345
1914.3G83997345r27506k26516O22329k043075Q10394K451248J166687p0114k457809
1923G83322983q97064M71954r4071k78625P37000J154403R26819P01981M8370m38080
1932.6G85655670j521988o90155o51855m74167Q40759R65042J282959P03964O48346
1941.3G86758575j642456k897415M25110n7144n18189L90778J169891R34067N95093
1950G85158310K8229n33219p73849j165466n22004k61535L61099P24716J049881J061936
1959.6G85128098q4229p59506j437912o86264k86026O2866L03726k87857J111679J385803
1969.3G84450378N20249n39932j037217j108703n04303R4986l7003Q20694O32096M90417
1978.9G83781662N12390k51541j036835j254425o97021n79148O56510J247864P61108
$$ plain form
1914.3 783997345 783069839 782843323 783465652 781422577 782232971 784684219 785850906 785780792 783322983
1923 783322983 782425919 782897873 782803802 782525177 783262177 784416580 785343399 786045380 786093750 785655670
1932.6 785655670 784133682 783443527 782791672 782317505 783158264 784123306 785406265 786110229 786758575
1941.3 786758575 785116119 782218704 782643814 782586670 782068481 782459259 783629150 784563217 785158310
1950 785158310 785186539 784653320 783879471 782714005 782192001 781930466 782291565 783016281 784066162 785128098
1959.6 785128098 785043869 784284363 782846451 782160187 781874161 781937027 782240753 781952896 783064575 784450378
1969.3 784450378 784970627 784430695 783393478 782284775 781780472 781875458 781838455 782659149 783291245 783781662
1978.9 783781662 784294052 784042511 783005676 781751251 781054230 780475082 781131592 782379456 783140564
1987.6G83140564J18103m9820M38309j230622k604904p56683R87472P12891P01218
1996.3G81456528J152954J76239j03989m99573r22699j424255p03964K63672L7384
2005G79432297R10187J112976O82983k32162m89121n65109j173401o39877l41874L24860
2014.6G79021759P73468O77948J19324o1951j42670q81500r29260j432571p51725M84162
2024.2G76876984J196365J267853N14450l4027o72379o33850j412735j024170r0561
2032.9G75987930K47193J054382O66199O99157n3710n57404p98187j419754j173630
2041.6G74652176l22647R61990O71616J125030P35474l20664m25796j249924n20859
2050.3G75306396o81457p10144K18277J089554J205673M69589M06418r40704j258927
$$ plain form
1987.6 783140564 783258667 783208847 783647156 782416534 779811630 779054947 780042419 780755310 781456528
1996.3 781456528 782609482 782785721 782681732 782182159 781259460 779835205 779131241 779394913 779432297
2005 779432297 780342484 781455460 782138443 781906281 781417160 780852051 779678650 779038773 778696899 779021759
2014.6 779021759 779795227 780473175 780592499 780530548 780387878 779506378 778577118 777144547 776392822 776876984
2024.2 776876984 778073349 779341202 779855652 779821625 779149246 778515396 777102661 776078491 775987930
2032.9 775987930 776235123 777289505 777955704 778654861 778601151 778043747 777245560 775825806 774652176
2041.6 774652176 774329529 775291519 775963135 777088165 777823639 777502975 777077179 775827255 775306396
2050.3 775306396 774624939 773914795 774133072 775222626 776428299 776897888 777304306 776363602 775104675
2059G75104675j119919m76989K85797p3853R61914R69620M60816J09863l49045q76923
2068.6G74995956j077652j003952q79592Q72192J113052Q66928O91834J23443k41317
2077.3G75460892j278611r47723q46023m38004K15836O96716J462326J003647Q6822
2086G75415878r28192r47189j140442j114121l14102N75638J286087R78623P45697
2094.6G74557877k55280n24445p39135j370468r48563l30734O74362N67169O33392
2103.3G72264175P16629M10004j13449r50928j017151j172180n7297M13285O07223
2112G71100311J145401P28531L15018r26438j037139j056519j123047k86636L60946
2120.7G69220428Q67692J076354Q95844j81198k34680o88248j222229o63300m68368
$$ plain form
2059 775104675 773984756 773507767 773793564 773719711 774681625 775651245 776112061 776221924 775872879 774995956
2068.6 774995956 773918304 772914352 772034760 772906952 774020004 774886932 775578766 775702209 775460892
2077.3 775460892 774182281 773234558 772388535 771950531 772166367 772863083 774325409 775329056 775415878
2086 775415878 774487686 773540497 772400055 771285934 770971832 771547470 772833557 773812180 774557877
2094.6 774557877 774302597 773778152 773039017 771668549 770719986 770389252 771063614 771630783 772264175
2103.3 772264175 772980804 773390808 773277359 772326431 771309280 770137100 770079803 770493088 771100311
2112 771100311 772245712 772974243 773289261 772362823 771325684 770269165 769146118 768859482 769220428
2120.7 769220428 770088120 771164474 772060318 771879120 771644440 770956192 769733963 769070663 768602295
2129.4G68602295M38003P93229J078796R34372J34277m84466q98361r38950j157532
2138G68501663k43988O09055J080169R26896O96106M07714p93914q47550j012115p43409
2147.7G68580627j72195N23071J037445P65686J027832L88260j88751j167526j502991
2156.4G69291458p47681j08490O09513N46341J090164P13501N36346N4703j130981
2165G70854874r27430q72802N3711L91235R49707J373520P77817J64871q74024p51953
2174.7G71139526j228027r77554k79007M43725J342316J025696J117096K33688n23682
2183.4G72293777j125335j017761n90668n10712P64847Q62427J173477Q36487L29055
2192G73015594R7352j101685j224213j067810p63N15747P01828J154557J088867M46091
$$ plain form
2129.4 768602295 769040298 769833527 770912323 771846695 771980972 771496506 770598145 769659195 768501663
2138 768501663 768257675 768866730 769946899 770873795 771569901 771977615 771183701 770336151 769324036 768580627
2147.7 768580627 768408432 768931503 769968948 770734634 771762466 772150726 771961975 770794449 769291458
2156.4 769291458 768543777 768435287 769044800 769591141 770681305 771394806 771931152 771985855 770854874
2165 770854874 769927444 769054642 769108353 769499588 770449295 771822815 772600632 772765503 771891479 771139526
2174.7 771139526 769911499 768933945 768654938 769098663 770440979 771466675 772583771 772817459 772293777
2183.4 772293777 771168442 770150681 769560013 769049301 769814148 770676575 771850052 772686539 773015594
2192 773015594 773112946 772011261 770787048 769719238 769718475 770234222 770936050 772090607 773179474 773625565
2201.7G73625565p71637p66907j115723p33795l53394j6708J260529J439514J326675
2210.4G73894119Q7433o36673q44650j238251j094360m99497O75736Q80432J198883
2219G72423172J091995O20957m04740j463852j103515q11539p5226M49295R56879Q59833
2228.7G72543259Q85620P64084m97437q22525j309891o46438k24304j54648Q48312
2237.4G71386032J291885J324463K88468k34146j282578j508179o20193n75638J81503
2246G70251617Q03833J305848J035995O71005l37524j219635r93805j314850n49240
2254.7G69653244K50855J346511J671448J118546L44314p31125o26220j473236j000443
2263.4G70553894q5907J06888O02035J202164J818390K65121n35430j178666j316299
$$ plain form
2201.7 773625565 772853928 772087021 770971298 770237503 769884109 769867401 771127930 772567444 773894119
2210.4 773894119 773981552 773344879 772500229 771261978 770167618 769668121 770343857 771224289 772423172
2219 772423172 773515167 774136124 773731384 772267532 771164017 770352478 770277252 770726547 771683426 772543259
2228.7 772543259 773428879 774192963 773695526 772873001 771563110 770916672 770692368 770537720 771386032
2237.4 771386032 772677917 774002380 774290848 774056702 772774124 771265945 770645752 770070114 770251617
2246 770251617 771055450 772361298 773397293 774068298 773730774 772511139 771517334 770202484 769653244
2254.7 769653244 769904099 771250610 772922058 774040604 774384918 773653793 773027573 771554337 770553894
2263.4 770553894 770467987 770574875 771176910 772379074 774197464 774462585 773927155 772748489 771432190
2272.1G71432190o13937r49555l66974P05109J932449J327744N07278N264j022110
2280.8G72957458j451644j731186l78189K72827J103286J514588Q41293P20597j87302
2289.4G73661728n29022j588974j608734o65513K98996J410141J048890J251449R91059
2298.1G74270020M94689p74383j966858j252441p35703K34528J120758J914978J313171
2306.8G74618759Q77609M20227j349182j288147j132202m36096j54953P22351K210388
2315.5G74488754J235352P15561N99746l04336j268921j275864j20239Q5373o12946
2324.2G73542480J296387L424301J921540K93731j632461j342163n60990j808853j312256
2332.8G73821716k95868J979828K411499J481018k44217j225967j111526j876603M01383
$$ plain form
2272.1 771432190 770818253 769868698 769501724 770206833 772139282 773467026 773974304 773979568 772957458
2280.8 772957458 771505814 769774628 769396439 769669266 770772552 772287140 773128433 773849030 773661728
2289.4 773661728 773132706 771543732 769934998 769269485 769568481 770978622 772027512 773278961 774270020
2298.1 774270020 774764709 773990326 772023468 770771027 770035324 770269852 771390610 773305588 774618759
2306.8 774618759 775496368 775916595 774567413 773279266 772147064 771710968 771556015 772278366 774488754
2315.5 774488754 775724106 776439667 777039413 776735077 775466156 774190292 774070053 774155426 773542480
2324.2 773542480 774838867 778263168 780184708 780478439 778845978 777503815 776942825 775133972 773821716
2332.8 773821716 773525848 775505676 777917175 779398193 779153976 777928009 776816483 774939880 775341263
2341.5G75341263J422043N14679J51596p2785k12021j967239k282333N3024R32846
2350.2G73881073r05762K04697K142715K210083J908188P78275J895447n13459r89380
2358.9G80611877n72204j100693q85849p29523J699906n73197K3652N97076j574249
2367.6G77496796k475510k750549k18888k05841j128463n22767O29273M92477j72348
2376.2G71144180r01489k327957j662216j565018j347809L1510R34295J250916N11169
2384.9G66067581r2239p22962j304092j901093j575546m57992L91388J392440J424790
2393.6G63222275J242523M02298q59451j519699j342316r12094j016541l9215P91474
2402.3G59969254J478881J194535m5090n14221j111222j256332j364670l33023M97055
$$ plain form
2341.5 775341263 776763306 777277985 777429581 777356796 777144775 775177536 772895203 772948227 773881073
2350.2 773881073 772975311 773180008 775322723 777532806 779440994 780219269 782114716 781601257 780611877
2358.9 780611877 780039673 778938980 778053131 777323608 779023514 778450317 778473969 779071045 777496796
2367.6 777496796 775021286 772270737 772051849 771846008 770717545 770194778 770824051 771316528 771144180
2376.2 771144180 770242691 767914734 766252518 764687500 763339691 763371201 764305496 765556412 766067581
2384.9 766067581 765975342 765252380 763948288 762047195 760471649 760013657 760405045 761797485 763222275
2393.6 763222275 764464798 764867096 764007645 762487946 761145630 760233536 759216995 759177780 759969254
2402.3 759969254 761448135 762642670 762597580 762083359 760972137 759715805 758351135 758018112 758515167
2410.9G58515167M95377J191330R53674J99585m16031r46960k060089j519928j71357
2419.6G56240768J92872J149215R19266O70776L05024n54734j368332j731186q90045
2428.3G54933624o23855K78015R73129R40857R10721L79410m25644j104813j412964
2437G54848480k083893q00476N51758Q33054J235199P70187O28815p54547j635437
2445.7G53593140j287232j188659n00641J49154P16400Q74253J117096M70886n10559
2454.3G53433838r56955j408539j500473j135178M24271O62384L29895Q06580N56717
2463G51212540r2163j039582j382675j488876q65860O2561K24457O63452J192322O30722
2472.7G49116898p57904j153031j209564j007004q76388l90625P60498R02404J018601
$$ plain form
2410.9 758515167 759010544 760201874 761155548 761355133 760939102 759992142 757932053 756412125 756240768
2419.6 756240768 756433640 757582855 758502121 759172897 759477921 758923187 757554855 755823669 754933624
2428.3 754933624 754309769 754587784 755560913 756501770 757412491 757791901 757366257 756261444 754848480
2437 754848480 752764587 751964111 752515869 753348923 754584122 755354309 755983124 755228577 753593140
2445.7 753593140 752305908 751117249 750616608 750765762 751482162 752356415 753473511 753944397 753433838
2454.3 753433838 752476883 751068344 749567871 748432693 748856964 749519348 749849243 750655823 751212540
2463 751212540 751120377 750080795 748698120 747209244 746343384 746405945 746630402 747293854 748486176 749116898
2472.7 749116898 748358994 747205963 745996399 744989395 744113007 743722382 744482880 745385284 746403885
2481.3G46403885M63180m69513j298980j768494j342544p64084P3547L88260Q91952
2490G42577209P26395K81525o6986j075592j316071j584244j134567l36761M50592
2498.7G38521500Q80432P71103O85501m02527p05185j135635j481476j194153p38525
2507.4G35201035K80304N53054J210709Q95386l27835j327591j747666j063919p48672
2516.1G32924805k32621K00348Q59299R38721L64227N417o30875j163253j939850j282807
2525.7G30043411n23987q2626R85642J185379Q09326j07651p77435j350556j216201
2534.4G28965302r95408r19876K94953J149673J216812O38123J68991j106796j803894
2543.1G27607880j260605r59244p019K5864M33883P41425N75027P04880n53284j363372
$$ plain form
2481.3 746403885 746867065 746397552 745098572 743330078 741987534 741223450 741296997 741685257 742577209
2490 742577209 743303604 743585129 743518143 742442551 741126480 739542236 738407669 738070908 738521500
2498.7 738521500 739401932 740173035 740858536 740456009 739750824 738615189 737133713 735939560 735201035
2507.4 735201035 735481339 736034393 737245102 738140488 737812653 736485062 734737396 733673477 732924805
2516.1 732924805 732692184 732892532 733751831 734690552 735054779 735060196 734429321 733266068 731326218 730043411
2525.7 730043411 729519424 729436798 730422440 731607819 732417145 732309494 731532059 730181503 728965302
2534.4 728965302 727969894 727050018 727344971 728494644 729711456 730349579 730518570 729411774 727607880
2543.1 727607880 726347275 725388031 725381012 725406876 725840759 726582184 727157211 727862091 727308807 725945435
2552.7G25945435j396180r65805q05282l02811O02875P51800P40509P2556m20990j228180
2562.4G22993927j489105j032639l93677M78669M93622Q29238M31519o5689m85916
2571G21759949j290818j401977r97009k45743k8229P24182M67301K51083M82330r13162
2580.7G18807907j250610j003189m40598n65872l50113P79648N43289L40653k64283
2589.4G16596832l14026o58416j335144j012803q41674N6610P12051P86514L02506
2598G14292450K1362k50091j258850j356354j140442q86078k06528Q39615R30405L15552
2607.7G11301041o0578n48630q93249j315308p50885m76913l20053M16412L81241L31879
2617.3G08064957J5793l69187j041489j227874q97065q67309k89917L15247P36465
$$ plain form
2552.7 725945435 724549255 723583450 722778168 722475357 723078232 723830032 724570541 724643097 724222107 722993927
2562.4 722993927 721504822 720472183 720078506 720557175 721050797 721880035 722311554 722245865 721759949
2571 721759949 720469131 719067154 718070145 717824402 717796173 718520355 718987656 719238739 719721069 718807907
2580.7 718807907 717557297 716554108 716113510 715547638 715197525 715977173 716520462 716861115 716596832
2589.4 716596832 716282806 715624390 714289246 713276443 712434769 712491379 713203430 713989944 714292450
2598 714292450 714313812 714063721 712804871 711448517 710308075 709421997 709215469 710055084 710985489 711301041
2607.7 711301041 711240463 710691833 709798584 708483276 707732391 707255478 706935425 707351837 707733078 708064957
2617.3 708064957 708080750 707711563 706670074 705442200 704545135 703677826 703387909 703703156 704439621
2626G04439621L31192k90375q53348j123046o91529o38580o23322l36074K98233K54364
2635.6G00767136L51867K45514o72378p40204j250305j170731m36630P1945N83572
2644.3F97749786M80729K34222l53394o76193r73739j108170r89075q40072l27301
2653F93196793L17916R31397K29568k34222j92108o97250r55582j096268q54263m34876
2662.6F90211105L91083O81992M68368J88217o58798j049270j029664m22134k42691
2671.3F88538208m90112J01318O72913M02527j97449m21829o56662o33164q51440p79724
2681F85684586l90854j78757M90799M51889J91498l86734p82395p87201q43124l24173
2690.6F83125534n33829p4920P51876K97318m45557m72946j92108n85403o73066p64312
$$ plain form
2626 704439621 704770813 704480438 703627090 702504044 701812515 701173935 700550613 700214539 700512772 700767136
2635.6 700767136 701119003 701364517 700692139 699951935 698701630 697530899 697094269 697166214 697749786
2644.3 697749786 698230515 698464737 698111343 697435150 696461411 695353241 694364166 693524094 693196793
2653 693196793 693514709 694446106 694675674 694441452 694249344 693552094 692596512 691500244 690645981 690211105
2662.6 690211105 690602188 691284180 691752548 691940765 691281967 690232697 689203033 688780899 688538208
2671.3 688538208 688048096 688149414 688822327 689224854 689027405 688605576 687948914 687315750 686464310 685684586
2681 685684586 685293732 685114975 685605774 686057663 686249161 685862427 685080032 684292831 683449707 683125534
2690.6 683125534 682591705 682516785 683268661 683565979 683120422 682647476 682455368 681869965 681196899 680432587
2700.3F80432587l60031J38549J15433L78037K24227n6610p46536j181259j293945
2708.9F77650452o06003N61218L38593K82516J05820r5902k38647p44934n90439o18744
2718.6F76043930o51321L1356N08271P3776L44315L89480n81665q12530j155549r73358
2728.2F73216705k92434q5678R9868L73307M85153k9373m80652m85077l44086m48303
2737.9F72009430l60947j98517l8909J66015J7243L40499J44654o85807j052627n93872
2747.5F69747162l75214l96881P38602Q22754L85589j7166o23779o30188j089783o85730
2757.2F67875366p4463k38266j85470L52554N88684o0272l48282m51431o82373r03321
2766.8F65872726n35736o4010L15551P99332K86102j47018l77350l80936q28704j536560
$$ plain form
2700.3 680432587 680072556 680211105 680326538 680704575 680928802 680872192 680125656 678944397 677650452
2708.9 677650452 677044449 677605667 677944260 678226776 678332596 678236694 677998047 677253113 676662674 676043930
2718.6 676043930 675392609 675423965 675932236 676006012 676350327 676739807 676158142 675345612 674190063 673216705
2728.2 673216705 672924271 672838593 672938461 673311768 673796921 673767548 673286896 672801819 672457733 672009430
2737.9 672009430 671648483 671449966 671411057 671577072 671594315 671934814 672079468 671393661 670341034 669747162
2747.5 669747162 669371948 668975067 669713669 670536423 670922012 670904846 670281067 669650879 668561096 667875366
2757.2 667875366 667800903 667562637 667377167 667729721 668318405 668258133 667909851 667458420 666776047 665872726
2766.8 665872726 665336990 665272980 665588531 666387863 666673965 666526947 666149597 665768661 664939957 663403397
2776.4F63403397q81958J50375O23321J09177K90222K69242n89829q74252j205292
2785.1F61294403q43048o24008L2196M66614O7291M64096q6975q24204r53445p44553
2794.8F58248367n80597q27789k84729M3259j06125L0823k35215r37881r22394n35812
2804.4F53891907n11475q03604p99408K0523L87116K86254k18734r86328j340790r77173
2814F48948288o62537j284866p49359O0120J63116R0179o19201p44553p22198j131058
2823.7F43347931j386795n80673J3351l94440l92456m15649j61057m96521j496734
2832.4F38036957j424370q07457j021271j248207n62935n38253o79055r15756j421089
2841.1F29418564j753235k128334j919174j723786j275062j016655j039238j495743
$$ plain form
2776.4 663403397 662521439 662671814 663295135 663404312 663694534 663963776 663373947 662499695 661294403
2785.1 661294403 660451355 659827347 659859543 660326157 660393448 660857544 660770569 659946365 658992920 658248367
2794.8 658248367 657667770 656839981 656555252 656598511 656492386 656523209 656287994 655350113 654427719 653891907
2804.4 653891907 653380432 652576828 651777420 651797943 652185059 652471313 652252579 651266251 649925461 648948288
2814 648948288 648285751 647000885 646251526 646311646 646474762 646564941 645945740 645201187 644478989 643347931
2823.7 643347931 641961136 641380463 641393814 640999374 640606918 640191269 640030212 639533691 638036957
2832.4 638036957 636612587 635805130 634783859 633535652 632972717 632434464 631755409 630839653 629418564
2841.1 629418564 627665329 625536995 623617821 621894035 620618973 619602318 618563080 617067337
2848.8F17067337k203026j820068j985245j778908r83314m99458J19285J70364M31176
2857.4F08518143P57179O21414k05841q41560o74668n14602l34359N6305K36702o21261
2867.1F06997452q77876m72794m96063o24161q70171o94542p22732l42941L88221K04811
2876.7F02489204k73704K8801J31111j022224j299973j041031o23665L6736m4708l42064
2886.4E98038483j041260j127243q14667o90498p10182j112900r66301m64630k30828
2895.1E90879974o08711o70814o97937n73235m73633j874771j838989m10156K33306
2903.7E83965034M19312j54762o91071o97288p74956j064186j456528j832275j286354
2912.4E76426926o15197o91566r89304j471634j364898j372223j616821j688576j447029
$$ plain form
2848.8 617067337 614864311 613044243 611058998 609280090 608296776 607797318 607916603 608086967 608518143
2857.4 608518143 609275322 609896736 609690895 608849335 608174667 607660065 607325706 607382011 607618713 606997452
2867.1 606997452 606119576 605646782 605150719 604526558 603656387 602961845 602239113 601896172 602284393 602489204
2876.7 602489204 602215500 602244301 602375412 601353188 600053215 599012184 598388519 598425255 598380547 598038483
2886.4 598038483 596997223 595869980 595055313 594364815 593654633 592541733 591575432 591110802 590879974
2895.1 590879974 590271263 589600449 588902512 588329277 587855644 585980873 584141884 583731728 583965034
2903.7 583965034 584384346 584229584 583538513 582841225 582066269 581002083 579545555 577713280 576426926
2912.4 576426926 575811729 575120163 574130859 572659225 571294327 569922104 568305283 566616707 565169678
2921.1E65169678o09513k76718j77650j07460J53122O6948k22130Q8158k74621o49375
2930.7E63160439j88447N24216P03697Q44117Q64029M60166N40696N75485P24106O03485
2940.4E68811989Q78868J096039K06947O97174J264458P46612M23584N5542n5809M03672
2950E74529076O88667M98238P75833P78122J95961J44233M6692o81419n52712N14717
2959.7E76937408O41671O09054J007385J097146Q45031O81382O25495L80097J66092
2968.3E82990761k13089L80134J366692J418076J317863J068382Q18100M74129J31760
2977E89752808m09470m35562N11780O24542L75938O86837J035270O42700k18238m24614
2986.7E92141991k51847l25775m62875J44234J033134J127205N05676k65159m58184
$$ plain form
2921.1 565169678 564560165 564283447 564105797 563998337 564151459 564218407 563996277 564084435 563809814 563160439
2930.7 563160439 562971992 563496208 564199905 565044022 565908051 566368217 566908913 567484398 568208504 568811989
2940.4 568811989 569690857 570786896 570993843 571691017 572955475 573702087 574125671 574181213 574125404 574529076
2950 574529076 575217743 575715981 576491814 577269936 577465897 577610130 577656822 576975403 576422691 576937408
2959.7 576937408 577579079 578188133 579195518 580292664 581137695 581819077 582444572 582824669 582990761
2968.3 582990761 582777672 583157806 584524498 585942574 587260437 588328819 589146919 589621048 589752808
2977 589752808 589343338 588907776 589419556 590044098 590420036 591106873 592142143 592784843 592566605 592141991
2986.7 592141991 591890144 591564369 591101494 591245728 592278862 593406067 593911743 593646584 593188400
2995.3E93188400j36032m95758j085167o19774J46370K97928r3002p4845J6594k81295
3005E90863419m82483j082039j258469q57315l13454L90549P97959L24592n99251m69703
3014.6E87313805p42073j439896j205673k70462n2338n62096J62354L06892q6937o73713
3024.3E82749863j410790j043815q44994m58641n37644l30734J18866j81160j26037
3033E77934914o20232p27501j058502j291885q20237o87370j83182J14594L92647k11983
3042.6E72841263p47490o77719j407967j528931q13560Q4877j29242k05498O0349m61540
3052.2E67014542m03786r06944j127549r44480j267663q45642n64651l26386J89743
3060.9E60817184K75040r5367r59282j765671j389999o92826n72624K327M39758l60908
$$ plain form
2995.3 593188400 593052368 592556610 591471443 590851669 590998039 591295967 591202965 591128120 591144714 590863419
3005 590863419 590380936 589298897 588040428 587183113 586869659 587260208 588058167 588382759 587783508 587313805
3014.6 587313805 586571732 585131836 583926163 583655701 583603363 583041267 583203621 583510513 583423576 582749863
3024.3 582749863 581339073 580295258 579450264 578991623 578453979 578123245 578242111 578060951 577934914
3033 577934914 577314682 576587181 575528679 574236794 573416557 572729187 572546005 572660599 573053246 572841263
3042.6 572841263 572093773 571416054 570008087 568479156 567665596 567750473 567621231 567415733 567476082 567014542
3052.2 567014542 566610756 565703812 564576263 563631783 562364120 561518478 560953827 560627441 560817184
3060.9 560817184 561092224 560996857 560037575 558271904 556881905 556189079 555616455 555618782 556058540 555697632
3070.6E55697632o08483l64341r17778r17664q31833n67054l00293l74222K18734k18963
3080.2E50815735m30603n33905j077652q01621r42802n45807n16319n00794O1302m19
3089.9E45527115k87399r63021q47664q77304p09877n26809q71621k03666l4104m5166
3099.5E40160484o45866r94682n35851p94334q33893q27561l50265l29895l31345J33286
3109.1E34650078l36876n95665q84514j185989j220398p76978k82783k59247J33552
3117.8E29241180j01089o23436o78825q41256j355781j372795p28760q56552p03964
3126.5E21978722J35307L33404J53351l55186j252976j882515j665878n66711k29721
3135.2E16647797k14463K96097q0795n36919j121025j022911l67622j363106j287766
$$ plain form
3070.6 555697632 555089149 554724808 553807030 552889366 552057533 551490479 551190186 550815964 551034698 550815735
3080.2 550815735 550385132 549851227 548773575 547971954 547029152 546483345 545967026 545466232 545527534 545527115
3089.9 545527115 545239716 544276695 543429031 542551727 541841850 541315041 540443420 540239754 540205650 540160484
3099.5 540160484 539514618 538519936 537984085 537189751 536355858 535528297 535178032 534848137 534516792 534650078
3109.1 534650078 534313202 533717537 532833023 531647034 530426636 529649658 529366875 529107628 529241180
3117.8 529241180 529140091 528516655 527837830 526996574 525640793 524267998 523539238 522682686 521978722
3126.5 521978722 522114029 522447433 522600784 522245598 520992622 519110107 517444229 516877518 516647797
3135.2 516647797 516433334 516729431 516648636 516111717 514990692 513967781 513600159 512237053 510949287
3143.9E10949287n91697p11632J01395N41496p95441j707840q18634m96292n92537
3152.5E05878105q22830j288681q66470o8741L50265l09067p22847j008110j271781
3161.2D99869843j301919j437530o12030m31366j87531K11030l96157r13429j301727
3169.9D93499184j150093j106034q23784o24694q10090m95529k97088k11182m96712
3178.6D87483978p01217j293183j676101r30443o32248m75426j94549m2000k91024
3187.3D81247787n71784o52619j100922j385726j051407j82534k0179o33393n71174
3195.9D75078049k36359r13620j208839n50537p72629j229172r97696j99280J6098
3204.6D68986015j38817j99813p71027q87756j124344j151505q21914l49045p1640
$$ plain form
3143.9 510949287 510357590 509645958 509747353 510288849 509493408 507785568 506966934 506470642 505878105
3152.5 505878105 505055275 503766594 502900124 502831383 503181648 502872581 502149734 501141624 499869843
3161.2 499869843 498567924 497130394 496518364 496086998 495899467 496110497 495714340 494800911 493499184
3169.9 493499184 492349091 491243057 490419273 489794579 488984489 488488960 488191872 487980690 487483978
3178.6 487483978 486782761 485489578 483813477 482883034 482250786 481775360 481580811 481538811 481247787
3187.3 481247787 480676003 480023384 478922462 477536736 476485329 476302795 476282616 475649223 475078049
3195.9 475078049 474841690 473928070 472719231 472168694 471396065 470166893 469169197 468969917 468986015
3204.6 468986015 468847198 468647385 467876358 466988602 465864258 464712753 463890839 463541794 463470154
3213.3D63470154p60918j49879L07083n40695p97387j041984j624909r35821j03264
3222D57822380n42641j57165J5640k40936n33829j380043j174736p64008m61044o61316
3231.6D51922302m79469m3335k09923j47095r91287p90252n73006j329003j016120
3240.3D46342812n22843o3743j98937m62608n67055m20685n62439r25407l99246n95551
3249.9D41624298q27866n73768j02081K49176j04065n27001j123237r81522n74684
3258.6D37059250n41191q98857p33376M30451J40609o03828l26042n1194n89790j172218
3268.3D32713814o64139j23253j87492j82305k79083k28996L79066p67975j821861
3276.9D28837776p22389m45671l96996k49786j526K86217k34032m28161m25377q12531
$$ plain form
3213.3 463470154 462709236 462559357 462866440 462325745 461528358 460486374 458861465 457925644 457822380
3222 457822380 457279739 457122574 457138214 456897278 456363449 454983406 453808670 453044662 452583618 451922302
3231.6 451922302 451442833 451399498 451189575 451042480 450051193 449260941 448687935 447358932 446342812
3240.3 446342812 445819969 445756226 445557289 445094681 444527626 444106941 443544502 442619095 442219849 441624298
3249.9 441624298 440796432 440222664 440120583 440369759 440265694 439738693 438615456 437633934 437059250
3258.6 437059250 436518059 435619202 434885826 435316277 435456886 434853058 434527016 434475822 433886032 432713814
3268.3 432713814 432049675 431926422 431738930 431556625 431277542 431048546 431427612 430659637 428837776
3276.9 428837776 428115387 427669716 427272720 427022934 427021408 427307625 427073593 426645432 426220055 425407524
3286.6D25407524r77707m12254k38457k11830M2801p0229k61306o05469l04833l67088
3296.2D22001152q74290p08542k11106p2136l59268P9155n7831r4413J106q67386q18901
3306.8D18017540o71196n12772l06015o03408n14603j97182k27852l42674j04942o94809
3316.5D13842087j170349o75736m28963l37371n0469j76315p51381o29082n98068p83768
3326.1D08240585j115379j243095n73044p41730q29506k08130N00565k13661j519776
3334.8D02296829r02939r39712q26645k21672j058464r53903j67313m42505q66318
3343.5C95917358p82852p05642q28820j129265o67457M8637k43606l06511k25830j88523
3353.1C90887489m36973j393585j393815k91824j42860o51245k27204j53389p12585
$$ plain form
3286.6 425407524 424429817 424017563 423779106 423567276 423610077 423539848 423278542 422673073 422368240 422001152
3296.2 422001152 421126862 420418320 420207214 420135078 419775810 419854965 419797134 419702721 419703827 418836441 418017540
3306.8 418017540 417346344 416833572 416527557 415924149 415409546 415212364 414984512 414641838 414536896 413842087
3316.5 413842087 412671738 411996002 411567039 411229668 411179199 411002884 410251503 409622421 409024353 408240585
3326.1 408240585 407125206 405882111 405309067 404567337 403737831 403529701 404030266 403816605 402296829
3334.8 402296829 401393890 400454178 399627533 399405861 398347397 397393494 397226181 396783676 395917358
3343.5 395917358 395134506 394428864 393600044 392470779 391803322 391851959 391608353 391301842 391076012 390887489
3353.1 390887489 390450516 389056931 387663116 387371292 387228432 386577187 386349983 386196594 385484009
3361.8C85484009o60172n52749r49364q90999n39246q48274n80559j38397O1722o3438
3371.4C80322533o43158n35164p36847r97772p18880k85416R194p6943j60026k66342
3381.1C75911179j52512r05266j355514o54068n27916l64266j33667J97373K19497
3389.8C72234840O3286N4627p94945j107750o27670n58167Q2054N40314m51393l16429
3399.4C69118767M47655j56174m77753m82254n76210n22613n42031k41737N01289M71344
3409.1C67540283k41279K3040R0790n77736p28874k33536J29814M082k43301K51732
3418.7C66015015N98640m12865N0507M90303j60446j31111n82199j41297N90782O57998
3428.3C66975327J03416J71623R34906j63269n64766l94172J40037R81178K18048k65846
$$ plain form
3361.8 385484009 384823837 384271088 383321724 382430725 381891479 381043205 380462646 380324249 380385971 380322533
3371.4 380322533 379679375 379144211 378407364 377409592 376690712 376405296 376414490 376337547 376177521 375911179
3381.1 375911179 375758667 374853401 373497887 372843819 372315903 371951637 371817970 372015343 372234840
3389.8 372234840 372298126 372352753 371557808 370450058 369822388 369264221 369346275 369886589 369435196 369118767
3399.4 369118767 369566422 369410248 368932495 368450241 367874031 367351418 366809387 366567650 367068939 367540283
3409.1 367540283 367299004 367322044 367412834 366835098 366106224 365872688 366002502 366006584 365763283 366015015
3418.7 366015015 366613655 366200790 366251297 366741600 366581154 366450043 365867844 365726547 366317329 366975327
3428.3 366975327 367078743 367250366 368185272 368022003 367457237 367063065 367203102 368184280 368402328 368136482
3438C68136482L92189J219139M03633k10800M2115j50681l5973L33252P93152n9585
3447.6C70862923O01043J345559K47497L04718L25546J54648J51558M93393Q93097
3456.3C75379982M38118L80745P22694Q49076N64041K76222J9760L95775O15616Q35647
3466C80477676R74427K12936J137695J139679K08817M96368M46472P69616L39660j86882
3475.6C86016464P60422J433754J056213P88651M55208L77464P66373n2796M07257
3484.3C92009010R56612J079407J433677R66072J013604J58729o1722P24526P63054
3493C99042969P31926O54258Q14438M32053P77588J297111Q96759O81038O31981O5537
3502.6D06025658k89231J040039J565323J606789J482468J172752K93312m73061J214142
$$ plain form
3438 368136482 368528671 369747810 370151443 369940643 369982758 369832077 369796104 370129356 370922508 370862923
3447.6 370862923 371463966 372809525 373057022 373361740 373687286 373841934 373993492 374486885 375379982
3456.3 375379982 375818100 376198845 376921539 377770615 378334656 378610878 378630638 379026413 379642029 380477676
3466 380477676 381452103 381665039 382802734 383942413 384151230 384647598 385094070 385863686 386203346 386016464
3475.6 386016464 386776886 388210640 389266853 390055504 390510712 390888176 391654549 391601753 392009010
3484.3 392009010 392965622 394045029 395478706 396444778 397458382 397617111 397555389 398279915 399042969
3493 399042969 399774895 400429153 401243591 401675644 402453232 403750343 404647102 405328140 405960121 406025658
3502.6 406025658 405736427 406776466 408341789 409948578 411431046 412603798 412897110 412424049 413638191
3511.3D13638191J329918P30362M57878N41344J390037Q99849R07555R03854M30260
3520D21229248J004295J813698J119004k823R04617J425133J322822M17824L62549
3528.6D29596367J027145J468468J305962N26428R62066R45740J669617J205139O69022
3537.3D39375954J552505M72450Q73414R43336J142883J217385R90448J428070K46010
3546D48242455J260070J085205J790200K019806J278762J239815m17633J720390K110062
3554.7D60329132K206383J786079J1750J440505J307030P20406M3793J860389J668053
3563.4D71373520J182594M375801K32086o21452j28288N90935L927230J765557J751365
3572D84449348J728173K108421J709633J101646K145806R25941J824112J117706J001587
$$ plain form
3511.3 413638191 414968109 415698471 416156349 416697693 418087730 418987579 419895134 420798988 421229248
3520 421229248 422233543 424047241 425166245 425163422 426068039 427493172 428815994 429233818 429596367
3528.6 429596367 430623512 432091980 433397942 433924370 434886436 435832176 437501793 438706932 439375954
3537.3 439375954 440928459 441400909 442274323 443217659 444360542 445577927 446568375 447996445 448242455
3546 448242455 449502525 450587730 452377930 454397736 455676498 456916313 456498680 458219070 460329132
3554.7 460329132 462535515 464321594 464333344 465773849 467080879 467801285 467845078 469705467 471373520
3563.4 471373520 472556114 476931915 477164001 476542549 476414261 477005196 480932426 482697983 484449348
3572 484449348 486177521 488285942 489995575 491097221 493243027 494168968 495993080 497110786 498112373
3580.7D98112373K267647K385941K315712J614875L659897M85497k483025J400604
3588.4E09759521O32477L441620L552094L305893J618385J108551K323112j649894
3596.1E24091759K490234M180489J608085K409363R88770J366920K210274K279358
3603.9E41625252L601303M131584J426430j951523K781410r83505N23071P235947J128387
3612.5E59518356n87845M382821L50456L699035L820725l23257K31132n76172L074761
3621.2E73590012N005951L913612K819633K352753K054138K413330M151421m136124
3628.9E92164726n887260O992721N957222N777398J675872o33812L656960L636322
3636.6F13340149J787338J4153J739120K877007K264480K020340J884880K488518L695488
$$ plain form
3580.7 498112373 500380020 502765961 505081673 506696548 510356445 510841942 508358917 509759521
3588.4 509759521 510391998 513833618 517385712 520691605 522309990 523418541 525741653 524091759
3596.1 524091759 526581993 530762482 532370567 534779930 535768700 537135620 539345894 541625252
3603.9 541625252 545226555 549358139 550784569 548833046 551614456 550630951 551154022 558389969 559518356
3612.5 559518356 558930511 563313332 563663788 567362823 571183548 570860291 571091423 570515251 573590012
3621.2 573590012 578595963 582509575 585329208 587681961 589736099 592149429 596300850 592164726
3628.9 592164726 586277466 593270187 599227409 605004807 606680679 606046867 609703827 613340149
3636.6 613340149 615127487 615141640 616880760 619757767 622022247 624042587 625927467 628415985 632111473
3645.3F32111473N303917k029533j587563P024002k044105l702088K379189O934433
3653F44389725M759674L877334L997498q385925K986068O318512J737671J737366J147003
3661.7F62564926K936630J783295J713562J847153M08096L741531J465149j194076
3669.4F75266266m2648n663453M309616R036484Q505173m280777j9589005O928788
3677.1F74470444R396743L851624k474289J976242M137039J997071O34308L06701J339417
3685.8F95635300M056472N532303r432678l486023O540451n930176K781678O049270
3693.5G01746597O31256J602326J00708l3951J555252J141739K508240J126404n436860
3702.2G04941711q93402M821167J592636P19223J148911K181854K562103p837677L579484
$$ plain form
3645.3 632111473 637415390 635385857 633798294 640822296 638778191 635076103 637455292 644389725
3653 644389725 649149399 653026733 657024231 648638306 651624374 657942886 659680557 661417923 662564926
3661.7 662564926 665501556 667284851 668998413 670845566 671253662 674995193 676460342 675266266
3669.4 675266266 675223618 669560165 673869781 682906265 691411438 687130661 667541656 674470444
3677.1 674470444 683867187 687718811 685244522 687220764 691357803 693354874 693989182 694295883 695635300
3685.8 695635300 699691772 705224075 695791397 692305374 698845825 692915649 695697327 701746597
3693.5 701746597 702377853 703980179 704080887 704046936 705602188 706743927 709252167 710378571 704941711
3702.2 704941711 704048309 708869476 710462112 711181335 712330246 714512100 717074203 709236526 712816010
3710.9G12816010K524032j3140640O853180N819931K38647L34702K693558J921005
3718.6G20060425l628617J203309O244278l867341m619445N004654q7052j775665k682343
3727.3G15852203J107407M580307J198959M425278l813629n820618P038880m589234
3735G19979553q229141L049240L375321J598815L323365K829361k821503M376984R807281
3743.7G37289276j7420425j4082108J3085404O621017M297562m963074r821320J1489869
3751.4G26496201l868485o529159O141281N037765K708893n631104K861100M623871
3759.1G31840363r092103q7051M974213J373367L05557K981110k332611l637543L048477
3767.8G29373779M152298j294327r629135L191224L998565J59607N43060n19943J654892
$$ plain form
3710.9 712816010 715340042 702199402 709052582 714872513 715111160 715445862 718139420 720060425
3718.6 720060425 716431808 717635117 723879395 720012054 715392609 720397263 720310211 718534546 715852203
3727.3 715852203 716959610 721539917 722738876 727164154 723350525 717529907 724568787 719979553
3735 719979553 711750412 714799652 718174973 719773788 723097153 725926514 723105011 727481995 737289276
3743.7 737289276 719868851 705786743 718872147 725493164 729790726 724827652 715006332 726496201
3751.4 726496201 722627716 716098557 722239838 727277603 729986496 724355392 727216492 731840363
3759.1 731840363 722748260 722661209 727635422 729008789 729314346 732295456 729962845 726325302 729373779
3767.8 729373779 733526077 732231750 722602615 725793839 729792404 729952011 730495071 729975128 731630020
3776.5G31630020J609726J792755j941528o488266L313675J910248L84903Q33053l397980
3785.2G29646606j11999J875610J021805L74527k88773M02833p1412J29700j24359
3793.8G32854538J846008L238831m347000l900833K124557M351196N146637r664001
3801.5G31649933r387665M979248L759766N121002L631363j1477204k325058O027756
3809.3G31979141K545471O9657j34278K04239J892243N273208m317245j3837662P207794
3817.9G30882568O044007K929077j410904j6276398M590454O175690K477951K241211
3825.7G37653656r08813m036026L73611J872482L317871N35279r118195L499909P137222
3834.3G40326996n367584K14157P186126r948425n164490O089325m703369K948456
$$ plain form
3776.5 731630020 733239746 735032501 733090973 726602707 729916382 731826630 732211533 733044586 729646606
3785.2 729646606 729534607 731410217 732432022 732806549 732517776 732920609 732849197 732978897 732854538
3793.8 732854538 734700546 737939377 733592377 729691544 731816101 736167297 741313934 731649933
3801.5 731649933 722262268 727241516 731001282 736122284 739753647 728276443 725951385 731979141
3809.3 731979141 734524612 734594269 734459991 734664230 736556473 741829681 737512436 723674774 730882568
3817.9 730882568 736926575 739855652 738444748 722168350 726758804 732934494 735412445 737653656
3825.7 737653656 736744843 732708817 733082428 734954910 738272781 738808060 729689865 733189774 740326996
3834.3 740326996 734959412 735173569 742359695 732411270 727246780 733336105 728632736 731581192
3842.1G31581192P328339l637925k825241L707657J548310n00107O71081j180267K078857
3850.7G38771896M106217j0119629l776932j1787414O898422J0699463n27268k99530
3858.4G33965225K411270J559143J183472n220642M58374N720520o089554m513321
3866.2G29474487N215912N673676M850616j0306396q819733N532455O142502J714707
3873.9G39478226r315949J901398M436645J060410K701187K821732p884827o530380
3881.6G28668442O162719J434632J901321L283692j2509690K861481M376679J172866
3889.3G37352142L762589l477249q927841K958374M308776p55157J063309R95941J790619
3898G39071503L15246q591766N200958J002579m746246M296188l775253j209946J897812
$$ plain form
3842.1 731581192 738909531 735271606 732446365 736154022 737702332 737202225 737873306 736693039 738771896
3850.7 738771896 742878113 732758484 728981552 717194138 724092560 734792023 734264755 733965225
3858.4 733965225 736376495 737935638 739119110 733898468 734356842 740077362 733987808 729474487
3866.2 729474487 734690399 740364075 745214691 734908295 726088562 731621017 737763519 739478226
3873.9 739478226 730162277 732063675 736500320 737560730 740261917 743083649 735198822 728668442
3881.6 728668442 734831161 736265793 738167114 741450806 728941116 731802597 736179276 737352142
3889.3 737352142 741114731 737637482 728709641 731668015 735976791 735221634 736284943 737280884 739071503
3898 739071503 739386749 730794983 735995941 736998520 732252274 736548462 732773209 731563263 733461075
3906.7G33461075J516266J467132j61514L50418n61829o0348o485J66321J494751N41916
3916.3G38207703l619233j659088L839264j632690k764435L727646J333618m88815
3924G36943970k382126j811524J931153J123810N91659j479950k5329K539749k760086
3932.7G34671326j508026J568985J5335J56555J54037j80969L29895N96085J346054
3941.4G37149277J72577l553162J83029J879807K02179K85949j249923R15069k58331
3950.1G35726471k216492J471939M81415J59149R0103k69088j01624j017990M80957
3958.7G34804840L41721P09610N0888j364212O29959L24859m08477j93482q8272n92041
3968.4G34215393p99484J060028J368637j64108n66330l30506j97372M03824j20163
$$ plain form
3906.7 733461075 734977341 736444473 736282959 736633377 736071548 736011200 736004715 736171036 737665787 738207703
3916.3 738207703 734588470 732929382 736768646 735135956 732371521 736099167 737432785 736943970
3924 736943970 734561844 732750320 734681473 735805283 736396942 734916992 734891663 737431412 734671326
3932.7 734671326 733163300 734732285 734747620 734904175 735058212 734877243 735207138 735803223 737149277
3941.4 737149277 737321854 733768692 733951721 735831528 736033707 736319656 735069733 735984802 735726471
3950.1 735726471 733509979 734981918 735463333 735622482 735712585 735443497 735341873 734323883 734804840
3958.7 734804840 735146561 735856171 735907059 734542847 735172806 735497665 735089188 734895706 734807434 734215393
3968.4 734215393 733415909 734475937 735844574 735680466 735114136 734783630 734586258 734990082 734869919
3977.1G34869919l42026q2245K46735K76184n90363O87485Q45108l10440n36880o89621
3986.7G34373856j08414K50244J051941K56576q81042l31497J297L98178l48587J6250
3996.3G34678802J134644J73264p66602j71204
4000.2G35048904
$$ plain form
3977.1 734869919 734527893 734445648 734692383 734968567 734378204 735065689 735910797 735600357 735063477 734373856
3986.7 734373856 734265442 734515686 735567627 735824203 734943161 734611664 734612961 735011139 734662552 734678802
3996.3 734678802 735813446 735986710 735220108 735048904
4000.2 735048904
##END=$$ End of the data block
