##TITLE=$$ Begin of the data block
##JCAMP-DX=5.00 $$ ACD/SpecManager v 10.08
##SPECTROMETER/DATA SYSTEM=Varian
##DATE=15 Jan 2013 10:29:40
##DATA TYPE=INFRARED SPECTRUM
##DATA CLASS=XYDATA
##ORIGIN=
##OWNER=
##NPOINTS=3735
##FIRSTX=399.26403809
##LASTX=4000.35498047
##MAXX=4000.35498047
##MINX=399.26403809
##MAXY=72.26776123
##MINY=23.78540230
##XFACTOR=1.0000000000
##YFACTOR=0.000000100000000
##FIRSTY=43.13135910
##DELTAX=0.96440572
##XUNITS=1/CM
##YUNITS=TRANSMITTANCE
##XYDATA=(X++(Y..Y))
399.3D31313591n534286K580566J472168O389007m12483o618957j493759O08940O44645
$$ 431313591 425779305 428359871 429832039 436221046 435808563 429189606 427695847 428304787 428949432
407.9D28949432j185302k047005L034973N671272J09215k190285j551513n760117l742065
$$ 428949432 427764130 425717125 428752098 434423370 434532585 432342300 430790787 425030670 421288605
416.6D21288605J163292K962112m14162L559952K808876l575821J228409L514328l704948
$$ 421288605 422451897 425414009 424999847 428559799 431368675 427792854 429021263 432535591 428830643
425.3D28830643k697563j8311N1231l752021j884728L553581K625237R83391j930657
$$ 428830643 426133080 426114769 426166000 422413979 420529251 424082832 426708069 427691460 425760803
434D25760803K1973M755707Q14705m852410l938446P6027J368713l109550m394188
$$ 425760803 425782776 430538483 431353188 426500778 422562332 422638359 424007072 420897522 416503334
442.7D16503334N254631M337921j326179J249542j927376k138443L134117M62685l554115
$$ 416503334 421757965 426095886 424769707 426019249 424091873 421953430 425087547 425550232 421996117
451.3D21996117k361603K252464M004593M94728j117210j700096j999360L301545K248153
$$ 421996117 419634514 421886978 425891571 426386299 425269089 423568993 421569633 424871178 427119331
460D27119331m167518m980316J251068N68962k83776n71708l177262L974572N534897
$$ 427119331 422951813 417971497 419222565 419791527 419507751 418936043 415758781 419733353 425268250
468.7D25268250j710015k556457L73916J135788p301826m759255N99480K180557J02234
$$ 425268250 423558235 421001778 421375694 422511482 415209656 410450401 411049881 413230438 413332672
477.4D13332672j228714O9809k215271j415863P97997K379989K136841k998390k411728
$$ 413332672 412103958 412173767 409958496 408542633 409340630 411720619 413857460 410859070 408447342
486.1D08447342j283188j265335j560059j311340K700920M093094k398605j631890
$$ 408447342 407164154 405898819 404338760 403027420 405728340 409821434 407422829 405790939
493.8D05790939K914429j354904j017380J734467J08490J396446J241226j010780k574158
$$ 405790939 408705368 407350464 406333084 408067551 408176041 409572487 410813713 409802933 407228775
502.5D07228775j284103j50490q80966k458840r33304K516060O88515k63557M54673
$$ 407228775 405944672 405794182 404913216 402454376 401521072 404037132 404725647 404462090 404916763
511.1D04916763M06685k481079k996826K119713J040535k022782l42331J03226p08465
$$ 404916763 405323448 402842369 399845543 401965256 403005791 400983009 400640678 400743904 400035439
519.8D00035439r34258j265449j640854L36265K792168R91020k907181m81987Q48847
$$ 400035439 399101181 397835732 396194878 396531143 399323311 400314331 397407150 396925163 397774010
528.5C97774010k67182j994476k921181P51343M80843m53072J766472J342087k71721
$$ 397774010 397506828 395512352 392591171 393342514 393823357 393370285 395136757 396478844 396207123
537.2C96207123j274147J46179M8180j033364j334457k677193J79024K263145j045646
$$ 396207123 394932976 395079155 395127335 394093971 392759514 390082321 390261345 392524490 391478844
545.9C91478844k104683L78570O67878R3345k32086j650963j338005M46243m39834
$$ 391478844 389374161 389752731 390420609 390513954 390281868 388630905 387292900 387739143 387299309
554.5C87299309k453461M02336J857491p32956k12898R16786L49502M76647N47943
$$ 387299309 384845848 385248184 387105675 386372719 386159821 387076607 387426109 387902756 388450699
563.2C88450699n56412r10492j272316j202926O07147L04756J65596O4163l30353N72892
$$ 388450699 387894287 386983795 385711479 384508553 385115700 385420456 385586052 385650215 385319862 385892754
572.9C85892754k14959j934013j239052J332436L70483q38661n65796j367264m83932
$$ 385892754 385677795 383743782 382504730 383837166 384207649 383368988 382803192 381435928 380951996
581.5C80951996J832542K055702j55258j92108m92287j012001R59244M95644L39050
$$ 380951996 382784538 384840240 384684982 384492874 384000587 382988586 383947830 384443474 384782524
590.2C84782524M98581J80130J241875R64088Q28171m34914q04290R66262k03285o59065
$$ 384782524 385281105 385461235 386703110 387667198 388495369 388060455 387256165 388222427 388019142 387360077
599.9C87360077j24931j361275N5809J352501j96533j143914n52787R64164N98336
$$ 387360077 387235146 385873871 385929680 387282181 387085648 385941734 385388947 386353111 386951447
608.5C86951447j170121j009063j86196n59692j277809j111145k67907J055069J335297
$$ 386951447 385781326 384772263 384586067 384026375 382748566 381637421 381369514 382424583 383759880
617.2C83759880O13709J143455J171608q05969l59650J846848J27067j228447p7362
$$ 383759880 384373589 385517044 386688652 385882683 385523033 387369881 387496948 386268501 386191139
625.9C86191139R95140K041321J349983Q37250J670342J774635R93652J090584J769257
$$ 386191139 387186279 389227600 390577583 391414833 393085175 394859810 395853462 396944046 398713303
634.6C98713303J393127k31094o22788J607857K171936J442490J384887J510201J875534
$$ 398713303 400106430 399875336 399252548 400860405 403032341 404474831 405859718 407369919 409245453
643.3D09245453J147079N25895L55758M37012q33244j478196P10030R64279J093445
$$ 409245453 410392532 410918427 411274185 411711197 410877953 409399757 410109787 411074066 412167511
651.9D12167511K075119J567383J155090R766p22199M74968J6289j488762r58557M81300
$$ 412167511 414242630 415810013 416965103 416974869 416252670 416727638 416743927 415255165 414296608 414777908
661.6D14777908N20783q4992K15454O03180J387291J100159l281631J763305J914864
$$ 414777908 415298691 415213699 415429153 416032333 417419624 418519783 415238152 417001457 418916321
670.3D18916321K31590o1531N37605M22707P58934J483650Q25768J827812K068634
$$ 418916321 419147911 419086380 419623985 420046692 420805626 422289276 423115044 424942856 427011490
678.9D27011490O07910P49245J010513P67555N93682Q73260K39716O11648J666336
$$ 427011490 427619400 428368645 429379158 430146713 430740395 431613655 431853371 432465019 434131355
687.6D34131355J376648J309319J072998J703224J364365m79889k142563j606522Q91724
$$ 434131355 435508003 436817322 437890320 439593544 440957909 440478020 438335457 436728935 437620659
696.3D37620659J248245J072617R76371J232148J735572J203995J045037O72226L54118
$$ 437620659 438868904 439941521 440917892 442150040 443885612 445089607 446134644 446806870 447160988
705D47160988m24576J85623J274681j84784j31721J591186K271653J705818O15654
$$ 447160988 446736412 446922035 448196716 448011932 447880211 449471397 451743050 453448868 454064522
713.7D54064522N65758Q86497n0926n89905K56844M65545l2882Q8653P05032J684342
$$ 454064522 454630280 455516777 455465851 454875946 455132790 455598335 455565453 455654106 456359138 458043480
723.3D58043480K075081J084175J595726K243538P69501o9161n22461l06167O3400
$$ 458043480 460118561 461202736 462798462 465042000 465811501 465742340 465219879 464913712 464977112
732D64977112O62002J222229J522599K215423R75914Q51784J047516N90629Q19931
$$ 464977112 465639114 466861343 468383942 470599365 471575279 472427063 473474579 474065208 474885139
740.7D74885139m28009q23173k64359L79715N20020J231537J114387o64062J90773
$$ 474885139 474457130 473633957 473369598 473749313 474269333 475500870 476615257 475951195 476141968
749.3D76141968J029854Q88786J225395J559601O86531k40097K62604M1542R68017
$$ 476141968 477171822 478060608 479286003 480845604 481532135 481292038 481554642 481596184 482564201
758D82564201K239800K550468J771584O62613N00946k25144J85547P32422k97737q53729
$$ 482564201 484804001 487354469 489126053 489788666 490289612 490064468 490250015 490982437 490684700 489830971
767.7D89830971R53140J105461k45552K20337K03094J030388Q33741K35328j21193
$$ 489830971 490784111 491889572 491644020 491864357 492067451 493097839 493931580 494166908 494045715
776.4D94045715j037063l82729k04887O57921L60679m58984M37889J445923K011986
$$ 494045715 493008652 492625923 492421036 493078957 493439636 492980652 493418541 494864464 496876450
785D96876450J225204N69191n42984m41360r9335l41416l94554o35681K88925P3014
$$ 496876450 498101654 498670845 498127861 497686501 497587166 497245750 496851196 496215515 496504440 496577454
794.7D96577454O03981M64401k57111k24228j240959j196136j838417j874352j637382
$$ 496577454 497181435 497645836 497388725 497164497 495923538 494727402 492888985 491014633 489377251
803.4D89377251o96450l38630j953965r59548m65279k58103q80584k877121k722550
$$ 489377251 488680801 488342171 486388206 485428658 484963379 484705276 483824692 480947571 478225021
812D78225021k198410j592025j627579j788521j235085l94096P37686M86794M71306
$$ 478225021 476026611 474434586 472807007 471018486 469783401 469389305 470126991 470613785 471085091
820.7D71085091J795539J726876j73302n53436l929P96013K258377K618446L119736
$$ 471085091 472880630 474607506 474434204 473880768 473876839 474672852 476931229 479549675 482669411
829.4D82669411L438072L084946K789192K148895J367950K078591K598610J640625
$$ 482669411 486107483 489192429 491981621 494130516 495498466 497577057 500175667 501816292
837.1E01816292J409035R23500J689758K256699K660140K599373J200219K786903K990265
$$ 501816292 503225327 504148827 505838585 508095284 510755424 513354797 514555016 517341919 520332184
845.8E20332184J578178L01209p27692l61290L68042J589050J843949K805176K722930
$$ 520332184 521910362 522211571 521483879 521122589 521490631 523079681 524923630 527728806 530451736
854.5E30451736K295380K712746J787681K291260K224159K74163p37419K52647M59366
$$ 530451736 532747116 535459862 537247543 539538803 541762962 542037125 541299706 541552353 542011719
863.1E42011719J46446O43921J671867J861801K13242j64757j158447k400932l145409
$$ 542011719 542158165 542802086 544473953 546335754 546548996 546384239 545225792 542824860 539679451
871.8E39679451k926865k330017j604118N0163r73358K54135O70738o17637J108017
$$ 539679451 536752586 534422569 532818451 532868614 531895256 532149391 532820129 532202492 533310509
880.5E33310509J81274r20448j635285k018966j224900j330680j287918o21415J54763
$$ 533310509 533491783 532571335 530936050 528917084 527692184 526361504 525073586 524452171 524606934
889.2E24606934M2152J67046L65028M50096k13051p61261p08160j314392j011238n29404
$$ 524606934 524649086 524816132 525181160 525631256 525418205 524656944 523948784 522634392 521623154 521093750
898.8E21093750K07634J58501L87344J032028Q61130R30443J030082K157288J060715
$$ 521093750 521301384 521459885 521847229 522879257 523740387 524670830 525700912 527858200 528918915
907.5E28918915L2463L54576M9057L34549m845R4681o55212m7341n12962j859703j455460
$$ 528918915 528951378 529305954 529355011 529689560 529684715 529779396 529124184 529076843 528563881 526704178 525248718
918.1E25248718l089981l550567l677407k240715j684227k845878j942673k143440
$$ 525248718 522158737 518608170 514930763 512690048 511005821 508159943 506217270 504073830
925.8E04073830j942139k093773k615433k958831k792664k475586k803574k174568
$$ 504073830 502131691 500037918 497422485 494463654 491670990 489195404 486391830 484217262
933.6D84217262j703529o25763q71582m69055M67033j30997M10462p14760j470642
$$ 484217262 482513733 481887970 481016388 480547333 481014366 480883369 481293831 480579071 479108429
942.2D79108429j767082k251702k031517j412201L49846K46735L59421L81965j56822
$$ 479108429 477341347 475089645 473058128 471645927 471995773 472242508 472601929 472983894 472827072
950.9D72827072l2501p91206j134263j983757k811393l060723k395095j723099j637421
$$ 472827072 472794571 472003365 470869102 468885345 466073952 463013229 460618134 458895035 457257614
959.6D57257614j084137j942406k194786j000175j429825k526779k611160k517472
$$ 457257614 456173477 454231071 452036285 451036110 449606285 447079506 444468346 441950874
967.3D41950874k278595j987686j741714j118393j135140j695022k212372k155457
$$ 441950874 439672279 437684593 435942879 434824486 433689346 431994324 429781952 427626495
975D27626495j955948k719917l523140l686371l733902m009857l424835k963028m079170
$$ 427626495 425670547 422950630 419427490 415741119 412007217 407997360 404572525 401609497 397530327
983.7C97530327m919777m405518m153175l885345l765717m558907m415092m148331
$$ 397530327 392610550 388205032 384051857 380166512 376400795 371841888 367426796 363278465
991.4C63278465m148102l759040l609124l941612l336563k782135l114357k785759
$$ 363278465 359130363 355371323 351762199 347820587 344484024 341701889 338587532 335801773
999.1C35801773l344040k880134k178727k127571j812896k209816j903172j420269
$$ 335801773 332457733 329577599 327398872 325271301 323458405 321248589 319345417 317925148
1006.8C17925148n28641p50293j273537j902599k104474q91819j722660k179470k020492
$$ 317925148 317396507 316646214 315372677 313470078 311365604 310473785 308751125 306571655 304551163
1015.5C04551163j796437k335319l122826k274418j956367j902676k165489j199703
$$ 304551163 302754726 300419407 297296581 295022163 293065796 291163120 288997631 287797928
1023.2B87797928j288376j996212k204285j796894q55560k266426j413250j331596
$$ 287797928 286509552 284513340 282309055 280512161 279656601 277390175 275976925 274645329
1031B74645329j159363n54753r85355L87993l08514L11241L88604N91850Q24280K16045
$$ 274645329 273485966 272931213 271945858 272333851 272025337 272336578 272725182 273317032 274141312 274357357
1040.6B74357357J345959J047077J180954J42937Q4495q640m60701j85700r59529k63939
$$ 274357357 275703316 276750393 277931347 278074284 278158779 278150139 277689438 277503738 276544209 276280270
1050.2B76280270j273365r16253p18002q27484m35429q06484K8629j196594K27204
$$ 276280270 275006905 274090652 273372650 272545166 272109737 271303253 271331882 270135288 270362492
1058.9B70362492J145839R67694R99660J113510K147560P90520J849651J684380J319542
$$ 270362492 271508331 272476025 273475685 274589195 276736755 277527275 279376926 281061306 282380848
1067.6B82380848J475372J220932J495800K52667P85598M16031P75071M98619p6828
$$ 282380848 283856220 285077152 286572952 286825619 287611217 288027248 288802319 289300938 289224110
1076.3B89224110M14600O40030J422310K26536Q57944P53555J522847K086410R29794
$$ 289224110 289638710 290278740 291701050 291927586 292785530 293539085 295061932 297148342 298078136
1085B98078136J436558J212292K520332R05171L90224J616345J254940K082557J505432
$$ 298078136 299514694 300726986 303247318 304152489 304542713 306159058 307413998 309496555 311001987
1093.6C11001987J800099J601601J836414J359043J171799K308349Q51937O72226Q58879
$$ 311001987 312802086 314403687 316240101 317599144 318770943 321079292 321931229 322603455 323462334
1102.3C23462334R81331J562843J785126J251335J497612J870994K63481K44294M79164
$$ 323462334 324443665 326006508 327791634 329042969 330540581 332411575 332675056 332919350 333398514
1111C33398514J052131O15387J24054J340866J313897J279945M10118L76625M30908
$$ 333398514 334450645 335066032 335190086 336530952 337844849 339124794 339534912 339911537 340342445
1119.7C40342445K58217K89192p0190J52969n25741M4441K61841N32875P61146J068192
$$ 340342445 340600662 340889854 340819664 340972633 340446892 340491333 340753174 341286049 342047195 343115387
1129.3C43115387K423592J684074J820831J600800J565018J522636J021194J581955
$$ 343115387 345538979 347223053 349043884 350644684 352209702 353732338 354753532 356335487
1137C56335487J582756K277832J343537J260872K054519J367150J368675J031074O41289
$$ 356335487 357918243 360196075 361539612 362800484 364855003 366222153 367590828 368621902 369263191
1145.7C69263191K70729N42527J80397n50423j61553o3629J99700M0092J01052K64472
$$ 369263191 369533920 370076447 370256844 369706421 369544868 369481239 369680939 369721031 369822083 370086555
1155.4C70086555k0790j31340l73916j325798j714936p00988m92058k01874k38266
$$ 370086555 370065765 369934425 369560509 368234711 366519775 365818787 365326729 365124855 364886589
1164C64886589L28636J862335K341309K561340J408501J477318K684135K588005J568070
$$ 364886589 365215225 367077560 369418869 371980209 373388710 374866028 377550163 380138168 381706238
1172.7C81706238J261482J999168K393494L412018L806419L326912K879372K875328
$$ 381706238 382967720 384966888 387360382 390772400 394578819 397905731 400785103 403660431
1180.4D03660431K789535K371788J574402M96025M76342O57577J040497J654739J772004
$$ 403660431 406449966 408821754 410396156 410892181 411368523 412026100 413066597 414721336 416493340
1189.1D16493340J163826J076927J113662J65139l12958j207237j304894j310043j899758
$$ 416493340 417657166 418734093 419847755 420012894 419699936 418492699 417187805 415877762 413978004
1197.8D13978004q52890k87513k41089k57149n32379m39110r82513j442986j408462
$$ 413978004 413125114 412837601 412596512 412339363 411806984 411367874 410385361 408942375 407533913
1206.5D07533913j048127j190643j583328r89189m52538p1907K70348M51240r2735
$$ 407533913 406485786 405295143 403711815 402722626 402270088 402198181 402468529 402919769 402827034
1215.1D02827034m95033j59455m51927j186104j573524j098175p05795n77546m01802
$$ 402827034 402332001 402172546 401720619 400534515 398960991 397862816 397157021 396579475 396177673
1223.8C96177673k93960K60658L71285k06185j061935j114731j023903j115265j187630
$$ 396177673 395883713 396144371 396515656 396309471 395247536 394132805 393108902 391993637 390806007
1232.5C90806007j700515p49703J19934K17057N74493O00967N52636J78642o25801
$$ 390806007 389105492 388355789 388475723 388692780 389267273 389868240 390420876 390599518 389973717
1241.2C89973717j190186p62062j083488j262856m88396k91290n2643L2959R23920
$$ 389973717 388783531 388021469 386937981 385675125 385186729 384895439 384842796 384875755 385799675
1249.9C85799675Q34274k23694n14068p30286p57751r46541l27187m5166O0349K36053
$$ 385799675 386633949 386410255 385896187 385165901 384408150 383461609 383134422 383089256 383149605 383385658
1259.5C83385658N48249J547737J127205R40933P31392N33333K63252m78935j65787
$$ 383385658 383933907 385481644 386608849 387549782 388281174 388814507 389077759 388598824 388433037
1268.2C88433037N65452J463356J667290J804962J767121J887664K088128J199150
$$ 388433037 388998489 390461845 392129135 393934097 395701218 397588882 399677010 400876160
1275.9D00876160P69615Q60596N56755K5253N76858J469880J834220K252427K370681
$$ 400876160 401645775 402506371 403063126 403088379 403665237 405135117 406969337 409221764 411592445
1284.6D11592445K427864K123948J561126R78051Q80889N85518J40381J87950O19660
$$ 411592445 414020309 416144257 417705383 418683434 419564323 420149841 420290222 420478172 421097832
1293.3D21097832J012420J385422K155914J701966J023597R78585N78956O4431n23835
$$ 421097832 422110252 423495674 425651588 427353554 428377151 429355736 429934692 429999123 429475288
1301.9D29475288p68890m28810P2288m6463J28403O52924P66143N43595L73993J53885
$$ 429475288 428706398 428277588 428349876 428303413 428431816 429084740 429850883 430394478 430768471 430922356
1311.6D30922356r16901j331749j304016j035996m20112J91955P80945J072541K093811
$$ 430922356 430005455 428673706 427369690 426333694 425913582 426105537 426886482 427959023 430052834
1320.3D30052834K007827J288491Q07075J88942J02081o00586o99615l87383j57547
$$ 430052834 432060661 433349152 434156227 434345169 434447250 433846664 433147049 432759666 432602119
1328.9D32602119J15204K57569O41861M50096K97813j85280n18760o97365j049156
$$ 432602119 432717323 432974892 433616753 434066849 434364662 434179382 433660622 432963257 431914101
1337.6D31914101j225357r75418M0817O98852J466942J599503J345749J396293R41239
$$ 431914101 430688744 429713326 429754143 430452995 431919937 433519440 434865189 436261482 437202721
1346.3D37202721L26309o28243o54602o35872n94482o16798k37160M32434J49383O36483
$$ 437202721 437529030 436900787 436246185 435610313 435015831 434399033 434161873 434594307 434743690 435380173
1355.9D35380173N32837P8354n61142p58858p30744j503791j324692j609345j08604
$$ 435380173 435913010 435991364 435430222 434671364 433940620 432436829 431112137 429502792 429394188
1364.6D29394188L49274n1499J25656k3842J52474l64113o45599p50161j054916j366348
$$ 429394188 429743462 429691963 429817619 429793777 429946251 429582138 428936539 428186378 427131462 425765114
1374.3D25765114n58891M65393R3612N06020P46384Q17451J32751o30722o32629j646652
$$ 425765114 425206223 425671616 425765228 426271248 427017632 427835083 427967834 427337112 426704483 425057831
1383.9D25057831j730271j448555j134185k307854j104279J80092p60383o69518r99107
$$ 425057831 423327560 421879005 420744820 418436966 417332687 417512779 416752396 416082878 415083771
1392.6D15083771r68628k083092l149071j508255k073822k114830l415260k006798
$$ 415083771 414115143 412032051 408882980 407374725 405300903 403186073 399770813 397764015
1400.3C97764015o02493j393318j206780r91935j842194k273750j094094j238098k272491
$$ 397764015 397161522 395768204 394561424 393569489 391727295 389453545 388359451 387121353 384848862
1409C84848862k218399j718102j251564j256103p59697k82250l63731m61617p48672
$$ 384848862 382630463 380912361 379660797 378404694 377644997 377362747 376999016 376537399 375788727
1417.7C75788727j57700j243896J15318M30565n50308R6397j66359J155968J419144
$$ 375788727 375631027 374387131 374502449 374933014 374382706 374479103 374312744 375468712 376887856
1426.3C76887856P74993J481362J278877Q71773K75917J112366J005821O02951J002884
$$ 376887856 377662849 379144211 380423088 381294861 381570778 382683144 383688965 384291916 385294800
1435C85294800M09508N58815J717834K735443J808510J332169J744537J216354R72634
$$ 385294800 385704308 386263123 387980957 390716400 392524910 393857079 395601616 396817970 397790604
1443.7C97790604k74926L23334O19507L7956J31607J590882J789283P46689J908570
$$ 397790604 397515678 397839012 398458519 398496475 398628082 400218964 402008247 402754936 404663506
1452.4D04663506J340789J058617O21529l35884k49253J120529L307915J335755K801208
$$ 404663506 406004295 407062912 407684441 407348557 407099304 408219833 411527748 412863503 415664711
1461.1D15664711K308235J979027K637558Q40111K286911J623802J718597J471520
$$ 415664711 417972946 419951973 422589531 423429642 425716553 427340355 429058952 430530472
1468.8D30530472J690521K259407P64313K133789K750893M680824M053345L365020
$$ 430530472 432220993 434480400 435244713 437378502 440129395 444810219 448863564 452228584
1476.5D52228584K890816K381020K214279J426391J254845J193123J320801J641311
$$ 452228584 455119400 457500420 459714699 461141090 462395935 463589058 464909859 466551170
1484.2D66551170J565972J838913J716842P99637R74121m80232K12975J094207l86467
$$ 466551170 468117142 469956055 471672897 472472534 473446655 472966423 473179398 474273605 473887138
1492.9D73887138j495857j511726j753960m619675N91546m21105j846962M75960p86934
$$ 473887138 472391281 470879555 469125595 464505920 465097466 464676361 462829399 463305359 462518425
1501.6D62518425j448936j645623q32023j896172q013496l795967K250518K154351
$$ 462518425 461069489 459423866 458591843 456695671 448682175 444886208 447136726 449291077
1509.3D49291077J8539J150627p35397j324577J89094j560860k190246m048119j244850
$$ 449291077 449309616 450460243 449724846 448400269 448589363 447028503 444838257 440790138 439545288
1518D39545288J290283L56751k411614k093200L509979K164574K027626M2877K13661
$$ 439545288 440835571 441192322 438780708 436687508 440197487 442362061 444389687 444432564 444646225
1526.6D44646225O18935j30158L82424j60370k20108n6916P75032N98641J634140J533737
$$ 444646225 445265160 445135002 445517426 445357056 445136948 445080032 445855064 446453705 448087845 449621582
1536.3D49621582K90451M25377k539711p54471J834755J04065j44272J583290J582489
$$ 449621582 449912033 450337410 447797699 447043228 448877983 448982048 448837776 450421066 452003555
1545D52003555O57082K313957J294136R85222J89133j39962J177407j62888K84157
$$ 452003555 452660637 454974594 456268730 457253952 457443085 457303123 458480530 458317642 458601799
1553.6D58601799j844749M96482J977921M78668j037979l676376J903457Q23784P56684
$$ 458601799 456757050 457253532 459231453 459710121 458672142 454995766 456899223 457723007 458479691
1562.3D58479691j287690j730041k503014j963005n15785j521568k10953n579682j682701
$$ 458479691 457192001 455461960 452958946 450995941 450480156 448958588 448747635 443167953 441485252
1571D41485252p22732k490006k237281k734147k152977j0989494j502190k310867l606033
$$ 441485252 440762520 438272514 436035233 433301086 431148109 420158615 418656425 416345558 412739525
1579.7D12739525l205872m244499k648926m354248k907676m470482m187432m596176
$$ 412739525 409533653 405289154 402640228 398285980 395378304 390907822 386720390 382124214
1587.4C82124214n706634l674927n511742k977066m662628l252792l633881m214363
$$ 382124214 376417580 372742653 367230911 364253845 359591217 356338425 352704544 348490181
1595.1C48490181k513924m641952k282372m636230k693596l547478l538551k479324
$$ 348490181 345976257 341334305 339051933 334415703 331722107 328174629 324636078 322156754
1602.8C22156754m229165j039161l006401j027832l008652j738949j104736k851506
$$ 322156754 317927589 316888428 313882027 312854195 309845543 308106594 307001858 304150352
1610.5C04150352n28221k878647l7288k043972o10523j302777n040149K335987n31369
$$ 304150352 303622131 300743484 300706196 298662224 298051701 296748924 291708775 294044762 293513393
1619.2B93513393J471692j300393O90766m71535j934662J079884q85449J389981k170659
$$ 293513393 294985085 293684692 294375458 293903923 291969261 293049145 292163696 293553677 291383018
1627.9B91383018J412201Q19741R66778J616973K8096K072944p27100Q88138j228428
$$ 291383018 292795219 293614960 294581738 296198711 296226807 298299751 297572651 298460789 297232361
1636.6B97232361K132263J627255Q99333K123299J14174K665882N90496J973972J155816
$$ 297232361 299364624 300991879 301891212 304014511 304128685 306794567 307385063 309359035 310514851
1645.3C10514851p59488L652478j429730K364559J78738K387409K164707j685161J39103
$$ 310514851 309755363 313407841 311978111 314342670 314521408 316908817 319073524 317388363 317527466
1653.9C17527466R31568M624042J382142K555465Q80966J205063J719399R06944K141380
$$ 317527466 318459034 323083076 324465218 327020683 327901649 329106712 330826111 331733055 333874435
1662.6C33874435N89219L837890K249375L196144K968864K734261M641037Q42514M085426
$$ 333874435 334463654 338301544 340550919 343747063 346715927 349450188 354091225 354933739 359019165
1671.3C59019165J927147L598480K921677J589699L614349L634109M990693L276138
$$ 359019165 360946312 364544792 367466469 369056168 372670517 376304626 381295319 384571457
1679C84571457M962959L587685L803558M238129Q46290O606789K217789N425529L864174
$$ 384571457 389534416 393122101 396925659 401163788 402010078 408616867 410834656 416260185 420124359
1687.7D20124359M536209N290299M208107N385780M390602M825020M637489M919091
$$ 420124359 424660568 429950867 434158974 439544754 443935356 448760376 453397865 458316956
1695.4D58316956K764053M492111N346222M463844L335343J029358P379417N685806
$$ 458316956 461081009 465573120 470919342 475383186 478718529 479747887 487127304 492813110
1703.1D92813110M665833M217186L486595L333549L040391L151702J803170J534538
$$ 492813110 497478943 501696129 505182724 508516273 511556664 514708366 516511536 518046074
1710.8E18046074K373352K705078K987480J806259K051621M104423K832909k912559
$$ 518046074 520419426 523124504 526111984 527918243 529969864 534074287 536907196 533994637
1718.5E33994637K877044K977448J466713J162567N98259N83687J835594K283020K247467
$$ 533994637 536871681 539849129 541315842 542478409 543076668 543660355 545495949 547778969 550026436
1727.2E50026436K824669K554092M87938N85251K345352J795006k160835l560563M457779
$$ 550026436 552851105 555405197 555893135 556478386 558823738 560618744 558457909 554897346 559355125
1735.9E59355125M323121K806892L399200J592179J284218M760551K551727N61562
$$ 559355125 563678246 566485138 569884338 571476517 572760735 577521286 580073013 580634575
1743.6E80634575J775970K848549K347489K354278L448029K232513M729881M181290
$$ 580634575 582410545 585259094 587606583 589960861 593408890 595641403 600371284 604552574
1751.3F04552574L449059N120887L326798K875900K142220n95207J629982L020362
$$ 604552574 608001633 613122520 616449318 619325218 621467438 620872231 622502213 625522575
1759F25522575L056717L749008M96026J428375M900436L006973K150574J842652Q65478
$$ 625522575 628579292 632328300 632824326 634252701 639153137 642160110 644310684 646153336 647018814
1767.7F47018814k034073R87015K798920l04108j306992P24945N284806L721161J071624
$$ 647018814 644984741 645971756 648770676 648466568 647159576 647884521 653169327 656890488 657962112
1776.4F57962112K550202O43082P64770j55029j379624M60739J187363J556931O84356
$$ 657962112 660512314 661155396 661920166 661765137 660385513 660846252 662033615 663590546 664274902
1785.1F64274902J797867K332764K094650J486893J419601j35498j175308k490463
$$ 664274902 666072769 668405533 670500183 671987076 673406677 673271179 672095871 669605408
1792.8F69605408n00565L385391Q31223L25241K330704K806396K063523J15356K011261
$$ 669605408 669104843 672490234 673321457 673646698 675977402 678783798 680847321 680962677 682973938
1801.5F82973938n8289K6703N78842n07812K7237j87225Q96682J695328K428436Q76236
$$ 682973938 682915649 682942352 683521194 683013382 683040619 682853394 683750076 685445404 687873840 688750076
1811.1F88750076J387940J785049M00162N55649r27277m83322r71909K42157J058503
$$ 688750076 690138016 691923065 692323227 692878876 691951599 691468277 690496368 690738525 691797028
1819.8F91797028N89523K096023J100541K013168J477051j313706Q393O86721L16315
$$ 691797028 692386551 694482574 695583115 697596283 699073334 697759628 697768021 698454742 698771057
1828.5F98771057j917267l275451J356582K947922J438751J727753J881027R38950
$$ 698771057 696853790 693578339 694934921 697882843 699321594 701049347 702930374 703869324
1836.2G03869324Q72040k27814J95694j134415q20923p56683M21600Q01392l341980
$$ 703869324 704741364 704513550 704709244 703574829 702753906 701997223 702418823 703220215 699878235
1844.9F99878235L623352L419800J326294M44412M2877K55966j163635m87976r72290
$$ 699878235 703501587 706921387 708247681 708692093 708734970 708990936 707827301 707339325 706367035
1853.6G06367035k53067K47726N19104J853562J243286J560821R06372O43006m30985
$$ 706367035 706113968 706361694 706880798 708734360 709977646 711538467 712444839 713087845 712656860
1862.2G12656860r22088o97785j012954m26789r02862J027145O21338Q30688K388535
$$ 712656860 711734772 711036987 710024033 709597244 708694382 709721527 710342865 711173553 713562088
1870.9G13562088J623764P89032n96924m11758r09882q18481j018296o86111O90308
$$ 713562088 715185852 715974884 715377960 714966202 714056320 713237839 712219543 711533432 712223740
1879.6G12223740Q78219J687927J173249J398544N59845k41165k46048j036835l29056
$$ 712223740 713101959 714789886 715963135 717361679 717921524 717680359 717434311 716397476 716068420
1888.3G16068420j847076j823196Q04596J484985J143646J508255J468125p2327O92825
$$ 716068420 714221344 712398148 713202744 714687729 715831375 717339630 718807755 718735428 719428253
1896.9G19428253l76587n95245p53937j176681o22712o31866R62143Q90884J424561
$$ 719428253 719051666 718456421 717702484 716525803 715903091 715271225 716233368 717124252 718548813
1905.6G18548813J505585R82208M84238q65326q48237j073760n10941j067505k00043
$$ 718548813 720054398 721036606 721520844 720655518 719807281 718733521 718222580 717155075 716955032
1914.3G16955032J91651M99878K244033N0202O93664J528931N06897n70831k532883
$$ 716955032 717146683 717646561 719890594 719940796 720634460 722163391 722670288 722099457 719566574
1923G19566574j489563k87704j5946k22473O25229J077042J230316J197891M16183
$$ 719566574 718077011 717789307 717773361 717550888 718176117 719253159 720483475 721681366 722097549
1931.7G22097549N80063l24096n67017j536865j539078o25076q6136P14416K58637
$$ 722097549 722677612 722353516 721786499 720249634 718710556 718085480 717999344 718713760 718972397
1940.3G18972397J551819Q08410P3471R44748q8958p97043j441651q68911j206284
$$ 718972397 720524216 721332626 721406097 722350845 722261887 721464844 720023193 719154282 717947998
1949G17947998r00269o86O23474J485901J193237J364746L60947P782o20575j321793
$$ 717947998 717047729 717047043 717670517 719156418 720349655 721714401 722075348 722083130 721462555 720140762
1958.7G20140762j167144j288300n40009m10919M70124J001968J438293J157456J63421
$$ 720140762 718973618 717685318 717145309 716734390 717204514 718206482 719644775 720802231 720965652
1967.3G20965652Q6594n32455n79758j323471j029739q97599n73807Q83103Q68988
$$ 720965652 721052246 720519791 719940033 718616562 717586823 716689224 716115417 716998520 717867508
1976G17867508J218796R94873R44443J35650m30450o57578j421966r58634j239548
$$ 717867508 719086304 720081177 721025620 721161270 720730820 720073242 718651276 717692642 716453094
1984.7G16453094o52694k59094N49469J247329Q78601J438752L82003n89828m77982
$$ 716453094 715800400 715541306 716090775 717338104 718216705 719655457 720037460 719447632 718969650
1993.4G18969650j87378r96933j536789r92202o62155M77828R66263J777420J263199
$$ 718969650 718782272 717785339 716248550 715256348 714594193 715072021 716038284 717815704 719078903
2002.1G19078903L77884J37329p39746j185760j766129r17816r67865m94995L53470
$$ 719078903 719456787 719594116 718854370 717668610 715902481 714984665 714016800 713521805 713875275
2010.7G13875275N44204J595993J064225P76443J5030n82275j279374j482162r79919
$$ 713875275 714419479 716015472 717079697 717856140 717871170 717288895 716009521 714527359 713547440
2019.4G13547440j188736k42768k30331O06003J164703R54590J233597N73501j5030
$$ 713547440 712358704 712115936 711885605 712491608 713656311 714610901 715844498 716417999 716402969
2028.1G16402969j351089j102142j110154j492462j245422n80597J028519J063156
$$ 716402969 715051880 713949738 712839584 711347122 710101700 709521103 710549622 711612778
2035.8G11612778J166305P19528O53458K67868p39670j094589j641769j098633j259155
$$ 711612778 712779083 713498611 714152069 714419937 713680267 712585678 710943909 709845276 708586121
2044.5G08586121k87247L39126R35517J462936N94177J119233m4175n66558r76715
$$ 708586121 708298874 708638000 709573517 711036453 711630630 712749863 712705688 712139130 711162415
2053.2G11162415j422120p11135q63724k25220m8141N23376N56641J234665J255874
$$ 711162415 709740295 709029160 708165436 707940216 707892075 708415451 708972092 710206757 711462631
2061.9G11462631j05896l8528r06296j039734j341553q78677m65851o21185O42090
$$ 711462631 711356735 711318207 710411911 709372177 708030624 707151947 706686096 706064911 706707001
2070.5G06707001R41925J552658J063461M51203j70517q22983q99201j400680o50635
$$ 706707001 707648926 709201584 710265045 710716248 710545731 709722748 708823547 707422867 706772232
2079.2G06772232o72455l43170J11237P16781J043930P22733J229172J35727o06690
$$ 706772232 706099777 705756607 705867844 706584625 707628555 708351288 709580460 709716187 709109497
2087.9G09109497j076507j073685j185990j168289m36325l23944J131897R66492R03091
$$ 709109497 708032990 706959305 705773315 704605026 704168701 703844757 704976654 705943146 706846237
2096.6G06846237R78317Q9951k44141j310424j142273j197205p44095l88794j13907
$$ 706846237 707824554 707914505 707670364 706359940 705217667 704020462 703276367 702887573 702773666
2105.2G02773666M34113M41894J423493Q32062K49862l44314p22046q43048j310578
$$ 702773666 703207779 703649673 705073166 705905228 706155090 705810776 705088730 704245682 702935104
2113.9G02935104r05914r93347M425M33350J112594J249085K67715O13480k0066l40652
$$ 702935104 702029190 701035843 701040268 701473618 702586212 703835297 704103012 704716492 704696426 704355774
2123.6G04355774q49075j060181r03473o93207k75955k58560P30133P53403R56955
$$ 704355774 703506699 702446518 701543045 700849838 700573883 700315323 701045456 701798859 702755814
2132.3G02755814J020889M83932j63879r09119r19876j184234m05579k52304R6817
$$ 702755814 703776703 704260635 704096756 703187637 702267761 701083527 700677948 700425644 700522461
2140.9G00522461M60358M46853J074295P00302Q42591j26114q54263p68433q71048
$$ 700522461 700982819 701429672 702503967 703204269 704046860 703920746 703066483 702298050 701427002
2149.6G01427002o89011o36444L58811M69360P15637P20444O50787O60019N2185j60522
$$ 701427002 700737991 700101547 700460358 700929718 701645355 702365799 703016586 703676605 703728790 703568268
2159.3G03568268j013184o44760n83267l10288R2926K594P68586O26144Q63419K63595
$$ 703568268 702555084 701910324 701327057 701016769 701109695 701112289 701880875 702507019 703370438 703634033
2168.9G03634033J34201J43280l91617l41339j156540o99768n37033%R16977J058045
$$ 703634033 703768234 703911514 703519897 703178558 702022018 701322250 700785217 700785217 701702194 702760239
2178.5G02760239R44748M11682M44336l89634m14733n66254p05566l07084k99377L31650
$$ 702760239 703704987 704116669 704561005 704171371 703756638 703190384 702484818 702177734 701878357 702210007
2188.2G02210007J12991M95148N57480N46875M95376k5787O0577m44031l62701o82449
$$ 702210007 702322998 702818146 703375626 703922501 704417877 704392090 704452667 704008636 703645935 702963486
2197.8G02963486m36859k24686j45187O43768P05261J003189L13950O790j85394j09177
$$ 702963486 702526627 702301941 702156754 702800522 703505783 704508972 704822922 704829712 704644318 704535141
2207.5G04535141j36490q40301m0436M1199L69186K71072Q393L82309L01590N71212
$$ 704535141 704398651 703558350 703517914 703559113 703928299 704199371 704207764 704590073 704891663 705462875
2217.1G05462875J67923K4186o01426q26416m50592j40609K64205R8191K13089l5019
$$ 705462875 705630798 705654984 705053558 704227142 703776550 703635941 703900146 703998337 704211426 704176407
2226.8G04176407O15692M36935L4104L13339l86810m20990m25263Q8959j23444j78756
$$ 704176407 704792099 705229034 705263138 705576477 705189667 704768677 704343414 704432373 704308929 704130173
2236.4G04130173J54800m8675K78625K28500O57502K69699R6741m76685q68378J41449
$$ 704130173 704284973 704236298 704514923 704743423 705400925 705670624 705767365 705290680 704422302 704563751
2246G04563751o5307j40534k79312L62091P3471j78299N68085K31399N81971j84632
$$ 704563751 704498444 704357910 704078598 704440689 704514160 704335861 704903946 705135345 705717316 705532684
2255.7G05532684l58810l80631o87713l47061n0888M89730j96380L45840L45841K92511
$$ 705532684 705173874 704793243 704105530 703758469 703707581 704197311 704000931 704346771 704692612 704985123
2265.3G04985123N07354k52990r2774p49435m71649k15226m4021j44882l90168O28434
$$ 704985123 705492477 705239487 705146713 704397278 703925629 703710403 703666382 703521500 703131332 703759766
2275G03759766N29098K99225K4948M73328L5476o30569n53513r70459k59552k03170
$$ 703759766 704288864 704588089 704613037 705086365 705121841 704491272 703937759 702967300 702707748 702504578
2284.6G02504578N90133K73819k15606N28488J41830N17197j63727m42581m77219l82690
$$ 702504578 703094711 703368530 703152924 703681412 703823242 704340439 704176712 703734131 703256912 702874222
2294.3G02874222k73743p01523L44925J18561L50418M66690K31247M16870k42004m53797
$$ 702874222 702600479 701898956 702243881 702362442 702712860 703179550 703410797 703827667 703585663 703131866
2303.9G03131866p45773n39627m43954M08172k3041n93109N71518J6556K19116L56217
$$ 703131866 702386093 701846466 701402512 701810684 701787643 701194534 701766052 701782608 702001724 702357941
2313.5G02357941L23333j97372n79529r2773r85947q43353l3417O32629k68783q4839
$$ 702357941 702681274 702483902 701904373 701811600 700825653 699982300 699948883 700581512 700312729 700227890
2323.2G00227890P84378Q75778J011429j223755j002273k53449j60293m74091j177673
$$ 700227890 701012268 701888046 702899475 701675720 700673447 700419998 700259705 699785614 698607941
2331.9F98607941l17765n08117N24215Q78067N16053j23368P18232J081619j097031
$$ 698607941 698290176 697782059 698306274 699184341 699700394 699577026 700295258 701376877 700279846
2340.6G00279846q79974n62821j37100n9814n65796j010742Q4991Q44421M46473R29870
$$ 700279846 699399872 698837051 698699951 698640137 698074341 697063599 697148590 697993011 698439484 699369354
2350.2F99369354L18909L14102r38415j083374K11410l06015Q24509j514969j11466
$$ 699369354 699688263 700002365 699063950 697980576 698191986 697885971 698710480 697195511 697084045
2358.9F97084045L10364O35529J723785j589889n21698j379319j324539n39856O90232
$$ 697084045 697394409 698029938 699753723 698163834 697642136 696262817 694938278 694398422 695088654
2367.6F95088654j25275j797485K10876J29318Q02994M92401N37644J61056j309280
$$ 695088654 694963379 693165894 693376770 693506088 694309082 694801483 695339127 695500183 694190903
2376.2F94190903j260758j033630l39890q20694j15966M88967N02320Q29849K24533
$$ 694190903 692930145 691896515 691556625 690735931 690619965 691108932 691611252 692441101 692665634
2384.9F92665634K2888n20095k10953n90287j063995q14819j065598k42233J35574
$$ 692665634 692688522 692168427 691957474 691367187 690303192 689488373 688422775 688180542 688316116
2393.6F88316116O43463M95377K75955L17917j85165l57285r62677o06994p53174p24106
$$ 688316116 688959579 689454956 689730911 690048828 689863663 689506378 688543701 687936707 687183533 686459427
2403.2F86459427l93067l39050K24762J55029P19529N27801J41144l13721j051635
$$ 686459427 686066360 685727310 685952072 686107101 686826630 687354431 687495575 687181854 686130219
2411.9F86130219r22165r68171j107254q98819R2621j99203n5313P45086N30014K28119
$$ 686130219 685208054 684239883 683132629 682233810 682326431 682127228 682071915 682817001 683347015 683575134
2421.6F83575134l78952j49383j054230j179352o43082j076431k57568J12915M22211
$$ 683575134 683196182 683046799 681992569 680813217 680170135 679093704 678836136 678949051 679371262
2430.2F79371262L99856L64609J30310j13449r3842j068420j196671j090393o57119
$$ 679371262 679771118 680135727 680266037 680152588 680058746 678990326 677793655 676703262 676046143
2438.9F76046143o02723m13436L65524L41873N16968L74222K15759n53589q03528j009521
$$ 676046143 675443420 675029984 675395508 675737381 676254349 676628571 676844330 676290741 675487213 674477692
2448.6F74477692j357804p60956j022567m65393K83508R54514O39724l42025j06431
$$ 674477692 673119888 672358932 671336365 670870972 671154480 672108994 672748718 672406693 672300262
2457.2F72300262l15322m69971j097412r77478r65882j405563p39517l9292P65152
$$ 672300262 671984940 671514969 670417557 669440079 668474197 667068634 666329117 666289825 667054977
2465.9F67054977O05698P21970K27890n44052m48304q86383j103668j572952j142731
$$ 667054977 667660675 668382645 668610535 668066483 667618179 666731796 665628128 664055176 662912445
2474.6F62912445m01611J73874J95312n9585N88378K71149N5008n26199j217346j133881
$$ 662912445 662510834 662684708 662880020 662820435 663408813 663679962 663734970 663208771 661991425 660857544
2484.2F60857544j068115j026688p34939o1265k48184J6709n494J62964O85883j08872
$$ 660857544 659789429 658762741 658027802 657966537 657718353 657735062 657729568 657892532 658578415 658469543
2493.9F58469543o08291j428604j529846j139756q30917j50833m7989j43814q0643
$$ 658469543 657861252 656432648 654902802 653763046 652932129 652781296 652733307 652589493 652508850
2502.6F52508850N40009L20587J00555l44925j480789j345978j007461j093064j006469
$$ 652508850 653048859 653369446 653470001 653125076 651644287 650298309 649290848 648197784 647191315
2511.2F47191315k00043J16882K75574N24750N21011L74680p72934r32846r82209j329269
$$ 647191315 646991272 647108154 647383728 647908478 648429489 648804169 648031235 647098389 646116180 644786911
2520.9F44786911j225586q61435j59302j39312O5918L71093O97327J51672k90527l66211
$$ 644786911 643561325 642699890 642540588 642401276 642467194 642838287 643535614 643687286 643396759 643030548
2530.5F43030548j082916j055069j404839j027984o25687m16946L78761O94313Q97751
$$ 643030548 641947632 640892563 639487724 638459740 637834053 637417107 637795868 638490181 639387932
2539.2F39387932m959m55742m19235m89197j289139j879425r60617n14526J60293L5401
$$ 639387932 639382973 638927231 638507996 638018799 636729660 634850235 633889618 633375092 633535385 633570786
2548.9F33570786N73844Q93097l59268k58522k69432n07774j302910j582070j131591
$$ 633570786 634144630 635037727 634678459 634419937 634150505 633642731 632339821 630757751 629626160
2557.5F29626160p03049n8708m8218K13089J54114O62613L56750n01594m66576j014824
$$ 629626160 628923111 628864403 628816185 629029274 629183388 629846001 630202751 629701157 629234581 628219757
2567.2F28219757j176910j307755p22771m17022k88162J51023K01416P37076M16298
$$ 628219757 627042847 625735092 625012321 624595299 624307137 624458160 624659576 625396652 625812950
2575.9F25812950p629o94809j070290j049805j191291q74710o19622j3618l12615l0670
$$ 625812950 625805321 625110512 624040222 622990417 621799126 620924416 620304794 620291176 619978561 619947891
2585.5F19947891K64130J32522L11280m43154k49443n59311r53102j023826j336594
$$ 619947891 620212021 620344543 620655823 620212669 619963226 619403915 618450813 617426987 616090393
2594.2F16090393r78126n54009M53568M95033L3340N3025K20718k56729j113854j111335
$$ 616090393 615112267 614558258 615011826 615506859 615540199 615593224 615813942 615557213 614443359 613332024
2603.8F13332024j265450r79576p78198m78440J69869N74531K06376k71073L81584
$$ 613332024 612066574 611086998 610308800 609830360 610000229 610574760 610781136 610510063 610891647
2612.5F10891647l17077q63190j153717j610069q82912p34138m27437o6262J8273K5902
$$ 610891647 610574570 609711380 608557663 606947594 606064682 605330544 604903107 604836845 604855118 604881020
2622.1F04881020L22685K92930k29721o26716j593323j379776r97162r64775n83343
$$ 604881020 605203705 605496635 605266914 604640198 603046875 601667099 600669937 599705162 599121819
2630.8E99121819j32409J31646j20697L61785K06261m09660n96276n22651j130409
$$ 599121819 598989410 599121056 599000359 599362144 599568405 599158745 598562469 598039818 596909409
2639.5E96909409j616822o00891o20651o14929l06397M21257O50292k69814j66626
$$ 596909409 595292587 594691696 594071045 593456116 593149719 593570976 594221268 593951454 593784828
2648.2E93784828p27463p41653o83708r48220r46502j275521m36706o3515N0392R2850
$$ 593784828 593057365 592315712 591632004 590683784 589737282 588461761 588025055 587961540 588011932 588104782
2657.8E88104782J17188J85051k85798m88739q54530o72989p29522j190262r55811
$$ 588104782 588221970 588407021 588121223 587632484 586777954 586104965 585375443 584185181 583229370
2666.5E83229370j49155K01416M11492O58989j16806k22855m89120o48613o72989j050492
$$ 583229370 583080215 583281631 583693123 584352112 584235306 584012451 583523331 582874718 582201729 581151237
2676.1E81151237o88171q74329l67660R9640K32391J64643l11547L6965o2333m60548
$$ 581151237 580463066 579588737 579221077 579320717 579553108 579717751 579406204 579443169 579380836 578920288
2685.8E78920288j022720p85332n59235r11178o92330k26516M36058J30386K63748
$$ 578920288 577897568 577112236 576553001 575641823 574949493 574722977 575159035 575289421 575553169
2694.5E75553169L25012j34010k65465p11670j026306j246643o24428p02056m73595
$$ 575553169 575878181 575744171 575478706 574767036 573740730 572494087 571869659 571167603 570694008
2703.1E70694008L42941L60680M33998j57242J84898J27984r03244j230584r16366
$$ 570694008 571036949 571397629 571831627 571674385 571859283 571987267 571084023 569853439 568937073
2711.8E68937073o98586j001053m04892j11007K28424J87759K20680P46766l3112l85323
$$ 568937073 568238487 567237434 566832542 566721535 566949959 567137718 567358398 568105164 568072052 567686729
2721.5E67686729r20524j004906q26530p33948j64948l95584j5678M18396N87768L42789
$$ 567686729 566766205 565761299 564934769 564200821 564035873 563640289 563624611 564043007 564630775 564973564
2731.1E64973564j24855l12576o36940p59926j005669o09398l89175l25088k7695K48070
$$ 564973564 564848709 564536133 563899193 563139267 562133598 561524200 561135025 560809937 560782242 561030312
2740.8E61030312M17022L63579N44663j2017l48739p64313j019440r56039q97637o1073
$$ 561030312 561447334 561810913 562355576 562343559 561994820 561230507 560211067 559255028 558357391 558296318
2750.4E58296318q6670k3727K47688P07741N02777m21066m05007q20122o21833o74973
$$ 558296318 558209648 558185921 558433609 559141350 559644127 559223061 558818054 557997932 557376099 556701126
2760E56701126r77783q30917m30069L04374L70140Q05893K37465k93045l59459o38885
$$ 556701126 555723343 554892426 554462357 554766731 555136871 555942764 556180229 555887184 555527725 554888840
2769.7E54888840o07300j144333r38377o57235p4615k861j91574K19002j75324j29280
$$ 554888840 554281540 553137207 552198830 551541595 551466980 551464119 551272545 551491547 551316223 551186943
2779.3E51186943j07765j16005q90236j208038n27191p49817o31791m83779K6054L02658
$$ 551186943 551079178 550963173 550072937 548864899 548337708 547587891 546956100 546472321 546498375 546801033
2789E46801033L98102p248p34825n71137j151313j045647r49516r75152o15959p20405
$$ 546801033 547199135 547191887 546457062 545885925 544734612 543688965 542739449 541764297 541148338 540427933
2798.6E40427933r6245O6185l59116m58412j29394n17884p76710n09491j161308j501008
$$ 540427933 540331688 540397873 540038757 539580345 539450951 538933067 538156357 537646866 536485558 534984550
2808.3E34984550j346511n23377j40571j91307m4365j20850k25296j025086j146621
$$ 534984550 533638039 533114662 532974091 532782784 532738419 532617569 532392273 531367187 530220566
2816.9E30220566j008949r79500j165848j233406m49448n17730l15400j23138n10788
$$ 530220566 529211617 528232117 527066269 525832863 525383415 524865685 524550285 524427147 523916359
2825.6E23916359p20787o77796n58433j134071j494599j484184j260071j083946q98171
$$ 523916359 523195572 522517776 521959343 520825272 519330673 517846489 516586418 515502472 514604301
2834.3E14604301p30819m46663k78778q89855j259994j798592j979103k195892k259331
$$ 514604301 513873482 513426819 513148041 512258186 510998192 509199600 507220497 505024605 502765274
2843E02765274j897888j949997j485176j973343k079125j913185j971588j302337j555405
$$ 502765274 500867386 498917389 497432213 495458870 493379745 491466560 489494972 488192635 486637230
2851.7D86637230j315918j244812j167564o51665l06893J95427p2021N875K48146L82919
$$ 486637230 485321312 484076500 482908936 482257271 481950378 482145805 482073784 482079659 482327805 482710724
2861.3D82710724J45988n8250k04201r96895j343116j734162j671219j084633j30004
$$ 482710724 482856712 482798462 482594261 481597366 480254250 478520088 476848869 475764236 475634232
2870D75634232J21650l76396N3063k24343n23605m98161q78182j114922j152343q76770
$$ 475634232 475755882 475379486 475432549 475208206 474684601 474186440 473308258 472193336 471040993 470164223
2879.6D70164223q53730q65669p71026p49207o45866j36719n7640m63410q33740j350136
$$ 470164223 469310493 468444824 467673798 466924591 466278725 466142006 466084366 465620956 464787216 463437080
2889.3D63437080j338691j435700j273536r35517n15671k79655p02438n74379r42574
$$ 463437080 462098389 460662689 459389153 458453636 457937965 457658310 456955872 456381493 455438919
2897.9D55438919r40437o50673r24149j142158j376419q69484p81937p30209o81076
$$ 455438919 454498482 453847809 452923660 451781502 450405083 449535599 448753662 448023453 447342377
2906.6D47342377o84395l27530q01277j270409j145172r76257j696511k060813j959229
$$ 447342377 446657982 446330452 445529175 444258766 443113594 442137337 440440826 438380013 436420784
2915.3D36420784j880302j634484j828422j155854o93740o80848p69424p73773p88040
$$ 436420784 434540482 432905998 431077576 429921722 429227982 428547134 427777710 427003937 426215897
2924D26215897j069909m18472m88739O676N10521J32599K03170K08855Q46634O96182
$$ 426215897 425145988 424727516 424238777 424245453 424755974 424888573 425091743 425300598 426147232 426843414
2933.6D26843414Q77838J188164O68335K94304j49269N63087Q95043P07931R53865
$$ 426843414 427721252 428909416 429577751 429872055 429722786 430285873 431180916 431888847 432842712
2942.3D32842712J389084J336670P16324O23016M56124N66368K74391K22969N99365
$$ 432842712 434231796 435568466 436284790 436907806 437363930 437930298 438204689 438427658 439027023
2951D39027023L93372J73530p6713K25906M65126J076088R26056J61362N13992O85387
$$ 439027023 439420395 439593925 439517212 439743118 440208244 441284332 442210388 442371750 442885742 443571129
2960.6D43571129M86450j39847L37067Q59375O72874R14727R19075J141967R74121
$$ 443571129 444057579 443917732 444254799 445114174 445787048 446701775 447620850 448762817 449736938
2969.3D49736938J183587J221084L28255k0714M90799N86624m1008M22516O64520O66275
$$ 449736938 450920525 452141609 452469864 452449150 452939949 453526573 453485565 453908081 454572601 455238876
2979D55238876P11556O54487P80831L3874N2224J16157l4027J00288k14729R7084N70374
$$ 455238876 455950432 456604919 457385750 457419624 457471848 457588005 457553978 457654266 457439537 457536621 458106995
2989.6D58106995M91485K02523K33001L21160K66990j43280l12385n31922r08241k77443
$$ 458106995 458598480 458801003 459034004 459355164 459622154 459478874 459166489 458634567 457726326 457448883
2999.2D57448883l29704l59955k38953k36816Q6441m07524m66309k90146k34451o39419
$$ 457448883 457119179 456759224 456520271 456283455 456369896 455962372 455496063 455205917 454971466 454332047
3008.8D54332047q10776m91257o57539p80030r14955l71666m23736j46599L11127l39928
$$ 454332047 453521271 453030014 452372475 451592445 450677490 450305824 449882088 449735489 450046616 449706688
3018.5D49706688q53081j510849q81157o16760o27861n30090j134453o50177n30777
$$ 449706688 448853607 447342758 446461601 445844841 445216980 444686890 443552437 442902260 442371483
3027.2D42371483n68657o27518k06871m38537j151200m36859r49974j005592r29871
$$ 442371483 441802826 441175308 440968437 440529900 439378700 438941841 437991867 436986275 436056404
3035.9D36056404j210785q66966q30574l70445k37618k20795o28585q13523q34465
$$ 436056404 434845619 433978653 433148079 432777634 432540016 432319221 431690636 430877113 430042648
3044.5D30042648j256866j174660j292343j034622n33486k01454n55343o25878l28483
$$ 430042648 428785782 427611122 426318779 425284157 424750671 424549217 423993874 423367996 423039513
3053.2D23039513p99256o90155q37707j308670j470871q37288n33028j068115m24118
$$ 423039513 422240257 421550102 420712395 419403725 417932854 417095566 416562538 415494423 415070305
3061.9D15070305j56403l41263n83572o50406k52991o45332j141968j142234r88503
$$ 415070305 414913902 414572639 413989067 413338661 413085670 412440338 411298370 410156136 409167633
3070.6D09167633j223755q15201j54762j56746m37012o82487j05248j88484p90748
$$ 409167633 407943878 407128677 406973915 406817169 406380157 405697670 405592422 405403938 404613190
3079.2D04613190r28269q80012r18122r95674o39305n13191l79295m73748m08554k57644
$$ 404613190 403684921 402804909 401886787 400891113 400251808 399738617 399359322 398885574 398477020 398219376
3088.9C98219376p41349q67042p54166q87985r19342l62702p94067j211319n73997
$$ 398219376 397478027 396610985 395856819 394968834 394049492 393686790 392892723 391681404 391107407
3097.6C91107407p08504l92571j59835m87099p92580q70628n10903o59179r29871j115837
$$ 391107407 390398903 390006332 389846497 389359398 388566818 387696190 387185287 386526108 385596237 384480400
3107.2C84480400q14552n42793n45998m32854n84335l96080m21715o57844o86875j014862
$$ 384480400 383665848 383123055 382577057 382144203 381559868 381163788 380742073 380084229 379397354 378382492
3116.9C78382492j153908n96008p33566j473580j029777k70729o8093l73115o20346
$$ 378382492 377228584 376632576 375899010 374425430 373395653 373124924 373056831 372683716 372063370
3125.5C72063370o54221o29158q27713j104698j009865j279487p18232o78711q54034
$$ 372063370 371409149 370779991 369952278 368847580 367837715 366558228 365839996 365161285 364307251
3134.2C64307251J01051o23092q20122l76549p50427o80122p33338j286011j711921
$$ 364307251 364408302 363785210 362965088 362588539 361838112 361157990 360424652 359138641 357426720
3142.9C57426720q80814l83186o19812o19545l42331l20320q54988n99671o12793p91702
$$ 357426720 356545906 356162720 355542908 354923363 354581032 354260712 353405724 352806053 352193260 351401558
3152.5C51401558j062431j421433q34007n94711o06423n89447n80559q93326p55424
$$ 351401558 350339127 348917694 348083687 347488976 346882553 346293106 345712547 344819221 344063797
3161.2C44063797j35040p08351j213952j193428j079788p23610n25398j001358q38699
$$ 344063797 343928757 343220406 342006454 340813026 339733238 339009628 338484230 337482872 336644173
3169.9C36644173p2785n59768p29943o53648q86002q47015q30193q31566j017951q44002
$$ 336644173 336571388 336011620 335281677 334628029 333742027 332895012 332064819 331233253 330215302 329371300
3179.5C29371300o22292l49541l72962o61316p76787r87396o52161o19392q20275p48863
$$ 329371300 328749008 328399467 328026505 327365189 326588402 325601006 324948845 324329453 323509178 322760315
3189.2C22760315p61147p01484n92232p61013r33342k49138j51348p93400p69310l64647
$$ 322760315 321999168 321297684 320705452 319944439 319011097 318761959 318610611 317817211 317047901 316683254
3198.8C16683254o11934r28364p94029j337204o98224J08853o72836p70817k94953
$$ 316683254 316071320 315142956 314348927 313011723 312313499 312422352 311749516 310978699 310683746
3207.5C10683746k46982q23746q80337p49302q85601n78575o54735o89907m68083j58729
$$ 310683746 310436764 309613018 308732681 307983379 307097778 306519203 305864468 305174561 304706478 304547749
3217.2C04547749k60373o08883m60510m42657o50597o69460o27690r21440q48274p17773
$$ 304547749 304287376 303678493 303217983 302775326 302124729 301455269 300827579 299906139 299057865 298340092
3226.8B98340092n88322k27509j14994P8469l40786o73847n43404n15251q98571j150303
$$ 298340092 297751770 297524261 297409267 297487736 297146950 296473103 295929699 295414448 294515877 293365574
3236.4B93365574n52960k84252j14879m57478n50022j86901o13403o57559n55019k55165
$$ 293365574 292812614 292528362 292413483 291956005 291405983 291219082 290605679 289948120 289393101 289137936
3246.1B89137936k79217m54216n73387j019230p14340m67778m65011m87652N3482K09293
$$ 289137936 288858719 288404503 287831116 286811886 286097546 285629768 285164757 284677105 284730587 284939880
3255.7B84939880n57041o75411r07917n29308j09558n71843o24675m23890p9116n8060
$$ 284939880 284382839 283707428 282799511 282270203 282160645 281588802 280964127 280540237 280461121 280403061
3265.4B80403061p60727r87549l29838j01528K01302Q2016o99291r47476j017723p4368
$$ 280403061 279642334 278654785 278324947 278223419 278424721 278506737 277807446 276859970 275842247 275767879
3275B75767879J45894n16224o66066n16681R1228l19423p06597o80275m08630J53732
$$ 275767879 275913773 275397549 274731483 274214802 274306030 273986607 273280010 272599735 272191105 272344837
3284.7B72344837j21345j46656j36376l69949o01215n18723p7820P4024j90277l64609
$$ 272344837 272223492 272076836 271940460 271570511 270969296 270450573 270372753 270446777 270256500 269891891
3294.3B69891891k70557q40244p17240j63135l65486k23389K13738J98402k78511k05364
$$ 269891891 269621334 268781090 268063850 267900715 267535229 267311840 267525578 267723980 267445469 267240105
3303.9B67240105n84259p38678j10569m67835q85124n19066L3531k32544p7552N8536
$$ 267240105 266655846 265917168 265806599 265338764 264453640 263934574 263968105 263735561 263658009 263716545
3313.6B63716545o98643n79795k76146l74699q70457k87094K28024m30813n08957n94311
$$ 263716545 263017902 262438107 262161961 261787262 260916805 260629711 260857735 260426922 259917965 259323654
3323.2B59323654k93732n05046m77333k78149o09207k37389p97596n31082j22318m97189
$$ 259323654 259029922 258524876 258047543 257769394 257160187 256922798 256125202 255594120 255471802 254974613
3332.9B54974613k34966m27723k78206n18532q12130n66482l40138j14193n18779n32055
$$ 254974613 254739647 254311924 254033718 253515186 252703056 252136574 251796436 251682243 251163464 250631409
3342.5B50631409k03839l73077r51595m83113K57130k71893k96993j65939p73564q36677
$$ 250631409 250427570 250054493 249102898 248619785 248876915 248605022 248308029 248142090 247368526 246531849
3352.2B46531849J33381J83029o96774p13100m85077j85032J55163J49536l20587n76553
$$ 246531849 246665230 246848259 246151485 245438385 244953308 244768276 244923439 245072975 244752388 244175835
3361.8B44175835n16854m25338J22032j57738m85840Q1597L1585l96099m98810m98600
$$ 244175835 243658981 243233643 243355675 243197937 242712097 242793694 242825279 242429180 241930370 241431770
3371.4B41431770l08418j27773j83811J78890R0675l9463K74181k45189l58868k56100
$$ 241431770 241123352 240995579 240811768 240990658 241081333 241041870 241316051 241070862 240711994 240455894
3381.1B40455894k81600m64840r41601Q2683Q34618J31912j31740L5991J5488j11218
$$ 240455894 240174294 239709454 238767853 238850536 239685154 239817066 239685326 239721317 239736805 239625587
3390.7B39625587k05993l90949l63350p63n8003m22401j53542L60794L02315k21195
$$ 239625587 239419594 239028645 238665295 238664532 238606529 238184128 238030586 238391380 238693695 238472500
3400.4B38472500k94342J96152R479j37463j72786k19517K82269J64680j05801j0109
$$ 238472500 238178158 238374310 238383789 238246326 238073540 237854023 238136292 238300972 238195171 238185062
3410B38185062J40114K27032o313P8888k1248l36590J53026P37877O67267Q7338m68102
$$ 238185062 238325176 238552208 238545895 238624783 238603535 238266945 238419971 239157848 239825115 239912453 239444351
3420.6B39444351J2799L83853r1571J03931M06380J56975L9577J95560M68693K61479
$$ 239444351 239457150 239841003 239749432 239853363 240259743 240416718 240456295 240651855 241120548 241382027
3430.3B41382027J79596N47027J4134k87171O17104P55615K51007r079j62659L25547
$$ 241382027 241561623 242108650 242122784 241835613 242452717 243208332 243459339 243450260 243287601 243613148
3439.9B43613148R38205K82956o28910M11682R15470M12273N46246M24423Q42361Q15430
$$ 243613148 244551353 244834309 244205399 244617081 245532551 245944824 246491070 246915493 247757854 248573284
3449.6B48573284J14021j3866M47407Q56228N75447Q51784M24079M6311N98163L87555
$$ 248573284 248687305 248673439 249120846 249977074 250552521 251404305 251828384 251874695 252472858 252860413
3459.2B52860413Q23516P48711J44806O65722R63669N83152P91207O87713k83927L36437
$$ 252860413 253683929 254432640 254577446 255243168 256206837 256789989 257581196 258268909 257984982 258321419
3468.8B58321419M65698N15404J161518M21581O63700L93505l0555J293869J269283
$$ 258321419 258787117 259302521 260464039 260885620 261549320 261942825 261912270 263206139 264475422
3477.5B64475422K38838M41761J239643J022930M13342L94401J046887J069183P54967
$$ 264475422 264714260 265156021 266395664 267418594 267831936 268226337 269273224 270342407 271097374
3486.2B71097374Q14934J23157M91696J409435J168041N90668M88987P32021R54266
$$ 271097374 271912308 272035465 272527161 273936596 275104637 275695305 276184292 276916313 277870579
3494.9B77870579J379890J107331O91738J88903R7180O76842O57806J064415J090202
$$ 277870579 279250469 280357800 281049538 281238441 281335621 282012463 282670269 283734684 284824886
3503.6B84824886R67369R86653N97210J006679J384964R51500O52161J172542R19896
$$ 284824886 285792255 286778908 287376118 288382797 289767761 290719261 291371422 292543964 293463860
3512.2B93463860L59153L97644R66816J349716Q56362J030578J000042R77078J339016
$$ 293463860 293823013 294220657 295187473 296537189 297393551 298424129 299424171 300401249 301740265
3520.9C01740265J177177O70529M12845J313458J022816Q38966J204395Q66432J094990
$$ 301740265 302917442 303587971 304000816 305314274 306337090 307176056 308380451 309246883 310341873
3529.6C10341873J163941J035595Q62197J135140J369285J479722R09500L46851J369667
$$ 310341873 311505814 312541409 313403606 314538746 315908031 317387753 318297253 318644104 320013771
3538.3C20013771J286583J028786J458397J705017J119308R67598J262512R99871J581039
$$ 320013771 321300354 322329140 323787537 325492554 326611862 327579460 328841972 329841843 331422882
3547C31422882M74014J006623J642837J741181K236938M36897J244088J195678J357651
$$ 331422882 331896896 332903519 334546356 336287537 338524475 338961372 340205460 341401138 342758789
3555.6C42758789J814575P92923J940155J643830J503448J313973J737136J587410
$$ 342758789 344573364 345366287 347306442 348950272 350453720 351767693 353504829 355092239
3563.4C55092239J047058L223000Q55980M94537Q14514Q22716L516350J789589J452370
$$ 355092239 356139297 359362297 360218277 360712814 361527328 362350044 365866394 367655983 369108353
3572C69108353J552391J457519J661415K065354K468528Q60138J850319K224236J809616
$$ 369108353 370660744 372118263 373779678 375845032 378313560 379173698 381024017 383248253 385057869
3580.7C85057869K007370K138329J651954O31027K752571J251030k8495K171402J140136
$$ 385057869 387065239 389203568 390855522 391486549 394239120 395490150 395461655 397633057 398773193
3589.4C98773193L461838L233643K857704K239914J345253K064094K175K360038L326188
$$ 398773193 402235031 405468674 408326378 410566292 411911545 413975639 413977814 416337852 419664040
3598.1D19664040J758728K670250J842422J814270K403183K403908K157860K244758
$$ 419664040 421422768 424093018 425935440 427749710 430152893 432556801 434714661 436959419
3605.8D36959419K287598L07159L106194J279335J336632O597213J685944r33189L113212
$$ 436959419 439247017 439554176 442660370 443939705 445276337 451873550 453559494 452626305 455739517
3614.5D55739517R15566M381942M124337J497993K346840J242371K274933K793388
$$ 455739517 456655083 461037025 465161362 466659355 469006195 470248566 472523499 475316887
3622.2D75316887K662620K708092L085404K484550L066330O540718J855812n541038
$$ 475316887 477979507 480687599 483773003 486257553 489323883 495864601 497720413 492179375
3629.9D92179375L563499M687958N061607K209587K32125L216438L907204L286628
$$ 492179375 495742874 500430832 505492439 507702026 507934151 511150589 515057793 518344421
3637.6E18344421J719132J861877L044319L455201K570190J486588K738418L910141
$$ 518344421 520063553 521925430 524969749 528424950 530995140 532481728 535220146 539130287
3645.3E39130287M672394j96915l93943O682586J443367j295433J077767N278129N102806
$$ 539130287 543802681 543605766 543211823 549894409 551337776 550042343 551120110 556398239 561501045
3654E61501045M040222M225312m784737K711754N414467J516189K180138J774979L168678
$$ 561501045 565541267 569766579 564981842 567693596 573108063 574624252 576804390 578579369 581748047
3662.7E81748047K270126J694565K307167J469803M041367J757698m36936J839485
$$ 581748047 584018173 585712738 588019905 589489708 593531075 595288773 594851837 596691322
3670.4E96691322l582191K654190P149086P875938N21736j4608345L116951Q261261
$$ 596691322 593109131 595763321 602912407 610788345 611310081 596701736 599818687 608079948
3678.1F08079948M913331j518517O50482K903061J765289J267968Q59298P85446L803902
$$ 608079948 612993279 611474762 612125244 615028305 616793594 618061562 618920860 619706306 623510208
3686.8F23510208O145897o467705k723465P109223l898773J89018N106582J261635
$$ 623510208 629656105 623188400 620464935 627574158 623675385 623864403 628970985 630232620
3694.5F30232620J393357o0959L91998K334328M40674J959228J877174m638671j001168
$$ 630232620 631625977 631565018 631957016 634291344 634732018 636691246 638568420 633929749 632928581
3703.2F32928581M392243K237739N69077K98080K011719K674789o795616K923546M665680
$$ 632928581 637320824 639558563 640127640 640425720 642437439 645112228 638316612 641240158 645905838
3711.9F45905838j0133286M431305M536210M58297P44858J939011J749344l203660
$$ 645905838 635772552 640203857 644740067 645198364 645943222 647882233 649631577 646427917
3719.6F46427917N65110N258407k780456l230515M136582O27288j72348j418228N9738
$$ 646427917 646993027 652251434 649470978 646240463 650377045 651004333 650831985 649413757 649473495
3728.3F49473495K866593N93338M378586k490616p210922P650070K165832o841278
$$ 649473495 652340088 652933426 657312012 654821396 647610474 655260544 657426376 650585098
3736F50585098j60141J623612R73282K285080K564621l139725K326660R665222j1278229
$$ 650585098 650424957 652048569 653021851 655306931 657871552 654731827 657058487 666723709 655445480
3744.7F55445480j2800140J0904541N718460M605103l684845q924179J0061340l426285
$$ 655445480 642645340 653549881 659268341 663873444 660188599 651264420 661325760 657899475
3752.4F57899475o109466N033493L618698K629623m575424K196655N571518o388016
$$ 657899475 651790009 656823502 660442200 663071823 658496399 660693054 666264572 659876556
3760.1F59876556j824264M001770K151947K37198J914291l032837l779373L535538
$$ 659876556 658052292 662054062 664206009 664443207 666357498 663324661 659545288 663080826
3767.8F63080826M733963K14004q138351J926651L552551L94211O57120m17481M49143
$$ 663080826 667814789 668028793 659890442 661817093 665369644 665763855 666420975 666003494 666452637
3776.5F66452637k21405K041320l51638o199265K781601K030411J186218J979141k562179
$$ 666452637 666231232 668272552 667920914 661721649 664503250 666533661 667719879 669699020 667136841
3785.2F67136841n60303J044464K89002N46188p9575K29416M02985k1973o46667J273346
$$ 667136841 666576538 667621002 667910004 668456192 668376617 668606033 669009018 668987045 668340378 669613724
3794.8F69613724L099823l347473l351822K645569L018646L910980o836624q347550
$$ 669613724 672713547 669366074 666014252 668659821 671678467 675589447 668752823 660405273
3802.5F60405273N127182K430268L685226M229508q740464k117614N194931J982040
$$ 660405273 665532455 667962723 671647949 675877457 667136993 665019379 670214310 672196350
3810.2F72196350j56097j16501l33023P87964M410095j468125j2125091M026565N737915
$$ 672196350 672040253 671923752 671590729 672378693 676788788 675320663 663195572 667222137 672960052
3818.9F72960052M479828J844712j5289765Q54187N437928J687011J951905J9302l922577
$$ 672960052 677439880 679284592 663994827 664849014 670286942 671973953 673925858 673945160 670022583
3827.6F70022583j31683K024612L571854J212387p740708K491761N980835n872498
$$ 670022583 669890900 671915512 675487366 676699753 668959045 671450806 677431641 671559143
3835.3F71559143o98776P217254o071624l848725N818787m292603M33503N794448k066421
$$ 671559143 670860367 678077621 672005997 668157272 673976059 669683456 670116959 675911407 673844986
3844F73844986k745209J717072J183548k8153N493j232986J937485N176010l230820
$$ 673844986 671099777 672816849 674000397 673972244 673977737 672744751 674682236 679858246 676627426
3852.7F76627426O638j3995743J643372R437026j135330r24225K793732J241760J070023
$$ 676627426 676634064 662638321 664281693 673718719 672583389 671659164 674452896 675694656 676764679
3861.3F76764679m462433O5613N620422l470230m321670L254242L822479L348694q166657
$$ 676764679 672302246 672367859 677988281 674518051 670196381 673450623 677273102 680621796 672455139
3870F72455139p959900M093552N325012K154389o662522J906586L317642j089859J666946
$$ 672455139 664495239 668588791 673913803 676068192 669405670 671312256 674629898 673540039 675206985
3878.7F75206985L740159m967423n789185M639054R10263J693191M104157j1084290
$$ 675206985 678947144 673979721 668190536 672829590 673739853 675433044 679537201 668452911
3886.4F68452911J737366M189911K67410K799454j670609n573577K208938K675400
$$ 668452911 670190277 674380188 674647598 677447052 675776443 670202866 672411804 675087204
3894.1F75087204j429291P87811Q57239R75495K64129p288131M642791J453019m061738
$$ 675087204 673657913 674445724 675302963 676278458 676542587 669254456 673897247 675350266 671288528
3902.8F71288528M552079l164368j571884J298447M38995J382446L47824K32468p56912
$$ 671288528 675840607 672676239 671104355 672402802 672841797 674224243 674572067 674804535 674047623
3911.5F74047623l968R1782k68173J137314J386718k758102k688904L638001j8692
$$ 674047623 674043655 674135437 673867264 675004578 676391296 673633194 670944290 674582291 674563599
3920.2F74563599l344956J286621J099320J528625j127319k729111J324158J038208
$$ 674563599 671218643 672505264 673604584 675133209 674005890 671276779 672600937 673639145
3927.9F73639145N32303m62799j72654J681672k011338j712570J081162K32391N0964
$$ 673639145 674171448 673708649 673535995 675217667 673206329 671493759 672574921 672807312 672858276
3936.6F72858276J1673L24784M18014l57971N34592L66897k793274n80444J347580
$$ 672858276 672869949 673194733 673612747 673254776 673789368 674156265 671362991 670782547 672130127
3945.2F72130127P22732N40696j391220P97271K50473k438583Q08792Q03299N90210
$$ 672130127 672852859 673393555 672002335 672799606 673050079 670611496 671420288 672223587 672813797
3953.9F72813797K57111k55051Q3084q40149K73666K06528N67627J73950j043090L34930
$$ 672813797 673070908 672815857 672898941 672058792 672332458 672538986 673106613 673280563 672237473 672572403
3963.6F72572403J73645k5406q7891l1738J33133j82953n20706m05350K58942J15204
$$ 672572403 672746048 672720642 672632751 672601013 672734146 672551193 672030487 671625137 671884079 671999283
3973.2F71999283N36194L89328j71585n38712l22037K71073k58789J45416P8201J62811
$$ 671999283 672535477 672924805 672753220 672214508 671892471 672163544 671904755 672050171 672128372 672291183
3982.8F72291183N13001l83072n38101M18930J057434K7237n50919m59137K27585L79181
$$ 672291183 672804184 672421112 671883011 672301941 673359375 673386612 672835693 672376556 672604141 672983322
3992.5F72983322k36358k9145o89316K289N03540k59781p0724J28937
$$ 672983322 672746964 672717819 672028503 672030792 672534332 672274551 672203827 672332764
4000.2F72332764
$$ 672332764
##END=$$ End of the data block
