##TITLE=$$ Begin of the data block
##JCAMP-DX=5.00 $$ ACD/SpecManager v 10.08
##SPECTROMETER/DATA SYSTEM=Varian
##DATE=15 Jan 2013 10:29:36
##DATA TYPE=INFRARED SPECTRUM
##DATA CLASS=XYDATA
##ORIGIN=
##OWNER=
##NPOINTS=3735
##FIRSTX=399.26403809
##LASTX=4000.35498047
##MAXX=4000.35498047
##MINX=399.26403809
##MAXY=72.37343597
##MINY=23.82074165
##XFACTOR=1.0000000000
##YFACTOR=0.000000100000000
##FIRSTY=43.98423004
##DELTAX=0.96440572
##XUNITS=1/CM
##YUNITS=TRANSMITTANCE
##XYDATA=(X++(Y..Y))
399.3 439842300 444414368 446023369 442254219 436870804 429838829 426152687 425772858 428817863 427072678
407.9 427072678 425951271 433170128 432682114 431473694 432678337 428059158 424849472 426365280 427962532
416.6 427962532 420397949 417993202 436562424 432141609 429724197 430671272 430649529 425674973 421225281
425.3 421225281 423456459 425758934 425237999 423934135 426394386 426535988 424718590 425861359 425830498
434 425830498 426283226 427526321 425958252 419181290 414879913 416949844 421851959 425778809 421899872
442.7 421899872 420479889 424301682 425299988 423647194 420558739 419984665 422964439 423850098 420646706
451.3 420646706 422475853 426289291 424880676 423370628 420929298 417217064 417574806 420651855 420817795
460 420817795 418828430 413601875 413043938 414846230 411330566 411964493 415362701 419736328 420895805
468.7 420895805 417458687 416293564 414361687 414353256 412533150 411653671 414871712 415543327 414852486
477.4 414852486 414577370 412169914 408426819 408482132 405955200 400074692 402248497 408284607 409154701
486.1 409154701 408125534 409708138 410209465 408919258 408706779 410029564 411744041 410441818 410116119
494.7 410116119 409555321 406679459 406435852 408536873 409428177 408014793 406630630 406198158 405777473
503.4 405777473 405632591 407316704 406529236 403277626 404438477 405387764 405174980 404245110 402929840
512.1 402929840 402710190 402131805 400196304 396493759 396306381 398388672 396840630 394761162 395016251
520.8 395016251 395504570 395229301 397426949 398805313 396552315 395624466 398008156 398821144 395578499
529.5 395578499 393626213 394352455 394290352 392866287 391851387 392322578 393830528 395776939 397029495
538.1 397029495 396442947 394835281 394034615 392331238 390302734 391468315 393432159 392956390 391284142
546.8 391284142 391440353 393021164 392523880 389875717 389476013 389706116 388758736 388806839 387034836
555.5 387034836 386353989 387941895 386682625 384484291 384356041 386252098 386825333 386638298 387656670
564.2 387656670 386847458 385056877 384811058 385559616 386446877 386355591 386028023 387562637 387156639 385482903
573.8 385482903 385161819 383508606 383766708 383961258 382544632 383053551 382639046 381542397 382236786
582.5 382236786 383548813 384399338 384951172 385423737 386015968 385035934 383302155 384298210 385431900
591.2 385431900 385511169 385881348 386466560 387243156 387476883 388281708 389546280 389475746 388436737 388173370
600.8 388173370 387345009 385698700 385830345 387172127 386864853 384273605 383439751 384059563 383944550
609.5 383944550 384352951 384173622 384356079 384250984 382685051 382149925 382519798 382782631 383743896 384559441
619.2 384559441 384204903 384435196 386224709 388669701 388729897 386524734 385940552 387285347 388707504
627.8 388707504 389510574 391289558 393809929 396258163 397689056 397689285 398686676 399764900 400337639
636.5 400337639 400657997 401477013 403516197 404455261 404901428 406466370 409002151 410893898 411466866
645.2 411466866 411483994 411685677 412403755 411824150 411670189 413048592 414129715 415243874 416045723
653.9 416045723 417402039 418939438 418754082 417687531 417495041 417398949 415873108 415435181 416058922
662.5 416058922 416960640 417727242 417798424 419752274 422420654 422029877 421990967 421195717 420117264 419650764
672.2 419650764 419104691 419368057 420970459 422281380 423199310 425017776 426954651 428398437 429600716
680.9 429600716 431060715 432118111 432131042 431523170 431586075 433471909 435105591 435801010 436477089
689.6 436477089 437586517 439174042 440355911 440769081 439863243 438861542 438753281 439571266 440308380
698.2 440308380 441000328 442942657 444194489 445199699 446671867 447890358 448170166 447165451 447312202
706.9 447312202 447759171 447933311 448946877 450405121 451724358 453059921 454986038 456510658 457758942
715.6 457758942 458042107 457722092 456875534 454930916 455199547 457048302 457756233 458383179 459868202
724.3 459868202 461330032 462950706 464720688 465583305 466563377 466788635 466247635 466286583 466861839
733 466861839 467578049 468451691 469915695 471497612 473020935 473268394 474081688 475580711 474893303
741.6 474893303 473902359 474063797 474501915 473953094 475254707 477342262 477828865 479457703 480258865
750.3 480258865 480430832 481117897 482066345 482302475 481548195 482757034 484131432 484727478 485742187
759 485742187 487575340 489357719 490463753 491662178 491988411 492013512 491431389 490608253 490487518 490946617
768.6 490946617 491769829 492836723 493976555 493759460 494140015 495091515 495170135 494733887 493640976
777.3 493640976 493135986 492986183 492722855 492553787 493374443 494232903 495056648 496958656 497577324 497961655
787 497961655 498921394 499125404 498970985 498352318 497521286 497887650 498188934 497740364 498366356 497868538
796.6 497868538 497455101 498161964 497261543 495516624 493447609 491423492 489824638 488951378 487680130
805.3 487680130 486418991 486040268 485546875 484956779 483728752 482342072 479675865 476696587 474958611
814 474958611 473505936 472339973 470718079 470178337 470551453 471245384 472458954 473057938 473357468
822.6 473357468 473473854 474364014 475086517 476760254 479294205 480193405 482113991 485222626 488867798
831.3 488867798 492276306 494575195 496668701 498659058 500378036 501870384 503857918 505241394
839 505241394 507122192 509599228 511673393 513463860 514840698 517646751 520605659 522272072 522551231
847.7 522551231 522596664 523089256 524258423 525628548 526321793 528484192 530219803 532124786 534927864
856.4 534927864 536981659 539297295 540833282 541447067 541389961 541776619 541639290 542024345 543275337
865.1 543275337 543724289 545298347 546404648 546760674 545400391 542825623 540342255 537484245 535378075
873.8 535378075 533747787 533515472 532931366 532256012 532303047 532939415 534084129 533701057 533241959 531317177
883.4 531317177 529127884 527921906 526287880 525331268 524600601 524519081 524650726 525381660 526249199
892.1 526249199 526382599 526135788 525152817 523989525 522175903 521019630 520932617 521359138 522162933
900.8 522162933 522591057 522578545 523196526 524970055 525954628 527070999 528450432 529008217 528995781 529261551
910.4 529261551 530029068 529889793 530496559 530904579 530942230 530811462 528792572 525689392 522019768
919.1 522019768 519068909 516569328 514593277 511593056 508339653 506576424 503872223 501318321
926.8 501318321 499322701 497733917 495659828 492258263 488865013 486029625 483841019 481926765
934.5 481926765 481230621 481009560 481076202 481509819 481524200 481263847 480162086 478964005 477049332 475042267
944.2 475042267 473572464 472762566 472793312 472407799 472824593 473263474 473256302 472754517 471531334 469958153
953.8 469958153 467461510 465339470 462831078 460657539 459035034 457115707 455613670 453730774
961.5 453730774 452231674 450651741 448852692 447173843 444550819 441754532 439610252 438191338
969.2 438191338 436952553 435170555 433285980 431890526 429863548 427589989 425677147 422964783
976.9 422964783 419560814 415306053 411314545 407905693 404099770 400396461 396530724 392494736
984.7 392494736 388397141 384156952 379984131 375537262 371393318 367480927 362926178 358089027
992.4 358089027 354008904 351059647 347461624 344394608 342396088 339506950 336610413 333575783
1000.1 333575783 330722771 327860413 325272522 323185501 321217651 319971180 318314152 316808071
1007.8 316808071 315505962 314668999 313267117 311520576 310247135 308086338 306840248 304544888
1015.5 304544888 301759033 299559917 297064533 295190411 292719173 291700954 290740147 288981514
1023.2 288981514 287529774 285428963 282895279 280633526 279173203 277082596 275623856 274322319
1031 274322319 273438778 272510090 271368999 271857853 271473770 271599522 272138901 273474255 274610939
1039.6 274610939 274847107 276031799 276552620 277449780 277350788 277495689 277576656 276853580 276797237 276204491
1049.3 276204491 276148357 274913235 273996277 272972431 271914845 271891174 271171036 271173344 270978851 271866226
1058.9 271866226 272044373 272577953 274349842 275846577 277874184 278392277 280064087 281328468 282554035
1067.6 282554035 284479313 285532951 286743240 287008533 287843895 288255882 289044857 288925571 288106079
1076.3 288106079 289062805 289793262 290778465 291611309 293553333 294651794 295559292 296907043 297369938
1085 297369938 298805180 299376450 301488762 303436413 304110584 305655518 307514286 309945393 311271667
1093.6 311271667 313311653 315455532 316872005 318077183 318640442 319717789 321344757 323069763
1101.4 323069763 324011497 325140343 326438408 328298798 329879494 330464668 331613083 332798424 333976326
1110 333976326 334350243 335086937 335711479 335686646 336706924 338490295 340209808 339842987 339425545 339778786
1119.7 339778786 340394897 340905952 340643997 341082916 341266747 341896210 341759148 341484642 342592163
1128.4 342592163 343578796 345155449 346362877 348058167 350171585 352049141 353744888 355523338
1136.1 355523338 357245331 357850075 359264145 360954857 362980309 364647903 365435295 367319260 369081001
1144.8 369081001 370376625 370626030 370084305 369746857 369610214 369667015 369413643 369845314 370374565 370436020
1154.4 370436020 370372162 370263138 370157394 369597015 368786240 367783394 366482430 365200806 365058174
1163.1 365058174 365349350 365865097 367332306 369567032 372060280 373271255 375117378 377499771 379242783
1171.8 379242783 381355972 383132896 384792023 387384109 390824051 394174004 397821770 401491394
1179.5 401491394 404534187 406723251 408704529 410640068 411132202 411330681 411989822 413423004 415638504
1188.1 415638504 417261810 418393478 419165916 419805031 420042000 419378204 418197746 416836395 415809250
1196.8 415809250 414741135 413633308 412979584 412239723 411938095 411945648 411484222 410906563 409855156
1205.5 409855156 408028641 406409683 405253487 404100227 403088226 402455635 402748833 403256569 403235855
1214.2 403235855 403104286 402904892 402433662 401416779 399999924 398478355 397433624 396868896 396398849
1222.9 396398849 396160164 396060143 396196251 396110992 396058807 395766525 394645386 393314819 391864433
1231.5 391864433 390566940 389348946 388622093 388521843 388697205 389497871 390427971 390800972 390409355
1240.2 390409355 389664192 388812370 387804489 386599693 385788803 385399017 385038261 385285835 385485916
1248.9 385485916 386116791 386808548 386826668 386865807 386117477 384936676 383860588 383231964 383086967 383074799
1258.5 383074799 383407249 384217834 385837517 387009277 387500839 387846527 388226929 388607864 388574944
1267.2 388574944 388737411 389531670 390861931 392284698 394061584 396229858 398175087 399544029 400509109
1275.9 400509109 401654320 402856140 403574677 403643188 403987732 405189323 406887283 409115944 411646233
1284.6 411646233 414040337 416362038 418117218 418994064 419702950 419825859 419911232 420555077 421526070
1293.3 421526070 422675247 424067917 425817108 427298775 428587189 429546051 430266876 430192795 429517517
1301.9 429517517 429087257 428461037 428168564 428191032 428805275 429599953 430260658 431137352 431651688 431553764
1311.6 431553764 430232086 428799057 427702179 427037849 426637154 426395988 427178612 428170128 429996529
1320.3 429996529 431880302 433181267 434291801 434622765 434493179 433661041 433137398 432990074 432868958
1328.9 432868958 433008499 433382034 434136734 434487762 434656105 434393730 434081573 433571587 432098465
1337.6 432098465 430431061 429710693 430395088 431089439 432254066 433589478 434763222 436254158 437434692
1346.3 437434692 438040276 437534142 436990776 436388474 435728874 435212364 434534454 434484940 435132904 435867653
1355.9 435867653 435981483 436343651 436096916 435087471 433924255 432539024 431368828 429200325 429353561
1364.6 429353561 429850349 429605942 430152969 430367241 430328026 429846153 429197464 428569298 427820625 426857033
1374.3 426857033 425991249 426290054 426375999 426533089 427022591 427606354 427680244 427411575 427089386 425500259
1383.9 425500259 423863411 422357635 420636749 418021431 417248611 417611847 416968269 416307526 415382729
1392.6 415382729 414333115 412086372 409293518 407870102 405815620 403687744 400018158 398078461
1400.3 398078461 397597809 396253815 395055923 394007111 392194138 390068893 388826180 387250633
1408 387250633 384972992 382823677 380985146 379694710 378527718 377551193 376955910 376972733 377100449
1416.7 377100449 376526375 376692657 375150452 374578323 375243034 375036316 375119362 374713821 375563011 376904068
1426.3 376904068 378069725 379763412 380650597 381541824 382214470 383034821 383780212 384566917 385717659
1435 385717659 386244888 386898499 388310127 390897751 393056564 394630661 395987778 396730995 397644272
1443.7 397644272 397650719 398082161 398860817 399334564 399222984 400400848 402439346 403566551 405414734
1452.4 405414734 406853104 408406715 409398575 409124527 409040031 408818169 411505737 413273125 416090088
1461.1 416090088 418178558 419899559 422358971 423171158 425557518 427551498 429557304 431253586
1468.8 431253586 432934074 435027542 435891800 437810287 440729980 445404320 449138870 452014618
1476.5 452014618 455074615 458049812 460277481 461358452 462498970 464030914 465787621 467295265
1484.2 467295265 468683319 470312271 471828461 473230057 474127350 473156395 473372536 474250107 474159698
1492.9 474159698 472766304 470962029 469733047 465233688 465430641 465389633 463444901 463678207 462755585
1501.6 462755585 461230354 459746246 458909035 455912628 446011887 444560547 447541313 449978409
1509.3 449978409 449671478 450674629 450132790 448384857 448169785 446430435 444987907 441688843 439672623
1518 439672623 441154289 441858788 440817604 439709244 441137238 442711067 445070038 445172806 444552536
1526.6 444552536 444556580 444385338 445326462 445998154 446416473 446651154 447199287 447341576 449164124 450594673
1536.3 450594673 451027298 452238464 451019936 447884674 448307343 448633041 448995934 450686111 452320862
1545 452320862 453034859 455224304 456650276 458163986 458663559 458142090 458974991 459006004 459518623 457005424
1554.6 457005424 457698135 460370102 462254143 460995865 452530746 456346207 457830467 458934746
1562.3 458934746 458085976 456541214 453890152 451906929 451322060 449384079 448191757 442366676 441834221
1571 441834221 441460648 438980942 436309204 433075867 431329193 420389709 418629684 416578407 413417816
1579.7 413417816 410289001 405723457 402928772 398566093 395752716 391120758 386809731 382437172
1587.4 382437172 377012787 373540154 367990379 364895096 359888878 356607628 353174400 348844643
1595.1 348844643 346486778 342014847 339729080 334778404 331695328 328207779 324882278 322533150
1602.8 322533150 318321552 317211971 314065666 312959137 309853859 308142033 307123241 304363422
1610.5 304363422 304020882 300822124 300499001 298588886 298237476 297390823 292651997 294910984 293862534
1619.2 293862534 294954567 293696728 294275265 293465519 291467667 293154812 292461815 293899384 292163239
1627.9 292163239 293330250 293802471 294921532 296671772 296477985 298386574 297535610 298417606 297288914
1636.6 297288914 299493885 301106014 301747360 303999577 304253712 306982517 307778988 309679832 310897732
1645.3 310897732 310142670 313145142 311651134 314733238 315402813 317676220 318835144 312749958 315771103
1653.9 315771103 318499870 323508224 324658661 326711769 327740746 329483528 331670380 332812843
1661.6 332812843 334920349 334941978 338610077 340920792 343743362 346640053 349354935 353486557 354611816
1670.3 354611816 358867836 361438828 365353584 368238220 370192375 373805046 377374077 382318993
1678 382318993 385581970 390243530 393538971 397889671 402165985 400727730 406928253 411393127 417170296
1686.7 417170296 420804367 425020409 429912376 433866234 439578972 444526749 449827423 454370193
1694.4 454370193 458317299 460040627 465327454 471201401 475926247 479440689 480368614 487895889
1702.1 487895889 493662720 498530540 502737885 505716591 509075966 512448616 515732155 517492180
1709.9 517492180 518850632 521236420 523907204 526619225 528639450 531543961 535206528 536274261
1717.6 536274261 533778534 537674751 540685310 542101669 543024139 543321152 544145927 546338921 548807678
1726.3 548807678 550821419 553329201 556121559 556556168 556744118 559156418 561024742 558052483 554266624
1734.9 554266624 559851570 564574966 567364960 571072388 573207436 573950768 578301888 580936546
1742.7 580936546 581498032 583223495 586106567 588409653 590660019 593401222 595801849 601463966
1750.4 601463966 605308495 608210831 613517838 616977654 619990120 621997643 621479492 623391075
1758.1 623391075 626359367 629363899 632845345 633521194 635197144 639560356 642318726 644588547
1765.8 644588547 646871567 648168335 645930786 646822968 649355927 648825836 648246231 649118881 654208069
1774.5 654208069 657658081 658354416 660966721 662150803 663198700 662591095 660570450 660974045 662548141
1783.2 662548141 664333801 664719772 666738434 669612350 671546097 672747498 674160004 673820877 672831268
1791.8 672831268 670778809 670079117 673324738 674204102 674520950 676821747 679473343 681072998 681547318
1800.5 681547318 684130707 684014587 683788757 684086761 683635941 683997040 683905029 684700699 686397018
1809.2 686397018 688748169 689372864 691242294 693485947 693715134 694008560 692833786 692398224 691495132
1817.9 691495132 691455994 692337799 693151932 695505066 696550217 698720932 700156784 698181992 698273697
1826.5 698273697 699347153 699922256 697782059 694125061 695624084 698808823 700505753 701979218
1834.3 701979218 703763199 705052261 705734863 705134277 705374374 704253159 703261032 702567902 703449326
1842.9 703449326 704889908 701315079 704251175 707375946 708622894 709329147 709583740 709761810 708655701
1851.6 708655701 708251801 707223358 707131577 707670898 708011475 709536667 710889053 712747269 713835297
1860.3 713835297 714214096 713459091 712651291 712009811 711095581 710762100 709561691 710476151 710816040
1869 710816040 711188660 713760376 715635605 716760788 716399612 715836868 714654846 713749695 713155746
1877.7 713155746 712833710 713580093 714520416 715952911 716649094 717948914 718886871 718825073 718332748
1886.3 718332748 717031097 716870880 715405655 713371201 714060440 715728607 717070160 718387451 719422836
1895 719422836 719619904 720645599 720341644 719557571 718582230 717386322 716507111 715917511 716973267
1903.7 716973267 717712402 719217453 720593109 721446991 722174988 721731033 721311417 720330811 719787827
1912.4 719787827 718374939 717612534 717965546 718832626 720870132 720610962 721225739 722704468 723084488
1921.1 723084488 722498703 720246735 718998642 718911819 718968811 718636169 719129257 720076523 721398087
1929.7 721398087 722790375 723295517 723734360 723025970 722467957 721221848 719821243 719271622 718728714
1938.4 718728714 719118500 719657135 721251068 722048340 721980133 723052673 723340454 722412796 720809326
1947.1 720809326 719847946 718852997 718416672 718533936 718927689 720118942 721582870 723044205 723256683
1955.8 723256683 723521042 722748795 721062088 719750061 718441162 718064041 717751846 718255157 719242172
1964.5 719242172 720660706 721987076 722104874 722071609 721944046 721419525 719531021 718459320 718032303
1973.1 718032303 717427902 717811127 718501511 719776230 720928650 722131424 722140732 721515045 721153030
1981.8 721153030 719890823 718687820 717571411 717193375 716964264 717524796 718611374 719334564 720819244
1990.5 720819244 721420746 721056290 720430984 719871597 718458481 716929550 716323166 715800934 716462021
1999.2 716462021 717472305 718602448 719465485 720063553 720401306 719695969 718590698 717024002 715973740
2007.8 715973740 714762421 714308472 714836578 715609207 717111511 718014069 718975296 718947754 718139420
2016.5 718139420 717281189 716266098 715334244 714109879 713479843 713011322 713616791 714496613 715295715
2025.2 715295715 716488342 717065887 717313995 716257935 714925308 713461456 712201385 711302414 710707703
2033.9 710707703 711349182 712267151 713886108 714848251 715285034 715501480 714669342 713379745 711895523
2042.6 711895523 710759048 709444046 709408569 710000229 710974731 712240829 712816467 713684235 713569794
2051.2 713569794 713448715 712890625 711893387 710880661 709533997 708979187 708333588 709096069 710096817
2059.9 710096817 711074524 712378387 712790604 712931290 711715775 710474854 709233627 708192673 707618561
2068.6 707618561 707402115 708179016 708687668 709749908 711113815 712164536 711842041 710975113 710215988
2077.3 710215988 708592682 707458115 706345825 706129532 706661377 707748947 708897476 709359131 710266113
2086 710266113 710348969 710084305 709165192 707902832 706646347 705486984 705357742 705445480 706294250 707050934
2095.6 707050934 708132401 708943329 708858109 708503265 707171707 706336975 705370483 704532166 704022980
2104.3 704022980 703851852 704382401 705098267 706286697 706766129 707166519 707140656 706571274 705458832
2113 705458832 703912735 703125000 702365189 702372284 702626190 703471451 704634171 705340347 705930557 705683441
2122.6 705683441 705460052 704507980 703375244 702386475 701614838 701480484 701398926 702237167 703314285
2131.3 703314285 704314880 704804459 705369644 705426559 704221802 703224640 702328720 702136612 701823273
2140 701823273 701871948 702285767 702745285 703802490 704314575 704810486 704681244 704415512 703886414 702994919
2149.6 702994919 702154236 701325302 701573181 701840286 702704849 703431396 704042664 704775620 704840317 704878387
2159.3 704878387 703904419 703258057 702580643 702178040 702299805 702467041 703457108 703822250 704368515 704426727
2168.9 704426727 704403839 704542923 704164963 703920898 702962189 702666321 702496948 702369614 702651520 703277817
2178.5 703277817 704362183 705059662 705744781 705535812 705116196 704417114 703662491 703171234 703004837
2187.2 703004837 703729553 703594284 703746109 704280853 704987030 705420380 705325851 705719147 705212631 704493790
2196.9 704493790 703739243 703841171 704246216 704235458 704804230 705051346 705836487 706273575 706318817 706301041
2206.5 706301041 705997086 705449219 704423141 704334869 704489441 704775543 704852295 705081787 705653610 705904388
2216.1 705904388 706363983 706380234 706607513 706213837 705577774 705358734 705032730 705184174 705249786 705470047
2225.8 705470047 705679779 706511230 706928711 706619568 706784363 706564941 706248627 705508118 705077896 705164871
2235.4 705164871 705501328 705598602 705372162 705876999 706291733 706764679 706857758 706862488 706187515 705168686
2245.1 705168686 705335922 705190353 705160751 705106430 705336990 705737305 705956955 706498337 706783981 707111435
2254.7 707111435 706517105 705879440 705717163 705440674 704807129 704408569 704910965 705058060 705569992 705758286
2264.4 705758286 706122742 706651535 706509476 706526260 705723953 705142975 704755173 704837723 704856796 704360733
2274 704360733 704742737 705415421 705960388 705714493 706109161 706237793 705392838 704766083 704306412 704481125
2283.7 704481125 703995819 704080429 704344559 704516754 705192566 705617905 706027527 705146103 704811554 704635391
2293.3 704635391 704020309 703438568 702482758 702699661 702949371 703438416 703914261 704440536 704669037 704364243
2302.9 704364243 704652786 703966141 703209229 702645340 702535172 702430649 702300034 703011627 702999725 703417358
2312.6 703417358 703784790 704025421 703962097 703241348 702630386 701755295 701199722 700617142 700535736 700392914
2322.2 700392914 701381531 702085266 701885681 702887497 702757874 702526016 701498642 700395203 699189072
2330.9 699189072 698701630 699695435 699121246 700561371 701971512 702064743 702016068 702144241 702037582 700405960
2340.6 700405960 699500580 698641205 698799057 698327103 698040695 698507767 698518448 699483643 700187607 701160965
2350.2 701160965 701612091 701601791 700254440 698520584 698684235 697628708 697284927 697187805 698904114
2358.9 698904114 699042587 697934494 699600830 700241699 700088196 697399445 696633301 696457367 695922928
2367.6 695922928 695788269 694400482 694330063 694239655 695344620 695943832 695995712 696120071 695370178 694880295
2377.2 694880295 693939056 693248825 692290726 691711044 691849289 692365112 693233871 693614502 693799057 693176498
2386.8 693176498 692792664 692223434 691057816 690259323 689530029 689448700 689438553 689909821 690572128 691007462
2396.5 691007462 691125259 690607605 690099564 689394989 688871002 687916336 687151947 686686096 686354370 686876144
2406.1 686876144 687593842 688528900 688649445 688447342 687829056 686978149 686437225 685263824 684338837
2414.8 684338837 683406906 683187256 683283081 683591385 684727936 685431137 685887756 685385742 684288101
2423.5 684288101 682990112 681766052 680719681 679710617 679554672 679588242 680014038 680429230 680697937
2432.2 680697937 681016235 681099396 680912552 680166168 679127197 677866669 677143631 676272964 675873718
2440.8 675873718 676525421 677124710 677797241 677963867 677957535 677396088 676758499 675758743 674059525 673238297
2450.5 673238297 672576370 672233810 672179871 672662582 673232803 673316727 673479233 673170395 672594070 671461716
2460.1 671461716 670472107 669312134 668285904 667935181 667642975 668142014 668467560 669017715 669360046
2468.8 669360046 669179077 668586349 667396317 666714554 665257263 664028702 663556061 663343964 663362198
2477.5 663362198 663451462 664298248 664742889 664958038 664517975 663443832 662059326 660455704 659658890
2486.2 659658890 658995361 658766861 658708878 658698425 658797989 659178314 659615021 659206467 658793945 657876511
2495.8 657876511 656541138 655043793 653914413 653456879 653133011 653206635 653205643 653793716 654301224 654455948
2505.5 654455948 654106522 652591019 651183319 649988480 649074783 648217087 647872849 647936096 648342514
2514.1 648342514 649397812 649640198 649233856 648539963 647928391 646985397 645698471 644607391 643665390
2522.8 643665390 643561020 643457947 643525238 644188156 644949570 645022659 644523239 644010773 642675705 641343689
2532.5 641343689 640164032 639268379 638956642 638843842 639106560 639600067 640189362 640389709 640281677
2541.1 640281677 639431763 638618050 637784729 636254845 635276222 634487076 634293022 634298058 634494286 635353813
2550.8 635353813 635923080 635997467 635202065 634254189 633143578 632148132 631245804 630191536 629486542
2559.5 629486542 629088326 629690933 630321579 630999641 631392860 630868378 630296249 629265556 628026772
2568.1 628026772 626788788 626031685 625530434 625155945 625107384 625567055 626550980 626804466 626768684 625943108
2577.8 625943108 624801674 623986855 622952385 622193222 621456146 621400871 621367226 621286507 621412163 621575813
2587.4 621575813 622009163 621566353 620900345 620172729 619198418 617956505 616889954 616242523 615579071
2596.1 615579071 615994835 616698532 617166252 617256813 616964493 616564178 615426292 614094505 612861938
2604.8 612861938 611939621 611325493 611230049 611116333 611127357 611526451 611466026 611732178 611480865 610597382
2614.4 610597382 609283943 607789955 607091942 606428490 605955009 605670700 605913582 606017952 605979462
2623.1 605979462 606271820 605808144 605154953 603944817 602623596 601705170 600709724 599787750 599345779
2631.8 599345779 599739952 600190620 600660896 600553207 600222626 599889908 598832779 597484589 595972404
2640.5 595972404 595191460 594827042 594415779 594122620 594418907 594995422 594864960 594918938 594434776 593424149
2650.1 593424149 592549934 591481323 590421677 589626732 589342575 588934135 589023857 589656410 590133858
2658.8 590133858 590264969 589706573 588752823 587645454 586739922 585722084 584779167 584156151 584234047
2667.5 584234047 584764175 584896431 585156326 585185471 585256157 584884911 583852310 583041306 582205544 581551132
2677.1 581551132 580648613 580061417 580141068 580496979 580725250 580500031 580834122 581271400 580844383 579535980
2686.8 579535980 578106270 576977310 576245041 575825462 575655861 575901718 575837059 576299553 576931152
2695.4 576931152 576798706 576356049 575374641 574421043 573582230 572643547 571737366 571415291 571412697 571561546
2705.1 571561546 572172966 572521820 572915649 572979202 572357216 571231880 570146370 569051476 567781944
2713.8 567781944 567744865 567963943 568031998 568362999 568974953 569604530 569337921 568834076 568007393 567082863
2723.4 567082863 566066246 565270767 564940453 564604378 564800415 564890060 565189857 565596352 565592880 565219994
2733 565219994 564418297 563546829 562557297 562250595 562009544 561621208 561672211 562257538 563153458 563384705
2742.7 563384705 563421898 563046036 562368546 561801720 561239624 560425148 559439659 559188309 559117470 559347878
2752.3 559347878 559754181 560190239 560417747 560082893 559656105 558785706 558190422 557527390 556730347 555996819
2762 555996819 555402107 555659409 556018829 556565475 556766396 556862221 556726494 555932999 555388336 554323158
2771.6 554323158 553036766 552238846 552120972 551970558 551809616 552218399 552406845 552462044 552192497 551728210
2781.3 551728210 550915680 549905968 548744164 547744560 547591782 547586365 548166924 548220749 547893982 547845497
2790.9 547845497 547384071 546892586 545564003 544409027 543477592 542614288 542397041 541792297 541176872
2799.6 541176872 540878448 540848846 540569878 540303001 540042267 539275818 538253899 536740952 535581436
2808.3 535581436 534910126 534385948 533989258 533812141 533746796 533348427 532901497 532301521 531681404 530701523
2817.9 530701523 529370804 528003922 526904793 526435623 525863113 525456734 525299950 524928055 524138489
2826.6 524138489 523314896 522430801 521197205 520293388 519272995 518086853 516777954 515674171 514970589
2835.3 514970589 514332085 513967476 513055000 511915894 510418587 508386612 506420288 504230347 502100754
2843.9 502100754 499982796 498012009 495951958 493702087 491703072 489975510 488603096 487516251
2851.7 487516251 486356926 484800491 483920555 483685265 483317757 483080215 483198166 483526382 483564568
2860.3 483564568 483573303 483433380 483477249 483254662 482268600 481270294 479894753 478481216 477285309 476825409
2870 476825409 476658554 476269836 476403656 476015816 475286980 474639931 473986015 473370056 472338753 471171303
2879.6 471171303 470114098 469252739 468339996 467601089 467393379 467507553 467325096 466819000 465759773
2888.3 465759773 463868370 462547455 461327286 459973793 459133110 458365288 457750473 457204857 456671867
2897 456671867 455808487 455303383 454939117 453916321 452951241 451693306 450331612 449533501 448957214
2905.7 448957214 448037529 447599678 447439461 446313400 445103073 443889198 442439499 440719719 438659554
2914.3 438659554 436612320 434923668 433608055 432111359 430889854 429983292 429232292 428401642 427414246
2923 427414246 426919746 426649551 426004219 425135841 425056000 425286369 425572968 426170959 426838379 427608185
2932.7 427608185 428045044 428596954 429040489 429420204 429923630 430747452 431879730 432355270 432946625
2941.3 432946625 433603363 434726105 435946198 436583252 437663002 438351555 438841972 439184647 439209290
2950 439209290 439346657 439806824 440383301 440459213 440949135 441552734 442157402 442873840 443491936 443851357
2959.7 443851357 444213409 445231705 445372772 445404015 445889168 446311722 447390556 448466492 449257202
2968.3 449257202 450336075 451861801 452744713 453568420 454243965 454059639 454157829 454399033 454845848
2977 454845848 455121994 455685463 456599655 457454338 458286018 458238182 458394737 458456345 458246040 458239670 458287964
2987.6 458287964 458605537 458676567 459241905 459965744 460333710 460334129 460156021 460179825 459863586 459484482
2997.3 459484482 459142113 458925743 458390503 457679405 457046547 456702499 456977768 456644516 456199913 455931702
3006.9 455931702 455813713 455631790 454786568 453979378 453073921 452171516 451656532 451701660 451433258 451068344
3016.6 451068344 451045647 450462265 449809952 448565598 447553673 447137604 446448364 445795670 444580917
3025.2 444580917 443757896 443558884 443110275 442642059 442120094 441203423 440372467 439788094 438790474 437942047
3034.9 437942047 437027550 436111565 435375328 434775085 434381638 433533859 433072128 432728691 432086868 431257133
3044.5 431257133 429957466 428419189 426994209 426626511 426250420 425412750 424759369 424262657 424199524
3053.2 424199524 423624649 422417831 421481018 420872040 419749031 418384171 417248116 416311874 416116257
3061.9 416116257 416012497 415806923 415369415 414653435 414034996 412905846 411812248 411253433 410491867
3070.6 410491867 409263840 408497391 408180733 407584686 407031403 406748810 406347847 405614662 405372810
3079.2 405372810 405077667 403868217 402758865 401951714 401187172 400704575 400205460 399510498 399211159
3087.9 399211159 398830490 398164024 397695580 396851387 395860405 395008011 394089928 393339386 392781754 392157097
3097.6 392157097 391549416 391108055 390775833 390379753 389590683 388797836 387870941 387199707 386915092 385789642
3107.2 385789642 384669380 384197731 383986549 383502502 382525139 382137070 382059517 381377029 380272789
3115.9 380272789 379125481 377907791 376975098 376390495 375673065 375088043 374799080 374374123 373701324
3124.6 373701324 373056831 372310066 371810684 370913925 369571953 368871269 368108788 367587051 366817856
3133.3 366817856 365709343 364954948 364133110 363878860 363427391 362746315 361903152 360936241 360141335
3141.9 360141335 358712921 357619896 357181473 357084999 356176949 354992599 354944725 354510651 354054680
3150.6 354054680 353678207 352681046 351210747 349759865 348999825 348457069 347855797 347079887 346394539
3159.3 346394539 345643425 344937248 344400558 343787422 343321037 342209473 340543251 339250603 338658104
3168 338658104 338292007 338003197 337540512 337066307 336990929 335936890 334862289 334027596 332877731 332079506
3177.6 332079506 331231384 330734062 329841957 329041443 328797989 328512688 328027878 326620445 325890961
3186.3 325890961 325633392 324874954 323922615 322566452 321694717 321283989 320627251 320038223 319919033
3195 319919033 319537048 319043961 318418427 317138634 315985260 315029488 314675007 314314346 313611336 313117409
3204.6 313117409 312377148 311798573 311398487 311071949 310809231 310300121 309485741 308646851 307934093 307059517
3214.3 307059517 306159153 305511570 305606842 305651436 305085754 304459305 303746071 303074265 302496300 302104034
3223.9 302104034 301218357 300021191 299446945 299166279 298741798 298308525 298158951 297812042 297479858
3232.6 297479858 297004261 296221867 295473671 294651451 294041462 293186340 292542629 292210941 292108498 291950912
3242.2 291950912 290994835 290380878 290010452 290118713 290176563 289211006 288147984 287342358 287042503 286536026
3251.9 286536026 286157246 286204090 286198826 286040535 285425701 284994774 284113445 283149796 282504063 281784744
3261.5 281784744 281646900 281525497 281232758 280668564 280208378 280177746 279972057 279508114 279117680 279052296
3271.2 279052296 278487282 277743454 277309723 276895332 276522102 275827885 275508175 275936298 275963516 274940815
3280.8 274940815 274056969 273917618 273725071 273214378 272652073 272279110 272045479 272449341 272757740 272054119
3290.4 272054119 271408997 271036739 270919342 270757256 269973240 269594898 269633064 269163857 268594131 267993813
3300.1 267993813 267628956 267852325 268042793 267981243 267385426 266845875 266459808 265726013 265537815 265572224
3309.7 265572224 265306263 264686260 263887749 263426189 263152218 263222160 263277836 262756996 262022514 261739712
3319.4 261739712 261558361 261142998 260672550 260246487 260343075 259888859 258759117 258076992 257742138 257573986
3329 257573986 257052860 256277790 255451012 255028515 255043736 254589481 254160995 254037285 253658504 252965965
3338.7 252965965 252610264 252258682 251578007 251346798 250946007 250346355 250226402 250202179 249877434 249279594
3348.3 249279594 248805408 248458405 247880859 247259331 247201118 247283974 246892834 246467113 246320381 246110020
3357.9 246110020 245673504 245261555 244926949 244704990 244105740 243531532 243848724 244087162 243809109 243543110
3367.6 243543110 243369541 243081169 242703133 241966667 241320114 241605759 241573887 241410084 241570015 241067028
3377.2 241067028 240532990 240468826 240730057 240795231 240400867 239993706 239636135 239378109 239449043 239569511
3386.9 239569511 239563026 239907818 239927559 239714813 239872456 239683781 239340248 238951683 238573093 238357525
3396.5 238357525 238337154 238639336 238987732 239286976 239022007 238768959 238847466 238731918 238768044 238632069
3406.2 238632069 238450375 238373241 238207417 238559361 239097900 239232407 239380608 239588985 239624329 239713688
3415.8 239713688 239757671 239681225 239593697 239451504 239305782 239682217 240624886 241139946 241177998 240879879
3425.5 240879879 240560131 240836296 240960560 241015224 241319981 241628876 242048512 242073994 242257633 243173294
3435.1 243173294 243910389 244134312 244006042 244022903 244650574 245556641 246059494 245444660 245138073 246174622
3444.7 246174622 246979599 247307472 247865696 248420868 248659515 248844681 249561481 250098991 250149364 250692863
3454.4 250692863 251526642 251959515 252292175 252614574 252954693 253506355 254212017 255215454 256070004
3463.1 256070004 256546440 257083244 257929840 258579979 258760395 259319191 259869347 260555439 261549168 262105675
3472.7 262105675 262757130 263289280 263660450 264194088 264513073 264878349 265616589 266678219 267887325
3481.4 267887325 268724670 268804455 269613075 270857754 271207466 271914310 272992249 273792496 274694195
3490.1 274694195 275370922 275882435 276848049 277958069 278974743 279873333 280114422 280699768 281583748
3498.7 281583748 282147408 283063660 284081249 285090122 285708847 286199112 287184200 287926579 288590794
3507.4 288590794 289649754 290700569 291762638 292945576 293827744 294780140 295643444 296333237 297118740
3516.1 297118740 297844067 298946819 299972820 301182938 302875977 304311104 305159969 305384884 305927753
3524.8 305927753 306888676 308060207 309086857 310063457 311278839 312595177 313753853 314640942 315968666
3533.5 315968666 317083683 318059330 318956318 319788074 321041832 322170601 323740463 324920502 325929222
3542.1 325929222 327119751 328510246 330100060 330881233 332161942 332609940 333877182 336024895 337844238
3550.8 337844238 339681473 339551773 340691223 342277031 343646545 345487709 346695251 348833313
3558.5 348833313 350643730 351919174 352634048 354453468 356271210 356918144 360038643 361130486 362081833
3567.2 362081833 364111671 364413605 366902428 368650703 370462303 372706108 374578896 375930939
3574.9 375930939 377629280 379816933 380485840 382503128 385104027 386564217 387985153 389872398
3582.6 389872398 391370659 392637215 396089821 397624168 398556862 401203957 401420250 404275856 407194328
3591.3 407194328 409526596 411406250 413285561 416050797 415964279 418162689 421473045 423223495 426102867
3600 426102867 427618713 429110031 431627388 433953857 436552582 439588661 441958466 441775284 444408913
3608.7 444408913 445110245 446112061 452733421 455162125 454598427 457933655 459429169 463758087 468146515
3617.4 468146515 469622307 471205940 471959190 474155464 477583542 480870094 483712616 486806374
3625.1 486806374 489125938 491595688 496983604 496344109 491530800 497223892 502339478 507271996
3632.8 507271996 509476509 509717102 513350220 517195854 520221481 522542992 524994545 528135414
3640.5 528135414 530982895 533013077 534799690 537636871 541788368 547355728 547740669 545805664
3648.2 545805664 550373421 551433716 551225357 553006020 558690186 563656807 567683754 572035789
3655.9 572035789 567179451 570202141 575649185 576968422 578897858 580531654 583559494 585844650
3663.6 585844650 588064041 590238533 591561813 596394958 598771858 597820320 598847237 595420609
3671.4 595420609 598400879 605817146 613100662 610174561 595649414 601144333 610176353 614792976
3679.1 614792976 613267097 614403419 617181587 619180489 620408745 621388588 622948875 627030678
3686.8 627030678 633080750 624399376 620627556 628372536 625710754 626107979 630412941 631975250
3694.5 631975250 634370155 634898300 634814529 636046982 636541862 639081383 641526031 637482529 636285553
3703.2 636285553 640318680 641957626 641927414 642216721 644709702 647526169 641071930 644843140 649929962
3711.9 649929962 638389778 641974564 646833115 647478867 648144302 650187912 651831436 648623734
3719.6 648623734 648833160 653842850 651405487 648123474 652538910 654222260 654803848 652731857 651983109
3728.3 651983109 654904175 655701828 659816284 656520615 649631424 658231583 660359573 652718582
3736 652718582 653145599 654511032 654961777 657234802 659869156 657415619 660043716 670017014 660956802
3744.7 660956802 645948486 655341568 660813980 665594482 660814133 651394348 661881638 657406158
3752.4 657406158 652490158 658920898 662604446 665243835 661343460 663552704 668772812 662481384
3760.1 662481384 660903473 664415283 665992126 666242905 668351212 665395432 661500092 665408020
3767.8 665408020 670137253 669781570 662571259 664665146 667510834 667646179 668607483 668434448 669050217
3776.5 669050217 668982849 670986786 670562363 663705673 666545410 668917389 669949875 671946182 669373398
3785.2 669373398 668775406 670022354 670863190 671564178 671158752 671149139 671014175 670977554 670469513 671600723
3794.8 671600723 674358749 670918884 668471680 671097183 673893814 677517929 671029968 662924728
3802.5 662924728 667305069 670540543 674662399 678610611 670382614 668267136 672984467 674015427
3810.2 674015427 673182602 673602219 674176559 674675217 677950897 675456924 664691162 670067062 676101608
3818.9 676101608 680154724 680248108 664973145 666972656 672318039 674405670 676383896 675279312
3826.6 675279312 670955124 671671677 673921890 677079620 678232727 670734787 673374405 679113312
3834.3 679113312 673546982 673876114 680854950 672973251 669362946 676250839 671969910 672013245 678158112
3843 678158112 676463318 673238678 674862213 675789413 675835571 676769943 675275345 677009964 681656876
3851.7 681656876 676305008 677941284 664447327 666279984 676256409 675646439 674393768 676429749
3859.4 676429749 678281021 679483643 674157257 674414139 680131836 676307678 671794739 674995193
3867.1 674995193 679031219 683271942 675265045 667349854 671572342 676650391 679799423 673277206
3874.8 673277206 673799820 676816330 676444702 678037186 681043243 676612396 670786133 675619888 676766815
3883.5 676766815 677871704 681838379 670849457 672147064 676160889 676775665 679809036 678722382
3891.2 678722382 672575760 673847198 676534500 674620514 674957886 675948334 678486557 680303421 671873856
3899.9 671873856 676206207 677340622 672598495 676853867 674564285 674249268 675184250 675374527 676359711
3908.6 676359711 676010361 675902252 675495377 676339722 676557465 676298752 677269058 677788925 674789047
3917.3 674789047 672744827 676537323 676093979 672715454 674654160 676141586 677087936 675186157 672844620
3926 672844620 675294952 676947174 677193527 675909424 674984818 676458054 674522171 673492355 674421082
3934.6 674421082 674137421 675086746 675547943 675251541 674999847 674926605 676362915 676875076 673945999
3943.3 673945999 673190308 674781494 675682602 675893326 674228439 674557953 674766464 672965088 674490662
3952 674490662 674902649 674845734 675808640 675608063 675293808 674850464 675179596 674524078 674660034 675255203
3961.6 675255203 674385223 674660797 674769821 675159149 675259552 675384903 675696945 673912048 672861404
3970.3 672861404 673488541 673884125 674045258 674636993 674835815 674347153 674121628 674429932 674637299 674372559
3980 674372559 674554214 674320831 673713989 673889694 673953552 673165283 673060684 674081802 674719849 675569077
3989.6 675569077 676016006 675825958 675170059 674633560 675211563 674428635 673876801 674788437 675211487 675263290
3999.2 675263290 675253830
4000.2 675253830
##END=$$ End of the data block
