##TITLE=$$ Begin of the data block
##JCAMP-DX=5.00 $$ ACD/SpecManager v 10.08
##SPECTROMETER/DATA SYSTEM=Varian
##DATE=15 Jan 2013 10:29:24
##DATA TYPE=INFRARED SPECTRUM
##DATA CLASS=XYDATA
##ORIGIN=
##OWNER=
##NPOINTS=3735
##FIRSTX=399.26403809
##LASTX=4000.35498047
##MAXX=4000.35498047
##MINX=399.26403809
##MAXY=72.76400757
##MINY=24.11359406
##XFACTOR=1.0000000000
##YFACTOR=0.000000100000000
##FIRSTY=45.14442825
##DELTAX=0.96440572
##XUNITS=1/CM
##YUNITS=TRANSMITTANCE
##XYDATA=(X++(Y..Y))
$$ plain form
399.3 451444283 439355087 426137276 423301392 420667953 418448410 417456627 424486122 425379753
407 425379753 423472137 427058640 428518867 427203751 425888901 427436066 427009811 425809288 423052673
415.7 423052673 422194710 425067978 421640015 427991409 437873688 437097092 435784760 432698402 429321556
424.3 429321556 428576355 424588699 421780014 422118721 422714310 427413521 428934631 426928177 424935303
433 424935303 425108986 425863228 422449265 421914673 420844994 421268082 419193840 415937119 420258751
441.7 420258751 422938042 424514008 425440445 427226410 424974899 419891052 423603935 425368233 425138702
450.4 425138702 425069504 425947113 426307907 423297997 422820702 424505920 428038559 427975235 422560272
459.1 422560272 416170921 413294830 418286438 420985336 417015495 414786453 419716301 420348740 416992340
$$ packed form
399.3D51444283j2089196j3217811k835884k633439k219543r91783P029495Q93631
407D25379753j907616L586503J460227j315116j314850J547165m26255j200523k756615
415.7D23052673q57963K873268l427963O351394R882279p76596j312332l086358l376846
424.3D29321556p45201l987656k808685L38707N95589M699211J521110k006454j992874
433D24935303J73683P54242l413963n34592j069679M23088k074242l256721M321632
441.7D20258751K679291J575966R26437J785965k251511n083847L712883J764298k29531
450.4D25138702o9198Q77609L60794l009910m77295J685218L532639o3324n414963
459.1D22560272o389351k876091M991608K698898l969841k229042M929848O32439l356400
$$ plain form
467.7 416992340 413699646 414214287 418457947 416319199 411677055 410593185 412728729 415429573 412746391
476.4 412746391 408040771 409650040 412955055 411797791 412572670 409796181 407099228 408961525 407704124
485.1 407704124 405901756 407048645 411739540 409940529 407604408 409878082 409168282 409407082 409743958
493.8 409743958 409801826 408067017 406981888 408224983 408150101 407998009 408714523 409814262 407744865
502.5 407744865 407300034 407721176 407783165 408430557 406486588 406287003 404740982 401819000 400404472
511.1 400404472 400008774 400299568 400981140 403178864 401980057 398689575 397642288 397697029 398263054
519.8 398263054 398615456 398190727 397518311 398374557 399497681 400158539 398676071 398302689 399743576
528.5 399743576 398808632 396280899 393611794 393835793 395367584 396504478 397166710 396821175 397225800
$$ packed form
467.7D16992340l292694N14641M243660k138748m642144j083870K135544K700844k683182
476.4D12746391m705620J609269L305015j157264P74879k776489k696953J862297j257401
485.1D07704124j802368J146889M690895j799011k336121K273674p09800K38800L36876
493.8D09743958N7868j734809j085129J243095p4882j52092P16514J099739k069397
502.5D07744865m44831M21142O1989O47392j943969j99585j546021k921982j414528
511.1D00404472l95698K90794O81572K197724j198807l290482j047287N4741N66025
519.8C98263054L52402m24729o72416Q56246J123124O60858j482468l73382J440887
528.5C99743576r34944k527733k669105K23999J531791J136894O62232l45535M04625
$$ plain form
537.2 397225800 395445938 393782806 394270210 393692970 393691254 394607697 394390678 393958321 393499336 392464294
546.8 392464294 393555107 394529190 393370056 392145004 391963310 392340317 390808258 388855972 387866592
555.5 387866592 387801628 387499046 386870270 387472153 387593346 387868462 388334808 388339958 388192101 388916359
565.1 388916359 389717026 388644295 387394943 385816460 385420647 386587906 387612991 388289566 387728233
573.8 387728233 386126442 384802895 385256805 384772568 384101639 384838142 385191574 384251633 383257484
582.5 383257484 384802551 385910110 386015396 386538162 386810074 386857834 386848946 387806625 387032318 386451950
592.1 386451950 388477173 389893150 390418968 391063995 391327019 390323257 390613518 391107788 390472832
600.8 390472832 389290085 387514038 387024727 386754074 386581497 386272049 386281700 386347694 386419220 387293854
$$ packed form
537.2C97225800j779862j663132M87404n77240j716R16443k17019m32357m58985j035042
546.8C92464294J090813R74083j159134j225052j81694L77007j532059j952286r89380
555.5C87866592o4964l02582o28776O01883J21193K75116M66346N150j47857P24258
565.1C88916359Q00667j072731j249352j578483l95813J167259J025085O76575n61333
573.8C87728233j601791j323547M53910m84237o70929P36503L53432r39941r94149
582.5C83257484J545067J107559J05286N22766K71912M7760q888R57679p74307n80368
592.1C86451950K025223J415977N25818O45027K63024j003762K90261M94270o34956
600.8C90472832j182747j776047m89311k70653j72577l09448R651O5994P1526Q74634
$$ plain form
610.5 387293854 385860100 384957466 385584717 384956398 384168777 383602524 383535423 384843864 386744003
619.2 386744003 386987572 386705132 387270088 389134445 389837875 388390465 388602867 389609375 391279602
627.8 391279602 393051491 394081497 395191422 396280632 397801743 399255028 401034050 401415710 401715393
636.5 401715393 403152313 403687973 404881554 405909271 407454605 409901276 411406136 412491570 412966309
645.2 412966309 413316994 414130669 415150833 415501442 414974556 414251328 415095634 417603874 418718414
653.9 418718414 419372368 420466652 421162529 420769157 419388123 418091469 417158127 418012581 418693504
662.5 418693504 419068604 420001488 421016235 423026047 423320694 421650429 423574982 423225937 422153511
671.2 422153511 421128044 421038475 422151909 424559975 426157875 426761780 428869324 430649071 431305618
$$ packed form
610.5C87293854j433754r02634O27251o28319p87621n66253o7101J308441J900139
619.2C86744003K43569k82440N64956J864357P03430j447410K12402J006508J670227
627.8C91279602J771889J030006J109925J089210J521111J453285J779022L81660K99683
636.5D01715393J436920N35660J193581J027717J545334K446671J504860J085434M74739
645.2D12966309L50685Q13675J020164L50609n26886p23228Q44306K508240J114540
653.9D18718414O53954J094284O95877l93372j381034j296654r33342Q54454O80923
662.5D18693504L75100R32884J014747K009812K94647j670265J924553l49045j072426
671.2D22153511j025467q9569J113434K408066J597900O03905K107544J779747O56547
$$ plain form
679.9 431305618 431429291 432880096 434880791 434512901 434242783 435240860 436570702 437750015 438821831
688.6 438821831 440524216 442295532 442985191 442464294 442124329 441943512 441939621 442763557 444119606 444658699
698.2 444658699 443941460 444574928 447077103 449079285 449499245 449971733 451076508 451395912 451316338
706.9 451316338 450944710 450667114 451220398 452932663 454946251 455854568 457017250 458472176 459165955
715.6 459165955 459519157 459354897 458821983 459137383 459902802 460111427 460442009 461541519 463668556
724.3 463668556 465383873 466375809 467671432 468875732 470081215 470553665 470387650 470074730 470029755
733 470029755 471197815 473061905 474712601 475730133 477069321 478053017 477936249 477728958 476748505
741.6 476748505 475959473 476982117 477626114 476852150 477213478 479711304 482575760 483279190 483325119
$$ packed form
679.9D31305618J23673J450805K000695l67890k70118R98077J329842J179313J071816
688.6D38821831J702385J771316O89659n20897l39965j80817l891Q23936J356049N39093
698.2D44658699p17239O33468K502175K002182M19960M72488J104775L19404p9574
706.9D51316338l71628k77596N53284J712265K013588R08317J162682J454926O93779
715.6D59165955L53202j64260n32914L15400P65419K08625L30582J099510K127037
724.3D63668556J715317R91936J295623J204300J205483M72450j66015l12920m4975
733D70029755J168060J864090J650696J017532J339188R83696j16768k07291r80453
741.6D76748505p89032J022644O43997p73964L61328K497826K864456P03430M5929
$$ plain form
750.3 483325119 484488029 485419044 485798759 484542503 483610916 484230499 485470009 487575607 489055862
759 489055862 490678749 492544098 494424286 495479088 495028305 494791336 494241180 493869667 493680000
767.7 493680000 494393768 495455780 495672989 496020317 495690613 496490479 498059235 498202286 497708664
776.4 497708664 497226944 496434860 495961227 496731606 496915398 497245178 498421516 499295311 499876595 500302658
786 500302658 500781975 500562515 500380974 500485268 500128708 499307518 499345245 500353470 501605377 502275581
795.6 502275581 500981560 500686188 500205345 498384018 497176361 495418015 493723450 492233620 491572609
804.3 491572609 490199928 488088341 487435951 487154808 486762657 485325890 483456192 481971207 480112228
813 480112228 477571907 475567474 474077034 473026505 473423920 473204803 472978516 473949852 475737343
$$ packed form
750.3D83325119J162910R31015L79715j256256r31587O19583J239510K105598J480255
759D89055862J622887J865349J880188J054802m50783k36969n50156l71513j89667
767.7D93680000P13768J062012K17209L47328l29704P99866J568756J43051m93622
776.4D97708664m81720p92084m73633P70379J83792L29780J176338Q73795N81284M26063
786E00302658M79317k19460j81541J04294l56560q21190L7727J008225J251907O70204
795.6E02275581j294021k95372m80843j821327j207657j758346j694565j489830o61011
804.3D91572609j372681k111587o52390k81143l92151j436767j869698j484985j858979
813D80112228k540321k004433j490440j050529L97415k19117k26287R71336J787491
$$ plain form
821.7 475737343 476870461 476336212 476168900 476215553 477499352 479692612 481995621 484761086 487623405
830.4 487623405 491143227 494196281 497513847 499531403 500606461 502273521 503481216 505295563
838.1 505295563 506060028 508083687 511534882 513566628 514908791 517278137 520856972 522315369 523303833
846.8 523303833 524294701 524998970 525041809 524483719 525659828 527356834 530048065 531977730 534048424
855.4 534048424 537303429 539678879 541766548 542565346 542841339 543263206 544089737 544000282 544175491
864.1 544175491 545507317 546521950 548069916 548633842 548281212 546256065 544219246 542514572 539754677
872.8 539754677 537261238 534830894 533990860 533088531 532918396 533971786 535077744 536185684 535273209
881.5 535273209 534053841 532069511 530158958 528494644 526853905 526132317 525402870 526129608 526294403
$$ packed form
821.7D75737343J133118n34249j67312M6653J283799K193260K303009K765465K862319
830.4D87623405L519822L053054L317566K017556J075058J667060J207695J814347
838.1E05295563P64465K023659L451195K031746J342163K369346L578835J458397R88464
846.8E23303833R90868P04269M2839n58090J176109J697006K691231J929665K070694
855.4E34048424L255005K375450K087669P98798K75993M21867Q26531q9455J75209
864.1E44175491J331826J014633J547966N63926l52630k025147k036819j704674k759895
872.8E39754677k493439k430344q40034r02329j70135J053390J105958J107940r12475
881.5E35273209j219368j984330j910553j664314j640739p21588p29447P26738J64795
$$ plain form
890.2 526294403 526064568 526701164 527029343 526677094 526083336 525492897 523618546 522787895 522644539 522419739
899.8 522419739 522930641 523504219 524298401 525064697 526356163 527359734 528398933 528989639 529094696
908.5 529094696 529378357 529378777 530240669 530792885 531351585 531344986 530744743 529850883 528126984 526466103
918.1 526466103 523262291 519559364 515947533 513075562 510786934 508190193 506055450 504008369
925.8 504008369 502912102 500948906 497848244 494772263 491502571 488284492 485065727 483317032
933.6 483317032 482435188 481897621 481729393 481633835 481735115 481646500 481669693 480885773 479224396 476939812
943.2 476939812 475020180 474130554 473443947 473214951 473591003 474342728 474211426 473737335 473177643 471833076
952.8 471833076 470352783 468106003 465429955 462911987 460806160 458849907 456924515 455242958
$$ packed form
890.2E26294403k29835O36596L28179l52249n93758n90439j874351q30651j43356k24800
899.8E22419739N10902N73578P94182P66296J291466J003571J039199N90706J05057
908.5E29094696K83661M20Q61892N52216N58700o599o00243q93860j723899j660881
918.1E26466103l203812l702927l611831k871971k288628k596741k134743k047081
925.8E04008369j096267j963196l100662l075981l269692l218079l218765j748695
933.6D83317032q81844n37567j68228r5558J01280q8615K3193p83920j661377k284584
943.2D76939812j919632q89626o86607k28996L76052P51725j31302m74091n59692j344567
952.8D71833076j480293k246780k676048k517968k105827j956253j925392j681557
$$ plain form
960.6 455242958 453709183 452618370 451223412 449282875 447127380 444921875 442265205 439631882
968.3 439631882 437823639 436008797 434501381 433137321 431394119 429453087 427291183 425054169
976 425054169 422429428 419446030 415590973 411121292 407328415 403910332 400403099 396701355 392769356
984.7 392769356 388673401 384005890 379735641 375835686 371621513 367290573 362675781 358519287
992.4 358519287 354360886 350645523 347564659 344679527 341737099 338811913 336678276 333482475
1000.1 333482475 330459709 327853737 325003586 322742767 321042709 320339851 318779755 317345924
1007.8 317345924 315975609 314519310 313291988 311695423 310462456 308198967 306297417 304539452
1015.5 304539452 302535858 300337086 297650948 295293159 293090572 292084751 290127945 288677902
$$ packed form
960.6D55242958j533775j090813j394958j940537k155495k205505k656670k633323
968.3D39631882j808243j814842j507416j364060j743202j941032k161904k237014
976D25054169k624741k983398l855057m469681l792877l418083l507233l701744l931999
984.7C92769356m095955m667511m270249l899955m214173m330940m614792m156494
992.4C58519287m158401l715363l080864k885132k942428k925186k133637l195801
1000.1C33482475l022766k605972k850151k260819j700058p02858j560096j433831
1007.8C17345924j370315j456299j227322j596565j232967k263489j901550j757965
1015.5C04539452k003594k198772k686138k357789k202587j005821j956806j450043
$$ plain form
1023.2 288677902 287483788 285094757 283190575 281268845 280314140 278564701 277066841 275545483
1031 275545483 274157162 273721924 272303791 271831856 271631241 272677021 273636246 274024734 274489784
1039.6 274489784 274747849 276674232 277410336 277005310 276542912 277279396 278442364 278535690 277949181
1048.3 277949181 276537132 275977707 275078602 274635124 273620167 273035889 272840767 270568504 270074825
1057 270074825 270731144 272038155 272276745 272444878 273766308 275240936 277375469 278366470 280382977
1065.7 280382977 281926422 283738976 285186806 285615005 287557526 288537502 289491119 289100628 289126015
1074.4 289126015 289873714 289898949 291110058 291666279 291629562 291466427 292767849 293629532 294640369
1083 294640369 296412907 297691174 300349445 301732349 303033295 304172535 305392399 307277718 308124275
$$ packed form
1023.2B88677902j194114k389031j904182j921730r54705j749439j497860j521358
1031B75545483j388321m35238j418133m71935k00615J045780R59225L88488M65050
1039.6B74489784K58065J926383P36104m05026m62398P36484J162968R3326n86509
1048.3B77949181j412049n59425q99105m43478j014957n84278j95122k272263m93679
1057B70074825O56319J307011K38590J68133J321430J474628K134533R91001K016507
1065.7B80382977J543445J812554J447830M28199J942521R79976R53617l90491K5387
1074.4B89126015P47699K5235J211109N56221l6717j63135J301422Q61683J010837
1083B94640369J772538J278267K658271J382904J300946J139240J219864J885319Q46557
$$ plain form
1091.7 308124275 309448948 311291008 313624496 315176926 317083817 318603039 319393311 320614891
1099.4 320614891 321536674 323647385 325170174 326322060 326785889 327648506 330177040 331416664 332462349
1108.1 332462349 333382988 334245453 334660149 335077858 336318321 336666603 336885529 337824326 339276733
1116.8 339276733 340196648 340791245 340782204 340702934 340747643 340414124 341334190 341905479 341839371 341267471
1126.4 341267471 341232719 342638397 344036674 345828247 347144165 349104843 351363449 353143234 355105400
1135.1 355105400 356373062 357080956 357864647 359754143 361677208 363345680 364951401 366177711 367521629
1143.8 367521629 368755379 369956741 370382500 370914688 371111221 369766846 369350471 369810600 369962387
1152.5 369962387 370346031 370406113 369877892 369976082 370082207 369477348 368722343 367603760 366263847 365056229
$$ packed form
1091.7C08124275J324673J842060K333488J552430J906891J519222P90272J221580
1099.4C20614891R21783K110711J522789J151886M63829Q62617K528534J239624J045685
1108.1C32462349R20639Q62465M14696M17709J240463L48282K18926R38797J452407
1116.8C39276733R19915N94597r041p9270M4709l33519R20066N71289o6108n71900
1126.4C41267471l4752J405678J398277J791573J315918J960678K258606J779785J962166
1135.1C55105400J267662P07894P83691J889496J923065J668472J605721J226310J343918
1143.8C67521629J233750J201362M25759N32188J96533j344375m16375M60129J51787
1152.5C69962387L83644O0082n28221R8190J06125o04859p55005j118583j339913j207618
$$ plain form
1162.1 365056229 364956665 365535049 366446419 368179474 370103683 371779633 373104401 375084496 377066002
1170.8 377066002 379201813 381418915 383216209 385551147 388146133 391191750 394491920 397950096
1178.5 397950096 400630455 403270683 406610718 408620071 409945374 411084862 411519966 411976585 413216286
1187.2 413216286 415311852 417274399 418686714 419897957 420583382 420588150 420186577 418895378 417174072
1195.9 417174072 416164513 415188751 413893394 413120537 412707214 412816620 413015366 412738304 411928825
1204.5 411928825 410157890 408395882 407049294 405876122 404804382 403873329 403623505 403530731 403502846
1213.2 403502846 403717041 403690338 403752251 403401833 402224007 400687294 399317436 398505440 397637291
1221.9 397637291 397083855 397106972 396945763 396822968 396676979 396603508 396299629 395196152 393560448 392106857
$$ packed form
1162.1C65056229r9564N78384R11370J733055J924209J675950J324768J980095J981506
1170.8C77066002K135811K217102J797294K334938K594986L045617L300170L458176
1178.5C97950096K680359K640228L340035K009353J325303J139488M35104M56619J239701
1187.2D13216286K095566J962547J412315J211243O85425M768m01573j291199j721306
1195.9D17174072j009559r75762j295357p72857m13323J09406J98746k77062q09479
1204.5D11928825j770935j762008j346588j173172j071740r31053k49824r2774k7885
1213.2D03502846K14195k6703O1913l50418j177826j536713j369858q11996q68149
1221.9C97637291n53436K3117j61209j22795j45989p3471l03879j103477j635704j453591
$$ plain form
1231.5 392106857 390962334 389564819 389017754 389098053 389082756 389973106 390856476 390915184 390794182 390289536
1241.2 390289536 389360809 388409691 387248306 386452065 386106987 385833282 385831070 385994530 386695442 386934738
1250.8 386934738 386818428 386868935 386235275 385373459 384471626 383990707 383910446 383992081 384338837 385243645
1260.5 385243645 386871910 387921982 388408852 388711052 389097672 389350166 389459534 389870491 390269279
1269.2 390269279 391075745 392520752 394637566 396712685 398347359 399714546 400919456 402000389
1276.9 402000389 402824783 403504257 404094086 405049438 406094093 407681007 410077553 412336311 414432526
1285.5 414432526 416624069 418668060 419772530 420470123 420656013 420702972 421195183 421815567 423046341
1294.2 423046341 424856415 426902161 428651886 430248184 431166191 431322098 431135635 430458412 429961929
$$ packed form
1231.5C92106857j144523j397515n47065Q0299j5297Q90350Q83370N8708j21002n04646
1241.2C90289536r28727r51118j161385p96241l45078k73705k212J63460P00912K39296
1250.8C86934738j16310N0507o33660q61816r01833m80919q0261Q1635L46756R04808
1260.5C85243645J628265J050072M86870L02200L86620K52494J09368M10957L98788
1269.2C90269279Q06466J445007K116814K075119J634674J367187J204910J080933
1276.9D02000389Q24394O79474N89829R55352J044655J586914K396546K258758K096215
1285.5D14432526K191543K043991J104470O97593J85890M6959M92211O20384J230774
1294.2D23046341J810074K045746J749725J596298R18007J55907j86463o77223m96483
$$ plain form
1302.9 429961929 429469070 429296837 429485512 429765701 430353432 431352081 432562027 433036652 432692146
1311.6 432692146 431430931 429981689 428805161 427891502 427506981 427623596 428235626 429267769 431389885
1320.3 431389885 433359184 434380989 435176239 435548744 435130272 434341316 434402122 434352036 434140549 434256248
1329.9 434256248 434353256 435053902 435530815 435587387 435384712 434943962 434336586 433341331 431986465 431261978
1339.6 431261978 431598511 432269897 433707237 434880638 435795403 436945992 437830849 438628082 438311348
1348.2 438311348 437715950 437101669 436529312 436100197 435692177 435839996 436232300 437199974 437599716 437626495
1357.9 437626495 437294502 436210861 434975090 433529510 432131310 430338669 430508270 431159286 431306915
1366.6 431306915 431511917 431317444 431226158 430863991 430269508 429472733 428542976 427334061 426466522 426842308
$$ packed form
1302.9D29961929m92859j72233J88675K80189N87731R98649J209946M74625l44506
1311.6D32692146j261215j449242j176528r13659l84521J16615O12030J032143K122116
1320.3D31389885J969299J021805P95250L72505m18472p88956O0806n0086k11487J15699
1329.9D34256248R7008P00646M76913N6572k02675m40750o07376r95255j354866p24487
1339.6D31261978L36533O71386J437340J173401R14765J150589Q84857P97233l16734
1348.2D38311348n95398o14281n72357m29115m08020J47819L92304R67674L99742K6779
1357.9D37626495l31993j083641j235771j445580j398200j792641J69601O51016J47629
1366.6D31306915K05002j94473r1286l62167n94483p96775r29757j208915q67539L75786
$$ plain form
1376.2 426842308 427250519 428004837 428418999 428891869 429317322 428826027 428011360 426319618 424585457
1384.9 424585457 422897034 421085777 418963318 418571129 418802681 418074608 417312622 416255684 415347786
1393.6 415347786 413117218 409759064 407972450 405994797 404389038 401208496 399052734 398446083
1401.3 398446083 397227821 396317558 395414505 393389587 391391945 390096207 388082657 385803375 383930473
1409.9 383930473 382261772 380954742 379718475 379033203 378881836 378946114 378829079 378075409 377692642
1418.6 377692642 375719643 375921059 376780205 376587067 376555519 375713615 376626930 378230362 379245872
1427.3 379245872 380857620 382070045 382646942 383103638 384171715 384959984 385898209 387075996 387602272
1436 387602272 387801704 388858337 391554337 393465881 395182648 397128601 398094292 399015160 399058762
$$ packed form
1376.2D26842308M08211P54318M14162M72870M25453m91295q14667j691742j734161
1384.9D24585457j688423j811257k122459l92189K31552p28073p61986j056938r07898
1393.6D15347786k230568l358154j786614j977653j605759l180542k155762o06651
1401.3C98446083j218262r10263r03053k024918j997642j295738k013550k279282j872902
1409.9C83930473j668701j307030j236267o85272j51367O4278j17035p53670l82767
1418.6C77692642j972999K01416Q59146j93138l1548q41904R13315J603432J015510
1427.3C79245872J611748J212425N76897M56696J068077P88269R38225J177787N26276
1436C87602272J99432J056633K696000J911544J716767J945953R65691R20868M3602
$$ plain form
1444.7 399058762 399387245 399614029 399579468 399864120 401449432 403415642 404496765 406350098 407483482
1453.3 407483482 408780479 409481354 409840126 411177864 409891014 412562561 414484062 417135506 419047585
1462 419047585 420879173 423403549 424069443 426995506 429009171 430972099 432664642 434080544 436364632
1470.7 436364632 437567596 439319191 442046852 446738129 450496864 453424721 456541557 459216881
1478.4 459216881 461376610 462693062 463796806 465219650 466886520 468347397 469986610 472283707
1486.1 472283707 473849182 474384460 475659370 475296402 474975395 475520935 475146408 473845329 472173805
1494.8 472173805 470409317 465587883 466125374 465930977 463901405 464243507 463249626 461777115 460358353
1503.5 460358353 459674149 457886658 449300461 444414520 447467918 450788994 450465622 450998116 450896263
$$ packed form
1444.7C99058762L28483K26784l4561K84652J585312J966210J081123J853333J133384
1453.3D07483482J296997P00875L58772J337738j286850K671547J921501K651444J912079
1462D19047585J831588K524376O65894K926063K013665J962928J692543J415902K284088
1470.7D36364632J202964J751595K727661M691277L758735K927857L116836K675324
1478.4D59216881K159729J316452J103744J422844J666870J460877J639213K297097
1486.1D72283707J565475N35278J274910l62968l21007N45540l74527j301079j671524
1494.8D72173805j764488m821434N37491j94397k029572L42102r93881j472511j418762
1503.5D60358353o84204j787491q586197m885941L053398L321076l23372N32494j01853
$$ plain form
1512.2 450896263 450036850 449692650 447532883 445865669 442608681 440258713 441875038 442980080 441093102
1520.8 441093102 438929214 441863899 443827515 445548134 445889053 446829567 447113419 446849174 447930298
1529.5 447930298 448177490 448588867 449331245 448875847 448140602 450612411 452654953 453618851 454342957
1538.2 454342957 448546677 445285759 449110832 450519218 451745415 453604355 454894867 455483360
1545.9 455483360 458015633 459661713 460870476 460852814 460782852 462144279 462229271 462596397 459887314
1554.6 459887314 460875053 463598785 464580765 461555786 452756310 459307137 461115456 462017059 461274796
1563.3 461274796 459658966 456526337 454064484 453851089 452554283 450935326 444812431 444575806 444250870
1572 444250870 441934319 439371223 435846367 432829247 422392311 421710434 419323044 415606613 412495346
$$ packed form
1512.2D50896263q59413l44200k159767j667214l256988k349968J616325J105042j886978
1520.8D41093102k163888K934685J963616J720619L40919R40514K83852k64245J081124
1529.5D47930298K47192M11377P42378m55398p35245K471809K042542R63898P24106
1538.2D54342957n796280l260918L825073J408386J226197J858940J290512N88493
1545.9D55483360K532273J646080J208763j7662o9962J361427Q4992L67126k709083
1554.6D59887314R87739K723732R81980l024979q799476O550827J808319R01603p42263
1563.3D61274796j615830l132629k461853k13395j296806j618957o122895k36625l24936
1572D44250870k316551k563096l524856l017120j0436936o81877k387390l716431l111267
$$ plain form
1580.6 412495346 408293991 405602074 400947418 398046684 393518372 388799057 384250793 379102936
1588.4 379102936 375683556 369941139 366510277 361638374 358742180 355414047 351058846 348526917
1596.1 348526917 343792000 341318359 336480598 333372345 329356613 325713844 323627472 319788914
1603.8 319788914 318563137 315144939 314240551 311465378 309711933 308649387 305795288 305279942 302013588
1612.5 302013588 301356125 299188862 299215546 298816071 293854561 296010609 294993687 296220093 295086536
1621.1 295086536 295742588 294792309 292070618 293805771 293423176 295026417 293142681 294387360 295222092
1629.8 295222092 295897655 297004471 296897602 299206696 298769951 299061508 298342724 300935898 302436428
1638.5 302436428 303325920 305481606 305499020 307953835 308671246 311016064 312510109 311495705 314013004
$$ packed form
1580.6D12495346m201355k691917m654656k900734m528312m719315m548264n147857
1588.4C79102936l419380n742417l430862m871903k896194l328133m355201k531929
1596.1C48526917m734917k473641m837761l108253m015732l642769k086372l838558
1603.8C19788914j225777l418198r04388k775173j753445j062546k854099n15346l266354
1612.5C02013588o57463k167263K6684l99475m961510K156048j016922J226406j133557
1621.1B95086536O56052r50279k721691J735153l82595J603241j883736J244679Q34732
1629.8B95222092O75563J106816j06869K309094m36745K91557p18784K593174J500530
1638.5C02436428Q89492K155686J7414K454815P17411K344818J494045j014404K517299
$$ plain form
1647.2 314013004 313475704 316876202 316976528 319019203 320596581 317730236 319837360 320402489 324724350
1655.9 324724350 326230850 328751640 329809608 331774788 333736877 334442253 336301498 336382980 340422440
1664.5 340422440 342906456 345993729 349182625 352330589 356505356 357033005 361181450 363400345
1672.3 363400345 367446251 370622025 372355270 375739288 379284248 384314499 387488708 392075577
1680 392075577 395638313 399877968 404525719 404932251 409095535 412841339 419177055 422765121 426525879
1688.6 426525879 431800117 436110001 441735573 446826630 452057838 456523247 460958443 462896271
1696.4 462896271 467902908 473669815 478124199 480829544 482526970 490509453 496248283 500665855
1704.1 500665855 505171013 509085884 512024345 514894638 518061447 519600029 521218376 523721886
$$ packed form
1647.2C14013004n37300L400498J00326K042675J577378k866345K107124N65129M321861
1655.9C24724350J506500K520790J057968J965180J962089P05376J859245Q1482M039460
1664.5C40422440K484016L087273L188896L147964M174767N27649M148445K218895
1672.3C63400345M045906L175774J733245L384018L544960N030251L174209M586869
1680C92075577L562736M239655M647751M06532M163284L745804O335716L588066L760758
1688.6D26525879N274238M309884N625572N091057N231208M465409M435196J937828
1696.4D62896271N006637N766907M454384K705345J697426P982483N738830M417572
1704.1E00665855M505158L914871K938461K870293L166809J538582J618347K503510
$$ plain form
1711.8 523721886 526450424 529657516 531353874 533307915 537088318 538926544 536773758 540395508
1719.5 540395508 543486061 544768410 545550804 545938187 546606827 548699722 551366882 553789902 556267433
1728.2 556267433 558450394 558546295 559366684 562334747 563845215 559854698 556443253 561992455 566843033
1736.9 566843033 569774323 573159180 574747276 576020393 580826645 583770065 584597054 585912018
1744.6 585912018 588500557 590593452 592795105 595888329 598450928 604007568 607359810 610794373
1752.3 610794373 616631927 619582291 622119751 624262695 623818283 626055489 629488373 632472229
1760 632472229 635793877 636091003 637842102 642821350 645727463 647822876 649803085 650480499 648296127
1768.7 648296127 649823685 652683792 652085800 650603943 650870285 656592789 660947342 661965866 664512787
$$ packed form
1711.8E23721886K728538L207092J696358J954041L780403J838226k152786L621750
1719.5E40395508L090553J282349P82394L87383O68640K092895K667160K423020K477531
1728.2E56267433K182961R5901Q20389K968063J510468l990517l411445N549202M850578
1736.9E66843033K931290L384857J588096J273117M806252K943420Q26989J314964
1744.6E85912018K588539K092895K201653L093224K562599N556640L352242L434563
1752.3F10794373N837554K950364K537460K142944m44412K237206L432884K983856
1760F32472229L321648K97126J751099M979248K906113K095413J980209O77414k184372
1768.7F48296127J527558K860107n97992j481857K66342N722504M354553J018524K546921
$$ plain form
1777.4 664512787 665565567 666563797 665946960 663937912 664520721 665950546 667476807 667629700 669434662
1786 669434662 672477036 674616241 675745010 677173996 677215500 676223068 673448868 672928467 676513367
1794.7 676513367 677455368 677863998 680328140 683200989 684836197 685060349 687520142 687212753 687018585
1803.4 687018585 687463837 686785736 687085495 687359924 688294830 689997635 692553406 693365021 695057144
1812.1 695057144 696904297 696875992 697125320 695929565 695177689 693889465 694139557 695807190 696919556
1820.8 696919556 698938141 700037613 702243652 703816452 702630692 702484131 702964249 703411484 701918335
1829.4 701918335 698271103 699299393 702474823 704092560 705809174 707655945 708903122 709662399
1837.2 709662399 708828125 709101944 708017654 707126312 706415100 706952438 707944107 704258194 707947235
$$ packed form
1777.4F64512787J052780R98230o16837k009048N82809J429825J526261J52893J804962
1786F69434662L042374K139205J128769J428986M1504r92432k774200n20401L584900
1794.7F76513367R42001M08630K464142K872849J635208K24152K459793l07389j94168
1803.4F87018585M45252o78101K99759K74429R34906J702805K555771Q11615J692123
1812.1F95057144J847153k8305K49328j195755p51876j288224K50092J667633J112366
1820.8F96919556K018585J099472K206039J572800j185760j46561M80118M47235j493149
1829.4G01918335l647232J028290L175430J617737J716614J846771J247177P59277
1837.2G09662399q34274K73819j084290q91342p11212N37338R91669l685913L689041
$$ plain form
1845.8 707947235 711432648 712503281 712956772 713109512 713261032 711940002 711449738 710751266 710878601
1854.5 710878601 711293335 711725311 713286896 714487305 716329498 717476044 718013992 717111206 716186676
1863.2 716186676 715504150 714380951 714270630 713562851 714616394 714815445 715377731 718068466 719785233
1871.9 719785233 720607758 720012817 719560013 718409576 717391891 716566238 716134186 717019653 717874832
1880.6 717874832 719435120 720641785 722084656 722687149 722596054 722357254 721060715 720712814 719053955
1889.2 719053955 716955109 717542953 719112549 720499115 722228546 723551941 723539352 724388733 723897858
1897.9 723897858 723340454 722476349 721174011 720504227 719924850 721088791 721875076 723266296 724846039
1906.6 724846039 725801315 726128769 725400543 724842987 723529434 723161087 722153091 721540985 721693344
$$ packed form
1845.8G07947235L485413J070633M53491J52740J51520j321030m90264o98472J27335
1854.5G10878601M14734M31976J561585J200409J842193J146546N37948r02786r24530
1863.2G16186676o82526j123199j10321p07779J053543J99051N62286K690735J716767
1871.9G19785233Q22525n94941m52804j150437j017685q25653m32052Q85467Q55179
1880.6G17874832J560288J206665J442871O02493r1095k38800j296539l47901j658859
1889.2G19053955k098846N87844J569596J386566J729431J323395j2589Q49381m90875
1897.9G23897858n57404q64105j302338o69784n79377J163941P86285J391220J579743
1906.6G24846039R55276L27454p28226n57556j313553l68347j007996o12106J52359
$$ plain form
1915.3 721693344 722297592 724487381 724418106 725288391 726949692 727411423 726627960 723995056 722787247
1923.9 722787247 722680435 722700958 722336349 723069229 724125748 725344162 727001724 727353134 727597504
1932.6 727597504 726923904 726158218 724739456 723475876 723102341 722780914 723599396 723979340 725474548
1941.3 725474548 726375351 726189117 727512970 727640076 726406860 724737320 723960724 723148422 722406845
1950 722406845 722274551 722715454 724141769 725315323 726455154 726903915 727079468 726358948 725069427
1958.7 725069427 723941727 722575989 722106094 721844788 722466507 723427277 724750443 726162033 726512299
1967.3 726512299 726582794 725962906 725147400 723730164 722759781 722159271 721664734 722116928 722818298 724225464
1977 724225464 725202103 725959167 726193466 725996094 725504913 724021835 722632217 721351166 721068115
$$ packed form
1915.3G21693344O04248K189789o9275Q70285J661301M61731p83463k632904j207809
1923.9G22787247j06812K0523l64609P32880J056519J218414J657562L51410K44370
1932.6G27597504o73600p65686j418762j263580l73535l21427Q18482L79944J495208
1941.3G25474548R00803j86234J323853J27106j233216j669540p76596q12302p41577
1950G22406845j32294M40903J426315J173554J139831M48761J75553p20520j289521
1958.7G25069427j127700j365738m69895k61306O21719R60770J323166J411590L50266
1967.3G26512299P0495o19888q15506j417236r70383o00510m94537M52194P01370J407166
1977G24225464R76639P57064K34299j97372m91181j483078j389618j281051k83051
$$ plain form
1985.7 721068115 720974579 721637039 723071823 724030991 725423584 725889511 725230026 724408035 723882751
1994.3 723882751 722468033 721024246 720414886 719897766 720628433 721596298 723071518 724097061 724649277
2003 724649277 725059204 723988800 722822266 721438141 720413742 719272232 718610687 718933258 719665985
2011.7 719665985 721286545 722354507 723246994 723202515 722504272 721314316 719834747 719000397 717994308
2020.4 717994308 717414474 717065887 717953110 719138412 720266495 721600189 721658783 721497345 720523529
2029.1 720523529 719247894 717632065 716271744 715705872 715473175 716051712 716567841 717974548 719143219
2037.7 719143219 719909515 720096588 719044113 718080597 716884766 715708389 714106140 713635864 714024887
2046.4 714024887 714859543 716373367 717235794 718114166 718079300 717952576 717216721 715677032 714325256
$$ packed form
1985.7G21068115r3536O62460J434784R59168J392593M65927o59485q21991n25284
1994.3G23882751j414718j443787o09360n17120P30667R67865J475220J025543N52216
2003G24649277M09927j070404j166534j384125j024399j141510o61545L22571P32727
2011.7G19665985J620560J067962Q92487m4479o98243j189956j479569q34350j006089
2020.4G17994308n79834l48587Q87223J185302J128083J333694N8594j61438r73816
2029.1G20523529j275635j615829j360321n65872k32697N78537N16129J406707J168671
2037.7G19143219P66296J87073j052475r63516j195831j176377j602249m70276L89023
2046.4G14024887Q34656J513824Q62427Q78372l4866j26724p35855j539689j351776
$$ plain form
2055.1 714325256 713364868 713486099 713086700 713576202 714725952 715934601 716796951 716875839 717159500
2063.8 717159500 716139221 715077362 713901443 712857208 712250824 711849899 712662964 713565445 714942627
2072.5 714942627 715995331 716492233 716071930 715163727 714356613 713050766 712359695 711443863 711291351
2081.1 711291351 711694260 712481155 713689728 714364700 715386124 715425186 714723434 713449631 712348557
2089.8 712348557 711295090 710126114 709970474 710038757 711019897 711725616 712613831 713430405 713373032 713218842
2099.5 713218842 711980820 710915985 709742126 709011536 708618240 708416901 709033585 709688873 711175308
2108.1 711175308 712021332 712186584 711826324 711088181 710295486 708893967 707798538 707026596 707179565
2116.8 707179565 707512817 708617477 710095520 710439682 710612793 710408936 710123749 709260101 708282089
$$ packed form
2055.1G14325256r60388J21231l99399M89502J149750J208649Q62350P8888K83661
2063.8G17159500j020279j061859j175919j044235o06384m00925Q13065R02481J377182
2072.5G14942627J052704M96902m20303r08203q07114j305847o91071r15832j52512
2081.1G11291351M02909P86895J208573O74972J021424L9062p01752j273803j101074
2089.8G12348557j053467j168976j55640O8283R81140P05719Q88215Q16574n7373j54190
2099.5G13218842j238022j064835j173859p30590l93296k01339O16684O55288J486435
2108.1G11175308Q46024J65252l60260p38143p92695j401519j095429p71942J52969
2116.8G07179565L33252J104660J478043L44162J73111k03857k85187q63648r78012
$$ plain form
2125.5 708282089 707263641 706442413 706313782 706333542 707141647 707947998 708964386 709580994 709781876
2134.2 709781876 709790192 708921585 707960510 706914902 706544647 706290131 706371460 706761551 707446518 708814774
2143.8 708814774 709673767 710099487 709533005 709188461 708635101 707520370 706640930 705860748 706256866
2152.5 706256866 706880493 707917786 708411942 708778534 709545441 709629059 709765167 709016953 708373795 707549744
2162.1 707549744 706908112 706887741 707094193 708046188 708621140 709707870 710062714 709980392 709902191 709478149
2171.8 709478149 709264679 707996979 707263947 706694641 706709442 707532120 708485565 709821091 710217819
2180.5 710217819 710389252 709981003 709758606 709586868 708937912 708487015 708099823 708393784 708468781 708919144
2190.1 708919144 709513092 710089264 710445557 710239944 710526352 710293427 709689941 708777695 708482437 708574753
$$ packed form
2125.5G08282089j018448q21228j28631J9760Q08105Q06351J016388O16608K00882
2134.2G09781876Q316q68607r61075j045608l70255k54516Q1329L90091O84967J368256
2143.8G08814774Q58993M25720n66482l44544n53360j114731q79440p80182L96118
2152.5G06256866O23627J037293M94156L66592P66907Q3618J36108p48214o43158q24051
2162.1G07549744o41632k0371K06452R51995N74952J086730L54844q2322p8201m24042
2171.8G09478149k13470j267700p33032n69306J4801Q22678R53445J335526L96728
2180.5G10217819J71433m08249k22397j71738o48956m50897l87192K93961P4997M50363
2190.1G08919144N93948N76172L56293k05613K86408k32925o03486r12246k95258R2316
$$ plain form
2199.8 708574753 708660507 709404144 709828262 710565567 711087646 711370239 711291962 711077499 710859222 710030212
2209.4 710030212 709822159 709758224 709867935 709804993 710207901 711147766 711623993 712040558 711833954 711719589
2219 711719589 711096344 710317001 709826889 709621811 709909821 709831619 710151978 710382309 711057281 711602097
2228.7 711602097 711687012 711647491 711042938 710951691 710428314 710312347 710271530 710039291 710262299 710386734
2238.3 710386734 710953293 711255951 711785660 711959229 711927795 711524582 710695038 710567932 710056534 709854431
2248 709854431 709724960 710152740 710634460 710833054 711466446 711507263 711632996 711107635 710831451 710576553
2257.6 710576553 709971161 709857635 709865036 710460205 710394135 710643845 710872116 711231918 711814804 711342239
2267.3 711342239 711124191 710350037 710000381 709731979 709444580 709609146 709486694 710250320 710865860 711196213
$$ packed form
2199.8G08574753Q5754P43637M24118P37305N22079K82593p8277k14463k18277q29010
2209.4G10030212k08053o3935J09711o2942M02908R39865M76227M16565k06604j14365
2219G11719589o23245p79343m90112k05078K88010p8202L20359K30331O74972N44816
2228.7G11602097Q4915l9521o04553r1247n23377j15967m0817k32239K23008J24435
2238.3G10386734N66559L02658N29709J73569l1434m03213q29544j27106n11398k02103
2248G09854431j29471M27780M81720J98594O33392M0817J25733n25361k76184k54898
2257.6G10576553o05392j13526P401N95169o6070K49710K28271L59802N82886m72565
2267.3G11342239k18048p74154l49656k68402k87399J64566j22452P63626O15540L30353
$$ plain form
2276.9 711196213 711061935 711034470 711099091 710445862 709863358 709416580 709519882 709227295 709240799 709347382
2286.5 709347382 709497604 710333252 710451431 710298233 709846191 709781570 709496231 708946381 708531799 707833710
2296.2 707833710 707904816 707917480 708536148 709310150 709818497 710169067 709935226 709524155 708632736 708273010
2305.8 708273010 707565918 707402649 707819290 707586975 707554779 707301941 707776566 708087616 708394852 708520432
2315.5 708520432 707974167 707739487 707146225 706369019 705865784 706369019 706195831 706480255 707140350 707236633
2325.1 707236633 707750092 706977005 707119675 706940994 706390533 705596542 704250565 704172211 703921509 705416183
2334.8 705416183 705713348 705201340 706252670 707091217 706763229 704932709 704682999 704416199 703724747
2343.4 703724747 703590698 704035950 704229279 703713303 703666534 704347687 705515442 704951172 704733887 704984207
$$ packed form
2276.9G11196213j34278k7465O4621o53229n82504m46778J03302k92587J3504J06583
2286.5G09347382J50222Q35648J18179j53198m52042o4621k85339n49850m14582o98089
2296.2G07833710P1106J2664O18668P74002N08347L50570k33841m11071q91419l59726
2305.8G08273010p07092j63269M16641k32315l2196k52838M74625L11050L07236J25580
2315.5G08520432n46265k34680n93262p77206n03235N03235j73188K84424O60095R6283
2325.1G07236633N13459p73087J42670j78681n50461p93991j345977p8354k50702J494674
2334.8G05416183K97165n12008J051330Q38547l27988j830520k49710k66800o91452
2343.4G03724747j34049M45252J93329n15976m6769O81153J167755n64270k17285K50320
$$ plain form
2353.1 704984207 704918747 705061951 702739029 702667389 702625809 702960052 704410019 704950027 705343094 704241714
2362.7 704241714 704200516 702737274 701922226 701393509 699889603 699070511 698405609 698757172 699160690
2371.4 699160690 700176392 700604172 700712433 700676270 700143585 699150467 697785950 697299423 696430283
2380.1 696430283 696389999 696994858 697345657 698027115 698584900 699053192 698661728 698167267 696939087 695447693
2389.7 695447693 694711380 693972015 694063950 694036179 694209518 694789276 695435791 696068878 695976639 695407333
2399.4 695407333 694471359 693883514 692915268 692052383 691629410 691343918 691710739 692078705 692771835 693275146
2409 693275146 693342590 692696533 691826706 691025238 689885788 688955994 687856598 687746506 687972412 688446579
2418.7 688446579 689449615 689836807 690106735 689618607 688842010 687703552 686474915 685458221 684564743
$$ packed form
2353.1G04984207o5460J43204k322922p1640m1580L34243J449967N40008L93067j101380
2362.7G04241714m1198j463242q15048n28717j503906q19092o64902L51563M03518
2371.4F99160690J015702M27780J08261l6163n32685r93118j364517m86527q69140
2380.1F96430283m0284O04859L50799O81458N57785M68292l91464m94461j228180j491394
2389.7F95447693p36313p39365R1935k7771J73339N79758O46515O33087r2239n69306
2399.4F95407333r35974n87845r68246q62885m22973k85492L66821L67966O93130N03311
2409F93275146O7444o46057q69827q01468j139450r29794j099396j10092K25906M74167
2418.7F88446579J003036L87192K69928m88128p76597j138458j228637j016694q93478
$$ plain form
2427.3 684564743 684326706 684047623 684662628 685598602 686112747 686195831 685952530 685696487 684889908 683834305
2437 683834305 682356796 681359634 680922318 681106644 681385345 681146088 681756973 682427902 682531433 681690598
2446.6 681690598 680894394 679940643 678283310 677369461 676792374 676915436 677215118 677664566 677921677
2455.3 677921677 678007812 678449249 677859421 677015991 675958405 675003433 673741302 672507172 672351608
2464 672351608 672195740 672638016 673032684 673541031 673997269 673866577 673499985 672338791 670960007 669373932
2473.6 669373932 668181686 667623978 667910309 668347702 668479919 669025040 669243774 669382706 668776321
2482.3 668776321 667838364 666664963 665134277 664151001 663288040 662980347 662607574 662682571 663252945
2491 663252945 663905258 664440536 663971481 663182373 661749420 660464859 659246063 658238297 657936707
$$ packed form
2427.3F84564743k38037k79083O15005R35974N14145Q3084k43301k56043q06579j055603
2437F83834305j477509r97162m37316J84326K78701k39257O10885O70929J03531q40835
2446.6F81690598p96204r53751j657333r13849n77087J23062K99682M49448K57111
2455.3F77921677Q6135M41437n89828q43430j057586r54972j262131j234130j55564
2464F72351608j55868M42276L94668N08347M56238j30692l66592j161194j378784j586075
2473.6F69373932j192246n57708K86331M37393J32217N45121K18734J38932o06385
2482.3F68776321r37957j173401j530686r83276q62961l07693l72773P4997N70374
2491F63252945O52313N35278m69055p89108j432953j284561j218796j007766l01590
$$ plain form
2499.7 657936707 657665710 657934341 658310776 658929596 658870239 658658371 658303604 656718292 655561066
2508.3 655561066 654409561 653248138 652526169 652556686 652781601 652724075 653234558 653484573 653630524 653346481
2518 653346481 652450333 651373901 650219345 648989944 647863922 647766342 647782669 647697296 648212280 649244614
2527.6 649244614 649424133 648758469 648284988 647066269 645728302 644529648 643512192 642903900 642714310
2536.3 642714310 643155136 643795624 644562759 644760437 644577866 643913498 643147964 642148666 640579681
2545 640579681 639695549 638997765 638803978 638820190 639069672 639699326 639815941 639777107 639472771 639166870
2554.6 639166870 638034630 636451569 635175934 634301071 634002838 633670921 633945961 634354553 635155067
2563.3 635155067 635559845 635018082 634456367 633359604 632262383 630877457 630050430 629595642 629014626
$$ packed form
2499.7F57936707k70997K68631L76435O18820n9357k11868l54767j585312j157226
2508.3F55561066j151505j161423p21969L0517K24915n7526N10483K50015J45951k84043
2518F53346481q96148j076432j154556j229401j126022r7580J6327q5373N14984J032334
2527.6F49244614J79519o65664m73481j218719j337967j198654j017456o08292j89590
2536.3F42714310M40826O40488P67135J97678j82571o64368p65534r99298j568985
2545F40579681q84132o97784j93787J6212K49482O29654J16615l8834l04336l05901
2554.6F39166870j132240j583061j275635q74863k98233l31917K75040M08592Q00514
2563.3F35155067M04778n41763n61715j096763j097221j384926q27027m54788n81016
$$ plain form
2572 629014626 629213142 629691734 630543900 630888176 630497627 629593163 628900490 628333549 627087555 626091156
2581.6 626091156 625437889 625481224 625591927 625800209 625923119 625695305 625864906 625431366 624797897 623869743
2591.3 623869743 622662621 621449432 620431404 620065880 620076942 620733109 620934334 621305771 621656075
2600 621656075 620966072 620135345 619161568 618290710 617185555 616129189 615319672 615110283 615437202 615516472
2609.6 615516472 615837059 615914040 615830688 615525589 614686584 613184319 611593590 610697174 609962158 609722557
2619.3 609722557 609603500 609562836 609690094 609914856 610277252 610197525 609625397 608235512 606828308 605624886
2628.9 605624886 604488449 603713112 603529205 603819466 604247055 605065994 604804192 604224396 603806686
2637.6 603806686 602853737 601950645 600508957 599584312 598934898 598398323 598550453 598897820 599383430
$$ packed form
2572F29014626J98516M78592Q52166L44276l90549r04464o92673n66941j245994r96399
2581.6F26091156o53267M3335J10703K08282J22910k27814J69601m33540o33469r28154
2591.3F23869743j207122j213189j018028l65524J1062O56167K01225L71437L50304
2600F21656075o90003q30727r73777q70858j105155j056366q09517k09389L26919P9270
2609.6F15516472L20587P6981q3352l05099q39005j502265j590729q96416p35016k39601
2619.3F09722557j19057m0664J27258K24762L62396p9727n72128j389885j407204j203422
2628.9F05624886j136437p75337j83907K90261M27589Q18939k61802n79796m17710
2637.6F03806686r52949r03092j441688r24645o49414n36575J52130L47367M85610
$$ plain form
2646.3 599383430 599338875 599109383 598443222 597340508 596296883 595400391 594519958 593548126 592956810
2654.9 592956810 592534485 592862473 593312225 593512077 593751335 593464813 592770729 591660004 590802460
2663.6 590802460 589839401 589061356 588784599 588537827 588744965 589093590 589381943 589125137 589004402 588847351
2673.3 588847351 588136406 587354622 586289558 585465508 584357872 583790359 584010544 584022942 584391212
2681.9 584391212 584786644 585076523 584899483 584120560 582889748 581660194 580926666 580213661 579659843
2690.6 579659843 579696236 580208054 580375519 580563622 580949440 581005211 580547104 579407501 578301315 577186508
2700.3 577186508 576240768 575568466 575237503 575691147 576226692 576454811 576666679 576916618 576688385 576035500
2709.9 576035500 574828796 573535461 572674904 571970291 571849556 571856270 572083931 572477798 573055649 573479767
$$ packed form
2646.3E99383430m4555k29492o66161j102714j043625q96492q80433r71832n91316
2654.9E92956810m22325L27988M49752J99852K39258k86522o94084j110725q57544
2663.6E90802460r63059p78045k76757k46772K07138L48625K88353k56806j20735j57051
2673.3E88847351p10945p81784j065064q24050j107636n67513K20185J2398L68270
2681.9E84391212L95432K89879j77040p78923j230812j229554p33528p13005n53818
2690.6E79659843L6393N11818J67465J88103L85818N5771m58107j139603j106186j114807
2700.3E77186508r45740o72302l30963M53644N35545K28119K11868K49939k28233o52885
2709.9E76035500j206704j293335q60557p04613j20735O714K27661L93867N77851M24118
$$ plain form
2719.5 573479767 573044243 572618065 571682625 570653763 569951668 569431458 569181099 568675461 568527298
2728.2 568527298 568642998 569240875 569968185 570086441 569567146 568672676 567949333 567089729 566570587 565983047
2737.9 565983047 565433502 565484848 565869560 566546402 566784744 567083397 567142296 566492386 565772362 565085983
2747.5 565085983 564322815 563673935 563594246 563479080 563398628 563528214 563877831 564244995 564139366 563911476
2757.2 563911476 563246880 562181053 560988541 560342255 560236053 560077744 560392303 560966454 561009064
2765.8 561009064 560557480 560410118 560220375 560033302 559476547 558251152 557512779 556887283 556554604
2774.5 556554604 556333160 556324081 556618690 556699104 556742058 556035919 555435219 554892120 553937340 552942543
2784.2 552942543 552130013 551760521 551584396 552090073 552070160 551853333 551884460 551372681 550867538 549876747
$$ packed form
2719.5E73479767m35524m26178r35440j028862p02095n20210k50359n05638j48163
2728.2E68527298J15700N97877P27310J18256n19295q94470p23343q59604n19142n87540
2737.9E65983047n49545N1346L84712O76842K38342K98653N8899o49910p20024o86379
2747.5E65085983p63168o48880p9689j15166q0452J29586L49617L67164j05629k27890
2757.2E63911476o64596j065827j192512o46286j06202j58309L14559N74151M2610
2765.8E61009064m51584j47362j89743j87073n56755j225395p38373o25496l32679
2774.5E56554604k21444r079K94609Q0414M2954p06139o00700n43099r54780r94797
2784.2E52942543q12530l69492j76125N05677j9913k16827L1127n11779n05143r90791
$$ plain form
2793.8 549876747 548912354 547801437 546892471 546485863 545667686 545128822 545211716 545532684 545192757 544792595
2803.4 544792595 544117966 542931938 542225876 541205025 540095406 539298897 538923988 538413162 537572594
2812.1 537572594 537314606 537415047 537392540 536546669 535205269 533867798 532746887 531636925 530484848
2820.8 530484848 530119820 529871979 529268494 528739281 528565598 528248138 527456512 526534042 525534668 524276505
2830.4 524276505 522733688 521604500 520620193 519775124 518847809 518067703 518022842 517237663 515979080
2839.1 515979080 514267807 511934319 509763680 507521553 505289307 503164177 501350822 499718819
2846.8 499718819 498312645 496519623 494491234 493089218 491648254 490205803 488609734 487327881
2854.6 487327881 486598892 486214752 486452713 486615677 486523094 486637726 487275887 487504578 487178764 486548424
$$ packed form
2793.8E49876747r64393j110917r08966m06608q18177n38864Q2894L20968l39927m00162
2803.4E44792595o74629j186028p06062j020851j109619p96509l74909n10826q40568
2812.1E37572594k57988J00441k2507q45871j341400j337471j120911j109962j152077
2820.8E30484848l65028k47841o03485n29213j73683l17460p91626r22470r99374j258163
2830.4E24276505j542817j129188r84307q45069r27315p80106m4861p85179j258583
2839.1E15979080j711273k333488k170639k242127k232246k125130j813355j632003
2846.8D99718819j406174j793022k028389j402016j440964j442451j596069j281853
2854.6D87327881p28989l84140K37961J62964r2583J14632O38161K28691l25814o30340
$$ plain form
2864.2 486548424 485675926 484903412 483418465 481915550 480902557 480225601 479871750 479831886 479810333
2872.9 479810333 479086952 478636322 477975121 476956406 476347084 475609207 474605446 473313866 472636986
2881.6 472636986 472616539 472198143 471332626 470899658 470700645 469677200 468221054 466967850 465952187
2890.2 465952187 464711609 463592033 462732620 461955986 461363792 460850754 460557213 459669724 458914413
2898.9 458914413 458331070 457182198 456280670 455003395 453774261 453072281 452197952 451336212 450957451
2907.6 450957451 450606956 449628830 448340111 447077026 445897713 443892250 441574173 439831047 438353271
2916.3 438353271 436919975 435267830 434138031 433074799 432283096 431694641 430591965 430252953 430088692
2925 430088692 429434471 428823242 429103165 429523239 428961945 428820000 429539108 430536270 431325111 432180367
$$ packed form
2864.2D86548424q72498p72514j484947j502915j012993o76956l53851l9864k1553
2872.9D79810333p23381m50630o61201j018715o09322p37877j003761j291580o76880
2881.6D72636986k0447m18396q65517m32968j99013j023445j456146j253204j015663
2890.2D65952187j240578j119576q59413p76634n92194n13038k93541q87489p55311
2898.9D58914413n83343j148872r01528j277275j229134p01980q74329q61740l78761
2907.6D50957451l50495r78126j288719j263085j179313k005463k318077j743126j477776
2916.3D38353271j433296j652145j129799j063232p91703n88455j102676l39012j64261
2925D30088692o54221o11229K79923M20074n61294j41945P19108R97162P88841Q55256
$$ plain form
2934.6 432180367 432782593 432966728 433421211 433823128 434375458 435073204 436188164 437488861 438344994
2943.3 438344994 439298096 440277023 441056099 441973648 442880058 442918091 442649002 442688751 443115768 443786201
2952.9 443786201 444084549 444537086 445157738 445993233 446730804 447120018 447589874 448162689 448732262 448766060
2962.6 448766060 449102058 449736366 450391769 451284103 452112122 453221893 454348793 455690727 456553879
2971.2 456553879 456879616 457430420 457746315 458275681 458916512 459117241 459212151 460121803 461227913 462051125
2980.9 462051125 462726974 462679749 462795067 462777252 462647858 462971497 463178787 463366318 463540192 463966408
2990.5 463966408 464488678 464863281 465005569 464842072 464416275 464050102 463938026 463451309 462695084 462084045
3000.2 462084045 462076416 462031212 461927414 462093468 461488113 460925903 460678368 460369072 459813461 458865013
$$ packed form
2934.6D32180367O02226J84135M54483M01917N52330O97746J114960J300697Q56133
2943.3D38344994R53102R78927P79076R17549R06410L8033k69089L9749M27017O70433
2952.9D43786201K98348M52537O20652Q35495P37571L89214M69856N72815N69573L3798
2962.6D48766060L35998O34308O55403Q92334Q28019J109771J126900J341934Q63152
2971.2D56553879L25737N50804L15895N29366O40831K00729R4910R09652J106110Q23212
2980.9D62051125O75849m7225J15318j7815j29394L23639K07290J87531J73874M26216
2990.5D63966408N22270L74603J42288j63497m25797l66173j12076m86717p56225o11039
3000.2D62084045p629m5204j03798J66054o05355n62210k47535l09296n55611r48448
$$ plain form
3009.8 458865013 458053856 457407188 456833153 456228828 456019363 455585899 455027809 454842224 454461288 454091835
3019.5 454091835 453288651 452355461 451331215 450344200 449651794 448894081 448668060 448357735 447787552
3028.1 447787552 447362366 447119255 446543007 445326080 444288635 443520126 442820091 441563950 440685272
3036.8 440685272 440304794 439450684 438807869 438272858 438012009 437422791 436293564 435505180 434531059
3045.5 434531059 433351135 432272797 431196060 430299988 429868355 429675255 429441109 428708572 427701263
3054.2 427701263 427066345 426375427 425510864 424297333 423081131 422122154 421201401 420796204 420580215
3062.9 420580215 420112000 419567299 419104500 418584709 417830009 416669693 415568504 414641724 413448753
3071.5 413448753 412956123 412856941 412354660 411866531 411539421 411048775 410393867 410020523 409111900 407966270
$$ packed form
3009.8D58865013q11157o46668n74035o04325k09465m33464n58090j85585l80936l69453
3019.5D54091835q03184r33190j024246r87015o92406p57713k26021l10325n70183
3028.1D47787552m25186k43111n76248j216927j037445p68509p00035j256141q78678
3036.8D40685272l80478q54110o42815n35011k60849n89218j129227p88384r74121
3045.5D34531059j179924j078338j076737q96072m31633j93100k34146p32537j007309
3054.2D27701263o34918o90918q64563j213531j216202r58977r20753m05197k15989
3062.9D20580215m68215n44701m62799n19791p54700j160316j101189r26780j192971
3071.5D13448753m92630r9182n02281m88129l27110m90646o54908l73344r08623j145630
$$ plain form
3081.2 407966270 407245903 406672745 406194572 405494003 404875793 404218025 403686867 403500710 403206978 402471809
3090.8 402471809 401433411 400445213 399343338 398838081 398371582 397447205 396968536 396452522 395814972
3099.5 395814972 395370407 394908028 394337502 393810234 392966080 392213020 391748047 390767746 389891205 389256477
3109.1 389256477 388587646 387943993 387491798 386962776 386178932 385600357 384810333 384001312 382879143
3117.8 382879143 381710281 380923805 380222702 379787788 378897324 378559456 378758888 378269119 377130966
3126.5 377130966 375694656 374692307 373815460 372917747 371918068 371413307 370918045 369885483 369542732
3135.2 369542732 369126320 368755112 368410835 367400055 366355896 365576668 364492187 363080063 362559204
3143.9 362559204 362238121 361544037 360541763 359919510 360107384 359544563 358646774 357697029 356652565
$$ packed form
3081.2D07966270p20367n73158m78173p00569o18210o57768n31158j86157k93732p35169
3090.8D02471809j038398r88198j101875n05257m66499r24377m78669n16014o37550
3099.5C95814972m44565m62379n70526n27268q44154p53060m64973r80301q76541o34728
3109.1C89256477o68831o43653m52195n29022p83844n78575p90024q09021j122169
3117.8C82879143j168862p86476p01103m34914q90464l37868J99432m89769j138153
3126.5C77130966j436310j002349q76847q97713r99679n04761m95262j032562l42751
3135.2C69542732m16412l71208l44277j010780j044159p79228j084481j412124n20859
3143.9C62559204l21083o94084j002274o22253J87874n62821q97789r49745j044464
$$ plain form
3152.5 356652565 355498619 354178925 353332558 352597160 352252693 351880951 351241035 350377350 349300003
3161.2 349300003 348945885 348621826 347433167 345923195 344947205 344145050 343537941 343121109 342352448
3169.9 342352448 341840706 341371689 340719452 339755669 338686676 338076363 337618561 336941109 335871582
3178.6 335871582 335139771 334584999 333788376 333086662 332552910 332087975 331182365 330174103 329579849
3187.3 329579849 328915482 327893372 326915932 325966034 325149384 324431915 323644981 323476181 323439217 323216743
3196.9 323216743 322629776 321400414 320163383 319221992 318913155 318515701 318035679 317737141 317145882
3205.6 317145882 316619682 316089954 315587883 315012951 314076977 313045406 312571125 312027321 310821896
3214.3 310821896 310167675 309861965 309499435 308946686 308411102 308191338 307673950 307160225 306624451 305906506
$$ packed form
3152.5C56652565j153946j319694q46367p35398l44467l71742o39916q63685j077347
3161.2C49300003l54118l24059j188659j509972r75990q02155o07109m16832p68661
3169.9C42352448n11742m69017o52237r63783j068993o10313m57802o77452j069527
3178.6C35871582p31811n54772p96623p01714n33752m64935r05610j008262n94254
3187.3C29579849o64367j022110r77440r49898q16650p17469p86934j68800l6964k22474
3196.9C23216743n86967j229362j237031r41391l08837l97454m80022k98538n91259
3205.6C17145882n26200n29728n02071n74932r35974j031571m74281n43804j205425
3214.3C10821896o54221l05710l62530n52749n35584k19764n17388n13725n35774p17945
$$ plain form
3223.9 305906506 304966373 304006195 303540611 303370609 302923717 302202797 301985149 301834202 301358109 300776997
3233.5 300776997 300119381 299268818 298297443 297745972 297142181 296518421 296095829 295850487 295445805 294845867
3243.2 294845867 294862633 294523754 293917847 293543892 292861691 292016850 291140995 290733776 290486641 290230598
3252.8 290230598 289996262 289638405 289214211 288568611 288044224 287655830 287249966 286600399 285934620 285457592
3262.5 285457592 284937153 284607506 284455013 284056931 283387604 283215122 283150978 282911930 282567787 281704826
3272.1 281704826 280960197 280775204 281034851 280665779 279915123 279601860 279417095 279163914 278277378 278050880
3281.8 278050880 278145256 277670670 277418823 276799088 276308575 275870705 275299015 275324020 275384521 274869041
3291.4 274869041 274401131 274608746 274329948 273509464 273096695 273017941 272736988 272327595 271948605 271362095
$$ packed form
3223.9C05906506r40133r60178m65584j70002m46892p20920k17648j50947m76093n81112
3233.5C00776997o57616q50563r71375n51471o03791o23760m22592k45342m04682n99938
3243.2B94845867J6766l38879o05907l73955o82201q44841q75855m07219k47135k56043
3252.8B90230598k34336l57857m24194o45600n24387l88394m05864o49567o65779m77028
3262.5B85457592n20439l29647j52493l98082o69327j72482o4144k39048l44143q62961
3272.1B81704826p44629j84993K59647l69072p50656l13263j84765k53181q86536k26498
3281.8B78050880R4376m74586k51847o19735m90513m37870n71690K5005O0501n15480
3291.4B74869041m67910K07615k78798q20484m12769p8754k80953m09393l78990n86510
$$ plain form
3301 271362095 271244183 270975361 270431042 270244160 269824047 269611549 269500332 269337025 269215355 268783035
3310.7 268783035 268422604 268003845 267400703 266971226 266638546 266382580 266065311 265467300 264994831 264545784
3320.3 264545784 263956776 263448849 263215179 263270893 262755871 261951733 261553440 261556664 261383286 260387878
3330 260387878 259622631 259390488 259122028 258428936 257540398 257115459 256735611 256417141 256034946 255575981
3339.6 255575981 255465679 255428982 255064983 254317532 253468456 252799587 252429314 251961308 251672096 251645260
3349.3 251645260 251548195 251571445 251303043 250827103 250201817 249595852 249171028 248921528 249083080 249079990
3358.9 249079990 248829136 248256321 247645226 247474594 247436066 247026424 246457253 246656475 246744308 246526470
3368.6 246526470 246450653 246198578 245623398 244692841 244245892 243894310 243871288 244281178 244060841 243954983
$$ packed form
3301B71362095j17912k68822n44319j86882m20113k12498j11217j63307j21670m32320
3310.7B68783035l60431m18759o03142m29477l32680k55966l17269n98011m72469m49047
3320.3B64545784n89008n07927k33670N5714n15022q04138l98293L224j73378r95408
3330B60387878p65247k32143k68460o93092q88538m24939l79848l18470l82195m58965
3339.6B55575981j10302l6697l63999p47451q49076o68869l70273m68006k89212k6836
3349.3B51645260r7065K3250k68402m75940o25286o05965m24824k49500J61552l090
3358.9B49079990k50854n72815o11095j70632l8528m09642n69171J99222Q7833k17838
3368.6B46526470p5817k52075n75180r30557m46949l51582k3022M09890k20337j05858
$$ plain form
3378.2 243954983 243858528 243553314 243481331 243275204 242923565 242879620 242893333 242869091 243053780 242694302
3387.8 242694302 242217598 242099857 242061348 242157593 242010651 241692543 241600742 241882935 241708622 241352139
3397.5 241352139 241764851 241982346 241822834 241868763 242190895 242158966 241729717 241310959 241135941 241515217
3407.1 241515217 241682205 241654701 241704330 241594334 241722336 242013245 242041855 241889915 241984730 242282085
3416.8 242282085 242501812 242333584 242090816 242316227 242623215 242717781 243092957 243931942 244095993 243830109
3426.4 243830109 243849392 243790779 243995113 244151249 244621506 245654545 246055508 246042042 246181355 246102734
3436.1 246102734 246368637 247417240 247867413 247472095 247471104 248328934 248985596 249106636 249730453 250321121
3445.7 250321121 250611019 250660019 250938969 251690617 252167969 252588787 253058090 253617916 253773518 253998089
$$ packed form
3378.2B43954983r6455l05214p1983k06127l51639m3945J3713k4242J84689l59478
3387.8B42694302m76704j17741l8509R6245j46942l18108r1801K82193j74313l56483
3397.5B41352139M12712K17495j59512M5929L22132l1929m29249m18758j75018L79276
3407.1B41515217J66988k7504M9629j09996J28002K90909K8610j51940R4815K97355
3416.8B42282085K19727j68228k42768K25411L06988R4566L75176Q38985J64051k65884
3426.4B43830109J9283n8613K04334J56136M70257J033039M00963j3466J39313p8621
3436.1B46102734K65903J048603M50173l95318r91Q57830O56662J21040O23817N90668
3445.7B50321121K89898M9000K78950P51648M77352M20818M69303N59826J55602K24571
$$ plain form
3455.3 253998089 254959812 255589638 256662483 257843590 258023872 258004475 258146038 258951168 260328312
3464 260328312 261179199 261128635 260988464 261622772 262551441 262857628 263315086 264662457 265767384 266499691
3473.7 266499691 267315369 267769337 267978954 268276806 268479919 269288483 270621490 271123600 271186543 271872845
3483.3 271872845 273622189 275066833 275646648 276458988 276817608 277398815 278300915 278487167 278813267
3492 278813267 279903011 281139603 282108707 283348656 284370575 285153198 285946045 286430683 287272816
3500.7 287272816 288392124 289125633 289516430 290140305 290831680 292010479 293666306 294891415 295445461
3509.4 295445461 295631580 296811943 297979507 298745823 300129814 301216888 301951656 302748013 303669300
3518 303669300 304551525 305437622 306711693 308111248 308902321 309568558 310685101 311148758 311996326
$$ packed form
3455.3B53998089R61723O29826J072845J181107J80282j9397J41563Q05130J377144
3464B60328312Q50887n0564j40171O34308R28669L06187M57458J347371J104927P32307
3473.7B66499691Q15678M53968K09617K97852K03113Q08564J333007N02110O2943O86302
3483.3B71872845J749344J444644N79815Q12340L58620N81207R02100J86252L26100
3492B78813267J089744J236592R69104J239949J021919P82623P92847M84638Q42133
3500.7B87272816J119308P33509L90797O23875O91375J178799J655827J225109N54046
3509.4B95445461J86119J180363J167564P66316J383991J087074P34768P96357R21287
3518C03669300Q82225Q86097J274071J399555P91073O66237J116543M63657Q47568
$$ plain form
3526.7 311996326 313670025 315141029 315981045 316860313 318346691 319430084 320764999 322142944 323554955
3535.4 323554955 324489861 324745827 326087379 327052269 328281822 330081177 331606674 333005829 334584732
3544.1 334584732 336421204 337320404 338271866 338657646 340237083 342161369 343331184 345236244 345700722
3552.7 345700722 346973839 348319016 349735527 351753006 352629738 354540825 356392708 358318710
3560.5 358318710 359504166 360533218 362122726 363590355 366693954 366750641 366918449 368633499 369669914
3569.1 369669914 373254852 375957451 377788773 379183121 381216316 383211517 384341278 385687103
3576.9 385687103 386739388 389933548 392733307 393861351 395166702 397178841 399510841 401034355
3584.6 401034355 404186897 405579185 405528030 407210808 407669983 411099205 414514694 417141342 418733559
$$ packed form
3526.7C11996326J673699J471004Q40016Q79268J486378J083393J334915J377945J412011
3535.4C23554955R34906K55966J341552R64890J229553J799355J525497J399155J578903
3544.1C34584732J836472Q99200R51462L85780J579437J924286J169815J905060M64478
3552.7C45700722J273117J345177J416511K017479Q76732J911087J851883J926002
3560.5C58318710J185456J029052J589508J467629L103599N6687J67808J715050J036415
3569.1C69669914L584938K702599J831322J394348K033195J995201J129761J345825
3576.9C85687103J052285L194160K799759J128044J305351K012139K332000J523514
3584.6D01034355L152542J392288n1155J682778M59175L429222L415489K626648J592217
$$ plain form
3593.2 418733559 420562592 423540726 423634377 426424866 429805832 430715179 433334694 435327682 437445793
3601.9 437445793 440641556 442988205 444890175 447395668 449826660 450158424 453200836 454313545
3609.6 454313545 455507927 462151909 464560966 464583435 467908134 468516693 472904434 476750526 477308960
3618.3 477308960 479886742 481483955 483342094 485973778 488726311 491619720 495083122 497933235
3626 497933235 501009750 507189369 507625237 502526054 507136269 511821709 516894264 519059944 519363747
3634.7 519363747 523275642 527214546 529846458 531527290 533851013 537407799 540672188 542662964
3642.4 542662964 544614296 547594643 551563339 556739540 555501328 553699188 560624619 562410088
3650.1 562410088 560954056 562179413 567925529 573355408 578081322 582898331 577155571 579340935
$$ packed form
3593.2D18733559J829033K978134R3651K790489L380966R09347K619515J992988K118111
3601.9D37445793L195763K346649J901970K505493K430992L31764L042412J112709
3609.6D54313545J194382O643982K409057K2469L324699O08559M387741L846092N58434
3618.3D77308960K577782J597213J858139K631684K752533K893409L463402K850113
3626D97933235L076515O179619M35868n099183M610215M685440N072555K165680L03803
3634.7E19363747L911895L938904K631912J680832K323723L556786L264389J990776
3642.4E42662964J951332K980347L968696N176201j238212j802140O925431J785469
3650.1E62410088j456032J225357N746116N429879M725914M817009n742760K185364
$$ plain form
3657.9 579340935 584523163 586125565 589103966 590915298 593248520 595398407 597324371 599164658
3665.6 599164658 600731697 605611305 607721291 607205925 608146362 603133125 606785316 615311470 623623886
3674.3 623623886 622325172 606639900 611568108 620639534 624955711 622638931 623426361 626692696
3682 626692696 628999023 630279388 631176453 632486229 636619263 642855072 634447784 630820045 638331261
3690.6 638331261 634746399 635236816 640031052 641410141 643533936 644003372 643901825 645483856 646351166
3699.3 646351166 648946457 651239395 646190033 644681931 649390640 651519623 651670074 651288910 653131256
3708 653131256 656623077 650493927 653892822 659008484 648124695 651943283 656413422 657075272 658143921
3716.7 658143921 660343323 661498032 657923279 658623352 663249130 659772186 656956863 661785355
$$ packed form
3657.9E79340935N182228J602402K978401J811332K333222K149887J925964J840287
3665.6E99164658J567039M879608K109986n15366R40437n013237L652191Q526154Q312416
3674.3F23623886j298714j5685272M928208R071426M316177k316780P87430L266335
3682F26692696K306327J280365Q97065J309776M133034O235809q407288l627739P511216
3690.6F38331261l584862M90417M794236J379089K123795M69436j01547J582031Q67310
3699.3F46351166K595291K292938n049362j508102M708709K128983J50451l81164J842346
3708F53131256L491821o129150L398895N115662j0883789L818588M470139O61850J068649
3716.7F58143921K199402J154709l574753P00073M625778l476944k815323M828492
$$ plain form
3724.4 661785355 663154984 663296967 661591492 661323395 664097824 665301361 670155487 666164856 659211884
3733.1 659211884 668118515 669146576 661239319 662472534 664717636 664861069 666868439 669251480
3740.8 669251480 665292358 668118896 678939056 668500748 653627853 663919144 670132065 675177536
3748.5 675177536 671074371 662807846 673967896 670337219 663362579 668289566 672066803 675039825
3756.2 675039825 670161133 672120209 677584305 671383133 669799423 673043594 674779587 675664902
3763.9 675664902 678392944 675511093 671193085 674942017 680209198 680768051 672251358 673546677
3771.7 673546677 676844254 677610016 678625259 677744370 678096466 678483887 681179504 681174011 673545303
3780.3 673545303 675593185 677969055 679475403 681561356 678660049 678289032 680703278 681606903 681181870
$$ packed form
3724.4F61785355J369629J41983j705475k68097K774429J203537M854126l990631o952972
3733.1F59211884Q906631J028061p907257J233215K245102J43433K007370K383041
3740.8F69251480l959122K826538J0820160j0438308j4872895J0291291O212921N045471
3748.5F75177536m103165q266525J1160050l630677o974640M926987L777237K973022
3756.2F75039825m878692J959076N464096o201172j583710L244171J735993Q85315
3763.9F75664902K728042k881851m318008L748932N267181N58853q516693J295319
3771.7F73546677L297577P65762J015243q80889L52096L87421K695617n493p628708
3780.3F73545303K047882K375870J506348K085953k901307l71017K414246R03625m25033
$$ plain form
3789 681181870 680321884 680124435 680073090 680245590 679943008 681321335 684054642 680175095 676987000
3797.7 676987000 680224228 684047089 688239899 680762024 670689774 675831070 679459610 684218597
3805.4 684218597 689811707 680379791 676812744 681895981 683306732 682852325 683222122 683408585 683927078
3814.1 683927078 688315887 687473145 675299301 679488602 684970398 689512177 691057587 674828415
3821.8 674828415 676436996 681494827 682917786 684863358 684208755 680336075 681626663 684387970
3829.5 684387970 687600555 688556747 680060730 682835236 689667511 683228226 682383575 689800644 682736206
3838.2 682736206 678989639 686160355 681640091 680601578 686579666 684711304 681835632 684161072
3845.9 684161072 685166473 685001907 685946274 685066605 686865692 691633224 685485535 684776230 673915329
$$ packed form
3789F81181870q59986j97449n1345J72500l02582J378327K733307l879547l188095
3797.7F76987000L237228L822861M192810p477875j0072250N141296L628540M758987
3805.4F84218597N593110r431916l567047N083237J410751m54407L69797J86463N18493
3814.1F83927078M388809q42742j2173844M189301N481796M541779J545410j6229172
3821.8F74828415J608581N057831J422959J945572o54603l872680J290588K761307
3829.5F84387970L212585R56192q496017K774506O832275o439285q44651P417069p064438
3838.2F82736206l746567P170716m520264j038513N978088j868362k875672K325440
3845.9F84161072J005401j64566R44367q79669J799087M767532o147689p09305j0860901
$$ plain form
3854.6 673915329 675805969 685506897 684824905 683032608 685019760 686636429 687933960 683097382
3862.3 683097382 683909760 690392914 686458893 680994263 683734741 687903671 692328033 684896164
3870 684896164 676412659 680083923 686243057 689507370 680964584 681772537 685497818 685284882 687636948
3878.7 687636948 691962585 686686935 679570541 684714432 686129303 687533112 691551514 679823837
3886.4 679823837 680566864 684409027 685899124 689921265 688224030 681764755 683625031 685996857
3894.1 685996857 684045563 685097427 686333847 687842560 688302536 680616150 685736618 686438293 681857910
3902.8 681857910 687157211 684980087 683689499 683905029 684226151 685637741 685200043 685514755 685244370
3911.5 685244370 685202942 685676117 685922165 686953659 688013153 684605484 682020874 685856247 685214844
$$ packed form
3854.6F73915329J890640R700928o81992j792297J987152J616669J297531m836578
3862.3F83097382Q12378O483154l934021n464630K740478M168930M424362p431869
3870F84896164q483505L671264O159134L264313q542786Q07953L725281k12936K352066
3878.7F87636948M325637n275650p116394N143891J414871J403809M018402j1727677
3886.4F79823837P43027L842163J490097M022141j697235o459275J860276K371826
3894.1F85996857j951294J051864J236420J508713M59976p686386N120468P01675m580383
3902.8F81857910N299301k177124j290588K15530L21122J411590m37698L14712k70385
3911.5F85244370m1428M73175K46048J031494J059494l407669k584610L835373o41403
$$ plain form
3920.2 685214844 681850357 683921127 685867996 687019196 684706650 681759872 683518143 685398712
3927.9 685398712 686061096 685028000 684854660 686303101 683737259 682494965 684010544 684026794 684224472
3936.6 684224472 684614105 684842300 685096130 684981461 685592117 686092606 683643341 682706833 683799896
3945.2 683799896 684224701 684469986 683201752 684170914 684861298 682749863 683921967 684278030 683548279
3953.9 683548279 683692474 683498688 683560562 683791885 684392700 683822784 684544754 684884033 683397827 684260941
3963.6 684260941 684440994 683726730 684120865 684677353 684279404 683433838 683303986 683606339 684113846 683776093
3973.2 683776093 683344345 683603745 684059525 684128113 684045181 684215775 684222412 684368744 684198608 683999939
3982.8 683999939 684130173 684481659 684275360 683731079 684156113 684691925 685188980 685063934 684524841 684108429
$$ packed form
3920.2F85214844l364487K070770J946869J151200k312546k946778J758271J880569
3927.9F85398712O62384j033096j73340J448441k565842j242294J515579J6250J97678
3936.6F84224472L89633K28195K53830j14669O10656N00489k449265r36508J093063
3945.2F83799896M24805K45285j268234R69162O90384k111435J172104L56063p29751
3953.9F83548279J44195j93786O1874K31323O00815n69916P21970L39279j486206Q63114
3963.6F84260941J80053p14264L94135N56488l97949q45566j29852L02353N07507l37753
3973.2F83776093m31748K59400M55780O8588q2932J70594O637J46332j70136j98669
3982.8F83999939J30234L51486k06299n44281M25034N35812M97055j25046n39093m16412
$$ plain form
3992.5 684108429 684107361 684141846 683307190 683181000 683238144 684012909 684750443 684711380
4000.2 684711380
$$ packed form
3992.5F84108429j068L4485q34656j26190N7144P74765P37534l9063
4000.2F84711380
##END=$$ End of the data block
