##TITLE=$$ Begin of the data block
##JCAMP-DX=5.00 $$ ACD/SpecManager v 10.08
##SPECTROMETER/DATA SYSTEM=Varian
##DATE=15 Jan 2013 11:01:14
##DATA TYPE=INFRARED SPECTRUM
##DATA CLASS=XYDATA
##ORIGIN=
##OWNER=
##NPOINTS=3735
##FIRSTX=399.26403809
##LASTX=4000.35498047
##MAXX=4000.35498047
##MINX=399.26403809
##MAXY=67.48246765
##MINY=16.30504036
##XFACTOR=1.0000000000
##YFACTOR=0.000000100000000
##FIRSTY=36.73620987
##DELTAX=0.96440572
##XUNITS=1/CM
##YUNITS=TRANSMITTANCE
##XYDATA=(X++(Y..Y))
399.3C67362099p652207j1283455q02345P656250N59731l503113N9929k127915M005051
407.9C54274025m80042p371482m613266m321061L771248R957466L634148o641655o968460
416.6C41240921R46312J6728096K373161j7651443L311729N524979o465263n043908
424.3C40964584O03752L531838Q71162j16005j501922m166413m67376L372535K306786
433C45398941k40021k097053j320420Q31414M013824K849732l280373k610893q21305
441.7C42723846j285705J308021m66842L026199N355721l063355n315475J570244N909347
450.4C49762001k800980n527992L732224K597732n727119o065788M213333K939453
458.1C43122864m146500k720451l237534L363953L228226L67088L04718l338318k504768
$$ y = [367362099, 359709892, 348426437, 347624092, 355280342, 355840073, 352336960, 352396889, 350268974, 354274025, 353793983, 346422501, 341809235, 337488174, 341259422, 351216888, 354851036, 348209381, 341240921, 342187233, 358915329, 361288490, 343637047, 346948776, 352473755, 346008492, 340964584, 341568336, 345100174, 345971336, 345855331, 344353409, 340186996, 339719620, 343092155, 345398941, 345158920, 343061867, 341741447, 342572861, 346586685, 349436417, 346156044, 343545151, 342723846, 341438141, 342746162, 342279320, 345305519, 350661240, 347597885, 342282410, 343852654, 349762001, 346961021, 341433029, 345165253, 347762985, 342035866, 335970078, 340183411, 343122864, 338976364, 336255913, 333018379, 336382332, 339610558, 339977646, 340282364, 336944046, 334439278]
466.8C34439278n38674q3732K782745O41899m625282l795586K4948J066704L065834
475.5C32978134P70340k421646k43645q37784l030090j013031Q81767J674920p16286
484.1C28042679q54073K33650m53758J416703M9400R60045Q87756q70323J619949j661567
493.8C29370461k761155N49622K155762o7749k395478n99098j612472k146492j210518
502.5C21282883J614074J663056q02841R70726j043015j638565J591988j371804k545147
511.1C19721355o93206n61505J627846J422653j742496j511631j069279j14346R84040
519.8C18063431r72004j399574q55656q60310j603374j200752K264194J706924o66561
528.5C14476318M63543J01948j214466L90911K47383r2792n70889k579117p19642J619758
$$ y = [334439278, 333900604, 333816872, 336599617, 337241516, 332616234, 328820648, 328845596, 329912300, 332978134, 333748474, 331326828, 331083183, 330245399, 327215309, 326202278, 327084045, 328758965, 328042679, 327188606, 327422256, 326968498, 328385201, 328434601, 329394646, 330282402, 329412079, 331032028, 329370461, 326609306, 327158928, 329314690, 329246941, 326851463, 326252365, 324639893, 322493401, 321282883, 322896957, 324560013, 323757172, 324727898, 323684883, 322046318, 323638306, 322266502, 319721355, 319028149, 318466644, 320094490, 321517143, 319774647, 318263016, 317193737, 317079391, 318063431, 317091427, 315691853, 314836197, 313975887, 312372513, 311171761, 313435955, 315142879, 314476318, 314939861, 315041809, 313827343, 314218254, 314465637, 314372845, 313801956, 311222839, 310503197, 312122955]
538.1C12122955M97609q80757o01253p24106j159878K1267R38377L28656m20876j234131
547.8C08887863j781387p06215Q3542k10552j260491q19530J034259K31171n09949
556.5C04948711k395515k856941K84958J112995J043873J7166l36666P18135N28660
565.1C03065376o1111L26481O29749r11350j198864q7738M91657M18911N68714K23847
574.8C03465672r16100n61867p94430j27239q15887j373425K084427J031418k70500
583.5C01722069J07422L18794J425571O03066l73860j813087j248131J407147J339626
592.1C03488617J22242k46067j89114m30946Q55045J799450r58919j245327M41341
600.8C03636322k04773j216335k214737n94788R81369l78990l51086l46679j362686
$$ y = [312122955, 312620564, 311739807, 311138554, 310414448, 309254570, 309275837, 310214214, 310542870, 310121994, 308887863, 307106476, 306400261, 306483803, 306273251, 305012760, 304193230, 305227489, 305458660, 304948711, 302553196, 299696255, 299981213, 301094208, 302138081, 302155247, 301818581, 302536716, 303065376, 303004265, 303330746, 303960495, 303049145, 301850281, 301762543, 302254200, 302673111, 303241825, 303465672, 302549572, 301987705, 301193275, 301066036, 300250149, 298876724, 300961151, 301992569, 301722069, 301829491, 302148285, 303573856, 304176922, 303803062, 301989975, 300741844, 302148991, 303488617, 303610859, 303364792, 303175678, 302744732, 303599777, 305399227, 304440308, 303194981, 303636322, 303431549, 302215214, 300000477, 299405689, 300387058, 300008068, 299656982, 299310303, 297947617]
609.5B97947617q19836P78904k47517j955051k75288L91636O43921M92954m85077N22595
619.2B96994858O91318N92175M37984K6036n10998m63772P90253J560459K346096J253986
628.8C03718395K92626Q94279J487293K354451J560821O49777Q93802J357117J119537
637.5C14328098K89593J564636J722069l87192L71151J774578K213555K072715O10238
646.2C24559441N27153L16734l33214K71378J316147J713867O95724P05261R63707
654.8C30736198p6904q02879q10852l99208m95148p17506O70089J076889K01683j1406
664.5C29370956P4845J718941K167816l057480K16675J39312K14196J510582O21681
673.2C32977524K10304L87421J066742J451111Q71162P01599J329193J635246J057358
$$ y = [297947617, 297127781, 297906685, 297659168, 295704117, 295428829, 295820465, 296464386, 296957340, 296472263, 296994858, 297686176, 298278351, 298716335, 298742371, 298231373, 297767601, 298557854, 300118313, 302464409, 303718395, 304011021, 304905300, 306392593, 308747044, 310307865, 310957642, 311851444, 313208561, 314328098, 314617691, 316182327, 317904396, 317517204, 317888355, 319662933, 321876488, 323949203, 324559441, 325086594, 325403328, 325070114, 325341492, 326657639, 328371506, 329067230, 329772491, 330736198, 330659294, 329856415, 329045563, 328646355, 328151207, 327433701, 328103790, 329180679, 329382362, 329370956, 329445801, 331164742, 333332558, 330275078, 330491753, 330631065, 330845261, 332355843, 332977524, 333187828, 333575249, 334641991, 336093102, 336964264, 337665863, 338995056, 340630302, 341687660]
681.8C41687660J225090J189995J116905J276093P27310Q47626J075935Q31947R93233
690.5C50971794K55737m58450J57890L01018J158829J557426M21105J90697N14755
699.2C55070801R66034P07054M75502J91727o1074O53115P99942J130523J271935J366119
708.8C62571678J345139K06985n35927J80817J290207J207352J097984M93317O65092
717.5C68522644J626816P01675K41967O67800M10920L44123J526947J242981O11763
726.2C75897636J504937J440239J429634J088752J438179J193810J62659M69780Q53042
734.9C85478668J511536L39012J20049J054458P92046P89604O62956O47087O21987
743.6C92017403J028366n06974n13610J396637J317443J717988J275329Q42133J54152
$$ y = [341687660, 342912750, 344102745, 345219650, 346495743, 347223053, 348070679, 349146614, 349978561, 350971794, 351227531, 350769081, 350926971, 351227989, 352386818, 353944244, 354365349, 354556046, 355070801, 356036835, 356743889, 357219391, 357411118, 357350044, 358003159, 358803101, 359933624, 361205559, 362571678, 363916817, 364123802, 363587875, 363768692, 365058899, 366266251, 367364235, 367857552, 368522644, 370149460, 370851135, 371093102, 371760902, 372171822, 372515945, 374042892, 375285873, 375897636, 377402573, 378842812, 380272446, 381361198, 382799377, 383993187, 384155846, 384625626, 385478668, 386990204, 387329216, 387449265, 388503723, 389295769, 390085373, 390748329, 391395416, 392017403, 393045769, 392538795, 392025185, 393421822, 394739265, 396457253, 397732582, 398574715, 398728867]
752.2C98728867Q81424J867904O44760R76029J006508J515350O17828K79122K368202
760.9D08885994J604080J024513J222382R24492N67436Q2054n29518K96288O00090
769.6D14677811l88565R08012J79024m77715P78351N79567K35100m94919j64299O47316
779.2D16479683r1934r48830L93334J598548R50547L85322O19698J871300J185951
787.9D22443619l73154n75638j945N6267n54619M22363J012459M87251M3411N2147
797.6D23012161m50592j249389j476059j430321j610947k155418n76706p52449j350594
806.2D11959686q01j176872k724762k689552j194191j135292k209893k203254j248818
814.9C97376251m0817r83048r69924j44425l09982j78566Q9722M91485P58591J642990
$$ y = [398728867, 399610291, 401478195, 402122955, 403098984, 404105492, 405620842, 406238670, 406517792, 408885994, 410490074, 411514587, 412736969, 413661461, 414228897, 414310951, 413781433, 414077721, 414677811, 414289246, 415197258, 415376282, 414898567, 415676918, 416256485, 416491585, 415996666, 415832367, 416479683, 416387749, 415438919, 415832253, 417430801, 418381348, 418766670, 419386368, 421257668, 422443619, 422070465, 421494827, 421492882, 421549149, 420994530, 421416893, 422429352, 422916603, 422960014, 423012161, 422561569, 421312180, 419836121, 418405800, 416794853, 414639435, 414062729, 413310280, 411959686, 411958885, 410782013, 408057251, 405367699, 404173508, 403038216, 400828323, 398625069, 397376251, 397335434, 396352386, 395382462, 395238037, 394928055, 394749489, 394839211, 395330696, 396089287, 397732277]
824.6C97732277J872177K333107L134003L060074K991523L286057M473686L051109
832.3D21934013K035103K311897J590615K179107K102967K188835K580261K683907
840D39606705K325859K824859L213082J693458J087494M58107P03697J305123J756439
848.7D54974823J650429J476326K456245K531929K238808J128082R69162J126442J123886
857.4D69676132J623268K089043J562500O88858K114944P81022J050300J771889m82636
866D80875320q43887k058334j921807k306785k958908l431931l053283j058198k93083
874.7D62949104M64058j405525j709595m92439k86064q5716j04599P1029r31015L01857
884.4D58771095l9367p58133p03316j021805m45938k089310p60116n55725j047097
$$ y = [397732277, 399604454, 401937561, 405071564, 408131638, 411123161, 414409218, 418882904, 421934013, 423969116, 426281013, 427871628, 430050735, 432153702, 434342537, 436922798, 439606705, 441932564, 444757423, 447970505, 449663963, 450751457, 451209564, 451913261, 453218384, 454974823, 456625252, 458101578, 460557823, 463089752, 465328560, 466456642, 467425804, 468552246, 469676132, 471299400, 473388443, 474950943, 475639801, 477754745, 478535767, 479586067, 481357956, 480875320, 480031433, 477973099, 476051292, 473744507, 470785599, 467353668, 464300385, 463242187, 462949104, 463413162, 462007637, 460298042, 459805603, 459519539, 459433823, 459329224, 459400253, 458469238, 458771095, 458731728, 457973595, 457270279, 456248474, 455802536, 453713226, 452953110, 452397385, 451350288]
893D51350288M57154J15280N40085P39288K92854j406707r47266p43942k332573j865120
902.7D46199341n25513J434784J358376K434387L454780L090897K802124J214180O45103
911.4D62108459n61866l41835o75621r03283o44416j610718j450195k407303k022591
920D51490631k217102k697983l009681l727265l391113l818398l135872l272743k884750
928.7D23335724k742615l165436j885757k380142k699280j782532j750831k284050
936.4D04645081j073151k97356p53212p31430j117668p29599j586761j833916j357422
945.1C95164566j169205m6158l50151q4800K63481M04816P8201p60384q38203j302796
954.8C91359367j297302k052688k406388k643966k585221j738815k342987k729874
$$ y = [451350288, 451807442, 451922722, 452462807, 453202095, 453494949, 452088242, 451140976, 450397034, 448064461, 446199341, 445673828, 447108612, 448466988, 450901375, 454356155, 457447052, 460249176, 461463356, 462108459, 461546593, 461204758, 460529137, 459625854, 458981438, 457370720, 455920525, 453513222, 451490631, 449273529, 446575546, 443565865, 439838600, 436447487, 432629089, 429493217, 426220474, 423335724, 420593109, 417427673, 415541916, 413161774, 410462494, 408679962, 406929131, 404645081, 403571930, 403274574, 402521362, 401789932, 400672264, 399942665, 398355904, 396521988, 395164566, 393995361, 393949203, 393599052, 393514252, 393777733, 394182549, 394260750, 393500366, 392662163, 391359367, 390062065, 388009377, 385602989, 382959023, 380373802, 378634987, 376292000, 373562126]
962.5C73562126k124367j402816k228089k480278j961632k633857k551384k058602
970.2C56121101j697769j843033k333030l140679l644714l678131l973999l993874
977.9C31815872m179535m050483m215699m676380m716110m542637m868126m947624
985.6B95619278m113255m597148n023098m376908m257088l693523l299427l699436
993.3B62559395l149529l008232k657242k531795l003388k195377k542496k490635
1001.1B40980701k315025k702408k588291k329864j181069j283703j948013k364826
1008.8B24267502j678314j456452j831512j334782k014408j982422j754455j163044
1016.5B11052113j702042k501507k172356k499046j612873j911125j897469k033233
$$ y = [373562126, 371437759, 370034943, 367806854, 365326576, 363364944, 360731087, 358179703, 356121101, 354423332, 352580299, 350247269, 347106590, 343461876, 339783745, 335809746, 331815872, 327636337, 323585854, 319370155, 314693775, 309977665, 305435028, 300566902, 295619278, 291506023, 286908875, 281885777, 277508869, 273251781, 269558258, 266258831, 262559395, 259409866, 256401634, 253744392, 251212597, 248209209, 246013832, 243471336, 240980701, 238665676, 235963268, 233374977, 231045113, 229864044, 228580341, 226632328, 224267502, 222589188, 221132736, 219301224, 217966442, 215952034, 213969612, 212215157, 211052113, 209350071, 206848564, 204676208, 202177162, 200564289, 198653164, 196755695, 194722462]
1024.2A94722462j930409j437168j943912r37272j447544j805725k259044j224022
1031.9A81737366k24133r01508l42369m81682J711101J449624L54557Q45871J073112
1040.6A85221939J620770O94942R60941N2319N22633N93166k00062j74084j493682
1049.3A87798882j010991j369304o70357j103821j196613m44832j333923m70982r33342
1058A79264717M66194l0346n7010J528492J438503K241154P75833J778488K231712
1066.6A89637737K000199J461773N88779J256638p7115O08883M97780L77293L79276
1075.3A96731243K9850P72095L32489M44145J61629J093693M53605M92783J161957
1084B01673489P60135J538811P59335K250099K208862J518574J571045P22675J472454
$$ y = [194722462, 192792053, 191354885, 189410973, 188473701, 187026157, 185220432, 182961388, 181737366, 181513233, 180611725, 180269356, 179787674, 181498775, 182948399, 183302956, 184148827, 185221939, 186842709, 187537651, 188498592, 188550911, 189073544, 189666710, 189466648, 189292564, 187798882, 186787891, 185418587, 184748230, 183644409, 182447796, 182002964, 180669041, 180198059, 179264717, 179730911, 179700565, 179643555, 181172047, 182610550, 184851704, 185627537, 187406025, 189637737, 191637936, 193099709, 193688488, 194945126, 194868011, 195476894, 195974674, 196351967, 196731243, 196761093, 197533188, 197865677, 198309822, 198471451, 199565144, 200018749, 200511532, 201673489, 202433624, 203972435, 204731770, 206981869, 209190731, 210709305, 212280350, 213003025, 214475479]
1092.7B14475479J484909J926804J393699R20353R70383J820602J532708J23901J440163
1101.4B26089001J102829J027851J001606J332569J644401L28751O95915O35586J251087
1110B35109596Q47035J68571Q30631P99504Q85887R61056J195945J47038L41034O12488
1119.7B41898785j29261L2634m5852K13909j03684M92497J393375J579209J024208
1128.4B46355820J250286K462044K072925J791134J032639J520175K286187K228603
1136.1B60999813J916828J512966K552662J819878J415253J610851J292686J407605
1143.8B74528542R18655L57017q7280O24199M79488P420j62105p33243l37619P4291
1153.4B75669365M31442j058979j639118m89883o18134q95958j156998k49176m45118
$$ y = [214475479, 215960388, 217887192, 219280891, 220201244, 221171627, 222992229, 224524937, 224648838, 226089001, 227191830, 228219681, 229221287, 230553856, 232198257, 232527008, 233222923, 233858509, 235109596, 235956631, 236125202, 236955833, 237755337, 238641224, 239602280, 240798225, 240945263, 241286297, 241898785, 241769524, 241802158, 241756306, 241970215, 241866531, 242359028, 243752403, 245331612, 246355820, 247606106, 250068150, 252141075, 253932209, 254964848, 256485023, 258771210, 260999813, 262916641, 264429607, 266982269, 268802147, 270217400, 271828251, 273120937, 274528542, 275447197, 275804214, 275716934, 276341133, 276820621, 276828041, 276665936, 275932693, 275595074, 275669365, 276100807, 275041828, 273402710, 272912827, 272294693, 271398735, 270241737, 269992561, 269547443]
1162.1B69547443q44879N02758J618462J656513J377106K344188K312527K557621L208943
1170.8B84280682L274002L097171K455941K659282L217202L411541L117637L146191
1178.5C08659649L236656L078728K776966K792702K617607J747627J574440J796150
1186.2C28280525J681061J316376J370620J190529J021805N74303l7384J76124l27377
1194.9C35246582o11191l02276l98331q60062j235580j075096q49419r76105r12246
1203.6C28026276n73655j101112j357765m11873K66953p7515k93923q3427m90646k44904
1213.2C23658409j87302p43331l03231l58123n26772k33994o0005k02331o60401o54335
1222.9C19728584n54542k97146m04301j010666j176452q64926l69949n53494q94222
$$ y = [269547443, 268702564, 269205322, 270823784, 272480297, 273857403, 276201591, 278514118, 281071739, 284280682, 287554684, 290651855, 293107796, 295767078, 298984280, 302395821, 305513458, 308659649, 311896305, 314975033, 317751999, 320544701, 323162308, 324909935, 326484375, 328280525, 329961586, 331277962, 332648582, 333839111, 334860916, 335435219, 335397835, 335573959, 335246582, 334635391, 334333115, 333934784, 333074722, 331839142, 330764046, 329914627, 328938522, 328026276, 327452621, 326351509, 324993744, 324581871, 324848824, 324771309, 324477386, 324393959, 323903313, 323658409, 323471107, 322727776, 322424545, 322066422, 321539650, 321305656, 321245651, 321043320, 320382919, 319728584, 319174042, 318876896, 318472595, 317461929, 316285477, 315420551, 315050602, 314497108, 313602886]
1231.5C13602886n68600k53200m00047l95375j18923k64015l23238m44413l33385l5038
1241.2C10466652k04830k89498o73332m39606J07136j39904m82025o24905k62775j4210
1250.8C07442703p1754l15285j45054K21920O0425l0098j29204J35727k1229k1820
1260.5C07126331L52249J95542N77564O45905N18303M89902P69863J070919Q47893
1269.2C12594471Q70724R44729R98935Q81787J081791R69963Q90541J097908R62524
1277.8C21293373J417389J471481R42154P55577R67179J356048J774254J578026J379013
1286.5C32934494J309891P04498R60083J278458J234894P39707Q97141J053085N30892
1295.2C41643143Q90655M31442L75443K50587K060L87192K95067L73993q2283J0643
$$ y = [313602886, 313034286, 312781086, 312381039, 311985664, 311866741, 311602726, 311279488, 310835075, 310501690, 310466652, 310261822, 309972324, 309298992, 308859386, 308966522, 308826618, 308344593, 307719688, 307456913, 307442703, 307370949, 307055664, 306910610, 307132530, 307192955, 307162857, 307033653, 307169380, 307148151, 307126331, 307478580, 307674122, 308251686, 308897591, 309415894, 309905796, 310675659, 311746578, 312594471, 313465195, 314409924, 315408859, 316290646, 317372437, 318342400, 319232941, 320330849, 321293373, 322710762, 324182243, 325124397, 325879974, 326847153, 328203201, 329977455, 331555481, 332934494, 334244385, 334948883, 335908966, 337187424, 338422318, 339162025, 340059166, 341112251, 341643143, 342533798, 342965240, 343340683, 343591270, 343593330, 343980522, 344275589, 344649582, 344567299, 344577942]
1304.8C44577942k64473p92885m81644m85420p44133r33761n45845n52750l00484k35290
1314.5C39241257o76308j78795l1166o7367J11770M78134R33800J028786P71980P64313
1324.1C42376404J016006O98128N93262L5743m42619m46014m44947m54979n76553o43616
1333.8C41710815o91108j75247n8327K46696K10572k72294L91121J07727N06974R97963
1343.4C42974892R64203O51893M46663R55086M67529M88281Q2016l06129l76053n41191
1353.1C45807190k71683q04596l77846j75094l30467n73883m13628l12500n59769M349
1362.7C41992073j311073l04108j05133j029472m41628p27386q31986o28509j84174
1371.4C36428604j31950R3155j48087m43344N47562k77367j20392K8076J145l06473
$$ y = [344577942, 344313469, 343520584, 343038940, 342553520, 341809387, 340875626, 340329781, 339777031, 339476547, 339241257, 338564949, 338386154, 338354988, 338287621, 338399391, 338877525, 339811325, 340840111, 341612091, 342376404, 343392410, 344090538, 344683800, 344719543, 344276924, 343830910, 343385963, 342930984, 342354431, 341710815, 341019707, 340844460, 340786133, 341032829, 341243401, 340971107, 341362228, 341469955, 341976929, 342974892, 343939095, 344590988, 345037651, 345992737, 346460266, 346948547, 347030563, 346724434, 346348381, 345807190, 345535507, 344730911, 344353065, 344177971, 343847504, 343273621, 342859993, 342547493, 341987724, 341992073, 340681000, 340376892, 340271759, 339242287, 338800659, 338073273, 337241287, 336612778, 336428604, 336296654, 336389809, 336241722, 335798378, 336345940, 336068573, 335948181, 335976257, 335977402, 335670929]
1381C35670929o63910l05557j282692q71277o17065n95246j579323j582412m59175
1389.7C27714272j580506j572151j446037j162911j902542l034534j887169k296696
1397.4C12831726j809959l214798k773857j370545j944580j828022j653480k461377
1405.1B95775108k809105j693401j898460k093144j684551j695576j435547j671161
1412.8B80794163j056900j082745j351967p77588o53343L88889k800922j022720R26780
1421.5B73363647p8067M93450o15463N33065Q79746J74522Q46234N07488J081028L75366
1431.2B77561016J141358J210536Q63533J912957J573848J264401R80778K276134J296005
1439.8B90080566J092492J593113J063156J759166Q80070J139546J284790J770820
$$ y = [335670929, 335007019, 334701462, 333418770, 332547493, 331930428, 331335182, 329755859, 328173447, 327714272, 326133766, 324561615, 323115578, 321952667, 320050125, 317015591, 315128422, 312831726, 311021767, 307806969, 305033112, 303662567, 301717987, 299889965, 298236485, 295775108, 292966003, 291272602, 289374142, 287280998, 285596447, 283900871, 282465324, 280794163, 279737263, 278654518, 277302551, 276524963, 275871620, 276260509, 273459587, 272436867, 273363647, 273285580, 273779030, 273163567, 273696632, 274576378, 274750900, 275597134, 276104622, 277185650, 277561016, 278702374, 279912910, 280776443, 282689400, 284263248, 285527649, 286508427, 288784561, 290080566, 291173058, 292766171, 293829327, 295588493, 296468563, 297608109, 298892899, 300663719]
1447.6C00663719R73377O57025J849575J102485J644707R00612J784554K431411K365151
1456.2C14372616K733898n74780K862721J398735K682686K239914J719665K523651
1464C29959106N37644K033958J884690K938499K749748K796822L649330K392311L607521
1472.6C52549629K848931L510398L026734K428207K577820K444382K563286K219238
1480.3C74168625K372131J797219K007484K112503J608734J574211O24123O75430J477242
1489C88417702m31099p75643P49321O61278k03934n55152n01519m426918m24766j168518
1498.7C81340752k948037k51274j181144j170884p05947P29065O55174l173104l031196
1507.3C70263405j277123J03608j610146j6213r90371j718865k8724r56192j79444
$$ y = [300663719, 301637096, 302294121, 304143696, 305246181, 306890888, 307791500, 309576054, 312007465, 314372616, 317106514, 316531734, 319394455, 320793190, 323475876, 325715790, 327435455, 329959106, 330496750, 332530708, 334415398, 337353897, 340103645, 342900467, 346549797, 348942108, 352549629, 355398560, 358908958, 361935692, 364363899, 366941719, 369386101, 371949387, 374168625, 376540756, 378337975, 380345459, 382457962, 384066696, 385640907, 386265030, 386940460, 388417702, 387986603, 387210960, 387960281, 388621559, 388417625, 387862473, 387360954, 382934036, 382509270, 381340752, 378392715, 378141441, 376960297, 375789413, 375083466, 375812531, 376467705, 373294601, 370263405, 368986282, 369089890, 367479744, 367463531, 366473160, 364754295, 364725571, 363769379, 363589935]
1516C63589935r92050k761383M85115J216011p32002k064743j24054R91554K255287
1524.7C61863670N36957Q07190J052399J1863N82428P57027O40526L03345L44543k001343
1534.3C64898605Q53806J618271J265220K158509p29103l079148R08737J076317k91214
1543C68680000J010742J684952m16984J804886J041374R51729J315536L319R54475
1551.7C77030029K47155P23381r76944l67546J654815J477356j017990j663437l35998
1560.4C76770821p75643O44036p41883r02405k313308k299080r60426j758996o15081
1569.1C67048035o678887j780777j406326l154945k652398k498664j158333j1669617
1576.8C36048088j869583l228188m284515l409843m725781l351288n620975l523712
$$ y = [363589935, 362597885, 359836502, 360321617, 361537628, 360805626, 358740883, 358616829, 359608383, 361863670, 362400627, 363207817, 364260216, 364272079, 364854507, 365611534, 366252060, 366555405, 366899948, 364898605, 365752411, 367370682, 368635902, 370794411, 370065308, 366986160, 367894897, 368971214, 368680000, 369690742, 371375694, 370958710, 372763596, 373804970, 374756699, 376072235, 376075554, 377030029, 377277184, 378000565, 377023621, 376656075, 378310890, 379788246, 378770256, 377106819, 376770821, 375995178, 376639214, 375897331, 374994926, 372681618, 370382538, 369422112, 367663116, 367048035, 360369148, 358588371, 357182045, 354027100, 351374702, 348876038, 347717705, 336048088, 334178505, 330950317, 326665802, 323255959, 318530178, 315178890, 309557915, 306034203]
1584.5C06034203m837876m367332m186497n038700l274441n542698l235740n341702
1592.2B70209217l266334l419056m560166k996445m914798k077694m530125k740288
1599.9B41704311l624305k930737j425285l551445j182709l501892r45835k848034
1607.6B21694069j805992j229496k524529M1905k575226r8171k300301K33212P17983
1616.3B12153454n010395J328029j209507J096840j386585P66716n68867k255973J534862
1625B06448574n48611K101555j449222Q13465N78518L55415M78878k38647K633895
1633.7B11173820k01091J823539j095867J815415J020603O96182K234097p5188K213745
1642.4B19605255J58405K103425J904888o18191K684955j108188L315201R22851K968292
$$ y = [306034203, 301196327, 296828995, 292642498, 287603798, 284329357, 278786659, 275550919, 270209217, 266942883, 263523827, 258963661, 255967216, 251052418, 248974724, 244444599, 241704311, 238080006, 235149269, 233723984, 230172539, 228989830, 225487938, 224542103, 221694069, 219888077, 218658581, 216134052, 216175957, 213600731, 213502560, 211202259, 211435471, 212153454, 207143059, 208471088, 207261581, 208358421, 206971836, 207738552, 207169685, 204913712, 206448574, 205899963, 208001518, 206552296, 207365761, 207944279, 208299694, 208778572, 208539925, 211173820, 210972729, 212796268, 211700401, 213515816, 214536419, 215232601, 217466698, 217391510, 219605255, 219763660, 221867085, 223771973, 223153782, 225838737, 224730549, 228045750, 228968601, 231936893]
1651B31936893K451821j014195O31886O4278M200763J358147K310181J201629K487698
1659.7B45629101K624893J802196L237877M35143L818283K450027L130265K881298
1667.4B66009083K679252M160328J743794N024452J991005L959885M057312L411750
1675.1B93036861L047066L166428M940567L448658M940758K852363M220047N886154
1682.9C25538902L405876L473626J670150O399308M639587M374580N071907M196053
1690.6C58769989M618416M356880N386009N161934N178528J685829N667343O290589
1698.3C97115517N596847N121231j019935P340889N850296M564552L442078L748931
1706D31760406K792435K428742M338760L082542K307969K855262K990609K948608J123924
$$ y = [231936893, 234388714, 233374519, 234006405, 234070683, 238271446, 239629593, 241939774, 243141403, 245629101, 248253994, 250056190, 253294067, 253729210, 257547493, 259997520, 263127785, 266009083, 268688335, 272848663, 274592457, 279616909, 281607914, 285567799, 289625111, 293036861, 296083927, 299250355, 304190922, 307639580, 312580338, 315432701, 319652748, 325538902, 328944778, 332418404, 334088554, 340487862, 345127449, 349502029, 354573936, 358769989, 363388405, 367745285, 373131294, 378293228, 383471756, 385157585, 390824928, 397115517, 402712364, 407833595, 406813660, 414154549, 420004845, 424569397, 428011475, 431760406, 434552841, 436981583, 441320343, 444402885, 446710854, 449566116, 452556725, 455505333, 456629257]
1714.7D56629257J267014L106460K327080k749863K813149L467293K334404K180671
1722.4D71375465J060028P35589J794662J680603J259537J805038K273674j25427O76155
1731.1D82535324M416542M553909j28440m462624L864784M206429K092018L242073
1738.8E00320015J606827p17011M761048M185371J847954K159271L818245L865814
1746.5E21847534L469353L718529K147751N257682L039666J514968N626030M042702
1754.2E50664215M039726M145584J131592K223397L572731L283157L872909m3029K32620
1762.9E73122902M376221K986145K188568K354622K287483p68929K449532M805641
1770.6E93802185J096001j482849j739006M232559K914886P2098K831879J446724J806869
$$ y = [456629257, 457896271, 461002731, 463329811, 460579948, 463393097, 466860390, 469194794, 471375465, 472435493, 473171082, 474965744, 476646347, 477905884, 479710922, 481984596, 481859169, 482535324, 486951866, 491505775, 491377335, 486914711, 490779495, 494985924, 497077942, 500320015, 501926842, 501209831, 505970879, 510156250, 512004204, 514163475, 517981720, 521847534, 525316887, 529035416, 531183167, 536440849, 539480515, 540995483, 546621513, 550664215, 554703941, 558849525, 559981117, 562204514, 565777245, 569060402, 572933311, 572890282, 573122902, 577499123, 580485268, 582673836, 585028458, 587315941, 586547012, 588996544, 593802185, 594898186, 593415337, 591676331, 595908890, 598823776, 598895874, 601727753, 603174477, 604981346]
1779.3F04981346O95610o31218J207314J733474J715775k86179P35894K132950J771125
1788F14056091J254769K105598J039086L95889r44519q79250L512573J245156l0060
1796.7F21755333J509972K311630J453895q60138K429696M88281N33333J548576K68517
1805.3F31439095R81330N61333Q01201J361198J864319k90069J016311J847878J09863
1814F39692459Q64945M6310Q19626J449M46854J592255N72509J241074K71378J623916
1823.7F47172775J528168k352600l29514J989746K308274P82699l148269n4245K653503
1832.3F50550537Q21686Q63876P82776M94690N45349p10907R26361r3689M63791P78351
1842F55422821J763153K007446n292053J700592K602997N14298m33350J04675R56040
$$ y = [604981346, 605676956, 605045738, 606253052, 607986526, 609702301, 609416122, 610152016, 612284966, 614056091, 615310860, 617416458, 618455544, 618851433, 617906914, 617027664, 620540237, 621785393, 621755333, 623265305, 625576935, 627030830, 626170692, 628600388, 629088669, 629622002, 631170578, 631439095, 632420425, 632981758, 633782959, 635144157, 637008476, 636718407, 637734718, 639582596, 639692459, 640557404, 640603714, 641423340, 641424789, 641871643, 643463898, 644036407, 645277481, 645548859, 647172775, 648700943, 646348343, 646018829, 648008575, 650316849, 651099548, 647951279, 647897034, 650550537, 651372223, 652236099, 653018875, 653513565, 654058914, 653348007, 654274368, 654180679, 654644470, 655422821, 657185974, 659193420, 653901367, 655601959, 658204956, 658719254, 658285904, 658390579, 659346619]
1850.7F59346619m23279M98276K517O57349M68140K09579J185303K72751N53894m52423
1860.3F62318726j5641j75628L02276N76706J8006J184234J21842J284256n19715j234741
1869.9F63860321J214981P26700N39017m95301J21308j66931M81338P25708K61841
1878.6F67268982N70450M5776O21491l16773K44217j82877k27813M96750j96915J647263
1888.3F69970551J76696j445388O40792J213990J38778o0730K95487j074753K22015
1896.9F70077438K24915J16424K48337L93982M39224k25296R51310p9728j21994O7063
1906.6F72091675j82419J35651k81907M502k54669R64660K10724M60510P83387k1134
1916.2F73910980R13697k122040j149903O40335O44837J054916m88739j74103N85556
$$ y = [659346619, 658923340, 659421616, 659424133, 660081482, 660549622, 660759201, 661944504, 662217255, 662771149, 662318726, 662303085, 662127457, 662429733, 663006439, 663024445, 664208679, 664330521, 665614777, 665095062, 663860321, 665075302, 665802002, 666341019, 665845718, 665967026, 665800095, 666281433, 667007141, 667268982, 667839432, 667885208, 668506699, 668189926, 668434143, 668251266, 668023453, 668520203, 668323288, 669970551, 670147247, 668701859, 669342651, 670556641, 670695419, 670634689, 670930176, 669855423, 670077438, 670302353, 670418777, 670667114, 671061096, 671500320, 671275024, 672226334, 672146606, 672024612, 672091675, 671909256, 672044907, 671763000, 671767502, 671512833, 672477493, 672688217, 673148727, 673932114, 673910980, 674824677, 672702637, 671552734, 672193069, 672837906, 673892822, 673404083, 673229980, 673815536]
1924.9F73815536O56281n3711n34m09088l97797j08566n98679m9209j35880Q72345
1934.6F73590698M03977K33764K66037l02963K58179p57370N38559l11432j887283
1943.2F72032166O02417R65194M11225m33197K63824j0376J93863K59476n93338o62384
1952.9F73028870m58908N55496q0338L17002K73132j96304L09448j47553l36685q71429
1962.5F72392731O4316K12173K8610K31018l65600j54496n0506M57153J68991K15302
1972.2F73199692m95758n17350K72751l24249J21231k71835L58124M05807k03171J79749
1981.8F72724991o1035K6474o31104j39541O8054l9597m55322n87845R58557L56217
1991.5F72219849q30384m77981N73501R0790l39737k18658o15540j32065n03387J47476
$$ y = [673815536, 674471817, 674418106, 674417572, 674008484, 673610687, 673502121, 672903442, 672854233, 672718353, 673590698, 673994675, 674228439, 674494476, 674191513, 674449692, 673692322, 674230881, 673919449, 672032166, 672634583, 673599777, 674011002, 673577805, 673841629, 673831253, 674025116, 674284592, 673691254, 673028870, 672569962, 673125458, 673045120, 673362122, 673635254, 673438950, 673748398, 673600845, 673264160, 672392731, 672457047, 672669220, 672697830, 672928848, 672563248, 672408752, 672358246, 672815399, 672984390, 673199692, 672703934, 672186584, 672459335, 672135086, 672256317, 671984482, 672342606, 672748413, 672545242, 672724991, 672663956, 672690430, 672059326, 671919785, 671987839, 671948242, 671492920, 670905075, 671863632, 672219849, 671389465, 670911484, 671484985, 671575775, 671236038, 671017380, 670401840, 670269775, 669766388, 669913864]
2001.1F69913864J94779K12249J60599m38919L41034l30734q2169r1019m03595l40805
2010.7F69135284k13928J65329m29077K05307k60849l83911l59192l45993J25809k60773
2020.4F67378006K13242o27518r8725Q8044k06757K54669l21197Q774o73523k69852
2030F65745163r7733k55966o4239l67661K3957l45536K80915j91575k92587J38779
2039.7F64573517l06778n01938q00018M0283k77023L95736K90070l72696o0349l72161
2049.3F62608643L94516n36347l06702l7612l47825M6692k93502J75476k50245J71967
2059F61625061r0408j00708K9678o50558R6054l61863j56631j04599K18887J41754
2068.6F60646667m23202K46887o3324J46942k48718l36075o74133o23093M14276K42844
$$ y = [669913864, 670108643, 670320892, 670481491, 670042572, 670383606, 670052872, 669970703, 669879684, 669476089, 669135284, 668921356, 669086685, 668657608, 668862915, 668602066, 668218155, 667858963, 667512970, 667638779, 667378006, 667591248, 666963730, 666865005, 666953049, 666746292, 667000961, 666679764, 666688538, 666015015, 665745163, 665647430, 665391464, 665327225, 664959564, 664983521, 664637985, 664918900, 664727325, 664434738, 664573517, 664266739, 663764801, 662964783, 663005066, 662728043, 663123779, 663413849, 663041153, 662980804, 662608643, 663003159, 662466812, 662160110, 662122498, 661774673, 661821365, 661527863, 661703339, 661453094, 661625061, 661534653, 661433945, 661463623, 660813065, 660909119, 660547256, 660390625, 660286026, 660504913, 660646667, 660223465, 660470352, 660407028, 660553970, 660305252, 659969177, 659295044, 658671951, 659086227, 659329071]
2078.2F59329071L63388o5765n8213l23028L9444L586o02417m6006n73959j90658j98441
2088.9F57677002M5624j61438l14560L57971l78952p4081n05906N2414N9433o97479
2098.5F56060028k41928k66876L52173k27127J78451j25885l36075K70920m57840q5983
2108.1F55119858n36957j82266j47324o4545O1570l89252J82343l08152R3308j29318
2117.8F53699265j60828m28162n42831K57873k27584M06570k74353J5869L09296j65634
2127.4F52889481L40576n84259m29764m12674l4943k87857j70822P32880K38571K75497
2137.1F52556686l39965K48031J73874j93024n3100o02036j12304j61438K33230r8800
2146.7F51651154N2566L17230k899M05274j18485j30844k10037O4010l52096j51139
$$ y = [659329071, 659692459, 659626694, 659568481, 659245453, 659284897, 659288483, 658686066, 658640060, 658066101, 657875443, 657677002, 657722626, 657561188, 657246628, 657604599, 657225647, 657151566, 656645660, 656698074, 656757507, 656060028, 655818100, 655551224, 655903397, 655676270, 655854721, 655728836, 655392761, 655663681, 655205841, 655119858, 654582901, 654400635, 654253311, 654188766, 654250336, 653861084, 654043427, 653735275, 653828583, 653699265, 653538437, 653110275, 652567444, 652825317, 652597733, 653004303, 652729950, 652745819, 653055115, 652889481, 653230057, 652645798, 652216034, 651803360, 651768417, 651480560, 651309738, 652042618, 652281189, 652556686, 652216721, 652464752, 652638626, 652445602, 652392502, 651790466, 651678162, 651516724, 651749954, 651651154, 651703720, 652020950, 652018051, 652423325, 652304840, 652173996, 651963959, 652027969, 651675873, 651524734]
2156.4F51524734N07813j40305J96839K1057L78952P7057j73721r0409k06985K71072
2166F52366104n22537J62735J80588N9890N87235L02200K40479l47061j81199n15060
2175.6F52333374k33917j42594J01242P67441K58255L24097l96805j13144J28861K98385
2185.3F53325195J51444m24042K94571k50397J57471o1722j4725N30167J04141K77329
2194.9F54089432l21198J55564k14005k92435p7591j53045M97284j10321J67999J68457
2204.6F53910141N71060K31247m05044K212j71051K70462m55627r461M33655R7351
2214.2F54474945P1869j95847L80555m5166J31759o9427j02005m5319k93579K26669
2223.9F54534454j73797L70483J22147R8877K19726l44085l04108k86102K55584m83322
$$ y = [651524734, 652032547, 651892242, 652089081, 652110138, 652489090, 652566147, 652392426, 652302017, 652095032, 652366104, 651843567, 652006302, 652186890, 652246780, 652834015, 653136215, 653376694, 653029633, 652848434, 652333374, 652099457, 651956863, 652058105, 652825546, 653083801, 653407898, 653011093, 652897949, 653026810, 653325195, 653476639, 653052597, 653347168, 653096771, 653254242, 653192520, 653177795, 653707962, 653812103, 654089432, 653768234, 653923798, 653709793, 653417358, 653339767, 653186722, 653684006, 653573685, 653741684, 653910141, 654481201, 654712448, 654307404, 654309616, 654138565, 654409027, 653953400, 653943939, 654377594, 654474945, 654546814, 654350967, 654731522, 654686356, 654818115, 654748688, 654646683, 654601364, 654307785, 654534454, 654360657, 654731140, 654853287, 654952164, 655171890, 654827805, 654523697, 654237595, 654493179, 654009857]
2233.5F54009857P7133M40369j39770J41677J38092L10059l75214J70594M3640j79672
2243.2F54636765L7307n84564m3564J62049N37948k73514j86233K94571l37525n1269
2252.8F54191971m40827O9199O0272J61820K90603j10778K50473O561K61688K2278
2262.4F54763260K3270j90125l65524J2970Q3160K44293k74124J3275l33709n1804
2272.1F53924942K94342j07117K63977k07138p7057k94036n5008q7357n0812K68555
2281.7F53873291k58636M59823j86081j33133k23846n03769J12152m14963K22702m04129
2291.4F52543411j56402M62188N2567M13437K8915L4943l91388m1657J69602m3106
2301F53072510J07574k8305j37634n57480L59497L4332j56631L63159M17938K83509
$$ y = [654009857, 654086990, 654527359, 654387589, 654529266, 654667358, 654977417, 654602203, 654772797, 654816437, 654636765, 654674072, 654089508, 654045944, 654207993, 654745941, 654472427, 654286194, 654580765, 654243240, 654191971, 653751144, 653820343, 653880615, 654042435, 654333038, 654222260, 654472733, 654479294, 654740982, 654763260, 654786530, 654596405, 654230881, 654243851, 654327011, 654571304, 654297180, 654310455, 653976746, 653924942, 654219284, 654112167, 654376144, 654169006, 654091949, 653797913, 653742905, 653655548, 653604736, 653873291, 653614655, 654074478, 653888397, 653755264, 653531418, 653027649, 653139801, 652724838, 652947540, 652543411, 652387009, 652849197, 652901764, 653315201, 653344116, 653379059, 652987671, 652946014, 653115616, 653072510, 653180084, 653151779, 653014145, 652456665, 652816162, 652850494, 652693863, 653057022, 653474960, 653758469]
2310.7F53758469p73240l81j56326N7220N5008o29730O06766N06515K55203l37143
2320.3F53342361l55072o2561L47824N26429N9204O75659l14560o53152n50156K91824
2329.9F53307800L96958n67017l28979q62961K36969J50604n06134k46506R12171L66974
2339.6F52859879j360016L98788L97263M16565l65906j028595m30145j168061r02176
2348.3F48817596O61698K221527O23321o30416o38810r0103J409989q6213L58811n94025
2357.9F52053375K27127Q54721r34372j404266k93808J496582j217270l85208l4103
2366.6F50362778n3711k26975k041168o67496m82559m51584p43942L60260M17023j236420
2376.2F45236206j115951o48880q6518p62253l14102O11l88871k59552o34842k74582
$$ y = [653758469, 652985229, 652984848, 652828522, 652885742, 652940750, 652311020, 652917786, 653424301, 653679504, 653342361, 652987289, 652924728, 653272552, 653798981, 653858185, 654533844, 654219284, 653566132, 653015976, 653307800, 653704758, 653137741, 652808762, 651945801, 652182770, 652333374, 651827240, 651580734, 652492905, 652859879, 651499863, 651898651, 652295914, 652712479, 652346573, 651317978, 650887833, 649719772, 648817596, 649479294, 651700821, 652324142, 651693726, 651054916, 650964813, 652374802, 652288589, 652647400, 652053375, 652280502, 653135223, 652200851, 650796585, 650502777, 651999359, 650782089, 650396881, 650362778, 650309067, 650082092, 648040924, 647373428, 646890869, 646439285, 645695343, 646055603, 646472626, 645236206, 644120255, 643471375, 643384857, 642622604, 642308502, 642309113, 641920242, 641660690, 641025848, 640751266]
2385.9F40751266m16488l58849l90014l61405j11351m18396j5068k2392O6757k06604
2395.5F38517456l31421l11355n35355j15280j21689k10457n73234j63079j20582q5335
2405.2F35949669K56996n21889m27017n58281j80168J30577l80402n78727n94292l00751
2414.8F32795715l47290J25504m62723o16150N9128k79808l71056m60624j99509n40772
2424.5F29702415l03649Q3847k23923l48168l43971J19477m85077m32663m50096m88587
2434.1F26829605k49405o43654j78604m88930j12114N7335j87606M1008n10559n34935
2443.7F24022141o21987n04837n62096j80511J1520k01492j77155n06172k20031p52640
2453.4F20306740l30315j97983p35817j12953l38020m24004o15005m49677n86242n18685
$$ y = [640751266, 640334778, 639975929, 639585915, 639224510, 639113159, 638694763, 638679695, 638657303, 638724060, 638517456, 638186035, 637874680, 637339325, 637224045, 637102356, 636891899, 636318665, 636155586, 636035004, 635949669, 636206665, 635684776, 635257759, 634699478, 634519310, 634649887, 634269485, 633690758, 633096466, 632795715, 632448425, 632573929, 632111206, 631495056, 631554184, 631274376, 630903320, 630442696, 630243187, 629702415, 629398766, 629482613, 629258690, 628910522, 628566551, 628686028, 628200951, 627768288, 627318192, 626829605, 626580200, 625936546, 625757942, 625269012, 625156898, 625214233, 625026627, 625067635, 624557076, 624022141, 623400154, 622895317, 622333221, 622152710, 622164230, 621962738, 621785583, 621279411, 621059380, 620306740, 619976425, 619778442, 619042625, 618929672, 618591652, 618167648, 617552643, 617102966, 616516724, 615998039]
2463F15998039j37214m02222m35944q32252L204N2910k03972l16887q75473k54516
2472.7F12595673m23432m43611n35545q6556J755n57938m27436r11217m41590m07333
2482.3F08362770m46205o57654o33736j18522o36215j51444l99208n55878m98924m61960
2492F03803024j56097n85747m28123p22542m62876n40733n73616l89976p35970j05133
2501.6E99102211k31209m74968q37097m63219l75442q55827m22974o87218j02882k51122
2511.2E94400253n05333j54724m23584m35066q57925o64063n90019l70941j18180l92570
2520.9E89887848o38390n79681p1983k50931k16370n15823m91257l06816n98373m75350
2530.5E85742874n11932k34108n11360m07868k77748o0806R7771p69730n66826n46646
$$ y = [615998039, 615860825, 615458603, 615022659, 614190407, 614193611, 614246521, 614042549, 613725662, 612850189, 612595673, 612172241, 611728630, 611193085, 611106529, 611108284, 610550346, 610122910, 609211693, 608770103, 608362770, 607916565, 607258911, 606625175, 606506653, 605870438, 605718994, 605319786, 604763908, 604264984, 603803024, 603646927, 603061180, 602633057, 601910515, 601447639, 600906906, 600333290, 599943314, 599207344, 599102211, 598871002, 598396034, 597558937, 597095718, 596720276, 595864449, 595441475, 594754257, 594651375, 594400253, 593894920, 593740196, 593316612, 592881546, 592023621, 591359558, 590769539, 590398598, 590280418, 589887848, 589249458, 588669777, 588597794, 588346863, 588130493, 587614670, 587123413, 586816597, 586218224, 585742874, 585230942, 584996834, 584485474, 584077606, 583799858, 583739052, 583836823, 583067093, 582500267, 581953621]
2540.2E81953621n70450p57599o91604k02675j57738r0256p53937k84271j97944m62647
2549.8E77784500l89671o89583l02200m65775m20227p63130n91583l10364m17137K23312
2559.5E73658142l61977m74815k91557n75714p71370m62685j92795m28428p2060m31061
2569.1E69595680k70462k81372p11136l84216k12822k70042r03168q65250o19621N6572
2578.7E65134163M0932o12603k69889m38195l56292o38733o13823k66838j72348l03040
2588.4E61503334p78198l03955n84984n18913k23847l10020m19731p13005m21830p42759
2598E56486092l63274l44620n08270k00844m75845m30718o40525m17710m76265n05943
2607.7E52122078p17888o43692j25008o26297n16128p10182j72921n6610p95593p41386
$$ y = [581953621, 581383171, 580625572, 579933968, 579731293, 579573555, 579483299, 578729362, 578445091, 578247147, 577784500, 577394829, 576705246, 576403046, 575937271, 575517044, 574753914, 574162331, 573851967, 573434830, 573658142, 573296165, 572821350, 572529793, 571954079, 571182709, 570720024, 570527229, 570098801, 570026741, 569595680, 569325218, 569043846, 568332710, 567948494, 567735672, 567465630, 566562462, 565697212, 565077591, 565134163, 565175095, 564562492, 564292603, 563854408, 563498116, 562859383, 562245560, 561978722, 561806374, 561503334, 560725136, 560421181, 559836197, 559317284, 559093437, 558783417, 558363686, 557650681, 557228851, 556486092, 556122818, 555778198, 555269928, 555069084, 554593239, 554162521, 553521996, 553104286, 552628021, 552122078, 551404190, 550760498, 550635490, 550009193, 549493065, 548782883, 548609962, 548553352, 547757759, 547016373]
2617.3E47016373j024475n00527l83377j45569m71763j122551m67453k99759l67279
2626E42233620o10848k45094m93355q06618m52346o75850o48995o13327k24762n96733
2635.6E36865692o64215l07999n12542o56815q74824k20032k86484n51147r10302q13331
2645.3E31068001r1934o21643l93868j45340l54118q34732p56455k94266o94885l04184
2654.9E26576576l64570o19355n43861n57404k99720n8899m18167r91097n89447o75545
2664.6E21458511n86471l70484n01060m13666j33781M8141n68428j59798n35316q17146
2674.2E17420502m6349k26364j64795p45392o52046m51317n70373k43721m81530m62226
2683.9E13376389n47104l59040m78973l25813l26386p49397k64702j59798n0354l97300
$$ y = [547016373, 545991898, 545491371, 545107994, 544962425, 544490662, 543368111, 542900658, 542600899, 542233620, 541622772, 541377678, 540884323, 540077705, 539625359, 538949509, 538300514, 537687187, 537462425, 536865692, 536201477, 535893478, 535380936, 534724121, 533849297, 533629265, 533342781, 532791634, 531881332, 531068001, 530976067, 530354424, 529960556, 529815216, 529461098, 528626366, 527869911, 527575645, 526880760, 526576576, 526212006, 525592651, 525048790, 524491386, 524191666, 524132767, 523714600, 522723503, 522134056, 521458511, 520872040, 520501556, 520000496, 519586830, 519453049, 519501190, 518932762, 518772964, 518237648, 517420502, 517374153, 517147789, 516982994, 516237602, 515585556, 515134239, 514563866, 514320145, 513838615, 513376389, 512829285, 512470245, 511991272, 511665459, 511339073, 510589676, 510324974, 510165176, 510114822, 509717522]
2693.5E09717522m65355l51067n85708n55001p62863m31328m44984m07753k71492j81809
2703.1E05260162k18734n14450k37542l77273l46260m64440m16794l77044n14832j38397
2712.8E01654396k90337k27928m64401k48299o0196o13136m47540l24631m81758n76744
2722.4D97919426k9373k7924j37787n36422q97713n6229m77600n62744k67677k40326
2732.1D94685631k94647n10903r6969l78495j1558J03187j73378J8349k60506m27360
2741.7D92653351n13573k40974l51105j90353k39220m52919j63689k05955q583m07448
2751.4D89879532l99857k95410p3509J38168p98568o24505p1716j69105l58849m8103
2761D87178078k85645o15921r5329k78359k40287n67589p82356m25072q8005n6381
$$ y = [509717522, 509252167, 508901100, 508315392, 507760391, 506997528, 506566200, 506121216, 505713463, 505441971, 505260162, 505041428, 504526978, 504289436, 503912163, 503565903, 503101463, 502684669, 502307625, 501792793, 501654396, 501364059, 501136131, 500671730, 500423431, 500363235, 499750099, 499302559, 498977928, 498496170, 497919426, 497890053, 497862129, 497724342, 497187920, 496290207, 496233978, 495756378, 495193634, 494925957, 494685631, 494390984, 493880081, 493783112, 493404617, 493393059, 493496246, 493322868, 493341217, 493080711, 492653351, 492139778, 491898804, 491547699, 491357346, 491118126, 490665207, 490501518, 490295563, 490286980, 489879532, 489479675, 489184265, 489110756, 489248924, 488450356, 487825851, 487754135, 487585030, 487226181, 487178078, 486892433, 486276512, 486181183, 485902824, 485662537, 485094948, 484312592, 483887520, 483799515, 483743134]
2770.7D83743134n83420k65389k78167l55874n09224o50367l65677n64308n88799n58128
2780.3D79023781l84941n10788j3581j45034q05474k77443m79850l72086n00183o31561
2789.9D74902840o14243p84874n42297o76651k21253p56950r20754l71055n69611n80253
2799.6D68864899q17566o99692j228142r35097j06620n01023p81898o68526k24151
2808.3D62902184n89905j032257j211472r31167p23801j128578q71544o94695o40144
2816.9D55078621p15561l87917n05333r27238q95805r84116p08885j461334j546669
2825.6D46945763r53141o78291n89447j082649p68013r14459r34563j182060j456604
2834.3D38386536j015778j141319j131134j639633j809655j815681j602936j576309
$$ y = [483743134, 483159714, 482894325, 482616158, 482260284, 481751060, 481100693, 480735016, 480170708, 479581909, 479023781, 478638840, 478128052, 478114471, 477969437, 477163963, 476886520, 476406670, 476034584, 475534401, 474902840, 474288597, 473503723, 472961426, 472284775, 472063522, 471306572, 470385818, 470014763, 469445152, 468864899, 468047333, 467347641, 466119499, 465184402, 465077782, 464576759, 463794861, 463126335, 462902184, 462312279, 461280022, 460068550, 459137383, 458413582, 457285004, 456413460, 455718765, 455078621, 454363060, 453975143, 453469810, 452542572, 451646767, 450662651, 449953766, 448492432, 446945763, 445992622, 445314331, 444724884, 443642235, 442874222, 441959763, 441025200, 439843140, 438386536, 437370758, 436229439, 435098305, 433458672, 431649017, 429833336, 428230400, 426654091]
2842D26654091k170181j855851k130470k510071k575111k262535k375679k561150j918144
2850.7D06294899j974487j332627j028022o71692k16904m73251R3307Q1749j64223
2859.4D00608749n14679l93981j09177m98238n46150o83975q87299j059074o10619
2868.1C95305557o38962j185569j048737p18307n92919q39081p11021q86765q32939
2876.7C87851257n23643n05257m51622p48367n61867n28641p79113j005707r40476
2885.4C81806564j027603j267891r30557j162834r50394r56306j303292j199607r13544
2894.1C72094536m29611j049881j111260q04558q28819o76536p11670p81365r46617
2902.8C64754219n22652q62121j184235j000786r02137n47600j171036j515198j412391
$$ y = [426654091, 424483910, 422628059, 420497589, 417987518, 415412407, 413149872, 410774193, 408213043, 406294899, 404320412, 402987785, 401959763, 401288071, 401071167, 400597916, 400691223, 400772972, 400608749, 400094070, 399700089, 399590912, 399092674, 398546524, 397862549, 396975250, 395916176, 395305557, 394666595, 393481026, 392432289, 391713982, 391121063, 390281982, 389570961, 388684196, 387851257, 387327614, 386822357, 386370735, 385622368, 385060501, 384531860, 383752747, 382747040, 381806564, 380778961, 379511070, 378580513, 377417679, 376467285, 375510979, 374207687, 373008080, 372094536, 371664925, 370615044, 369503784, 368699226, 367870407, 367193871, 366482201, 365700836, 364754219, 364231567, 363369446, 362185211, 361184425, 360282288, 359734688, 358563652, 357048454, 355636063]
2911.4C55636063j055375q86077j468468j725159j675300j752892k056618j601181
2919.2C43414993j205215r23462r12666j152001n09758l40957j12420M1123J01585
2927.8C38401222J07994N3597L96156L67279M02870j7776K65312P26013P73163R72710
2937.5C42448540P83500J146508N62248L08609J137733J494866R42077p2593K81868
2946.2C49033356O06041J031570J006127N13114O76880M71115O97289J99089O0463
2954.8C54295044P67517M66385K09007L88527P40585P11136N06020K78282P01332J255913
2964.5C60319748N47485L22838Q12492O61698O96945J144066Q02803N26428P78275
2973.2C66612778J015892Q41713N60531J115876J019477L74909K44636K90146K01187
$$ y = [355636063, 354580688, 353694611, 352226143, 350500984, 348825684, 347072792, 345016174, 343414993, 342209778, 341286316, 340373650, 339221649, 338711891, 338370934, 338258514, 338299637, 338401222, 338509216, 338562813, 338958969, 339326248, 339729118, 339711342, 339976654, 340702667, 341475830, 342448540, 343232040, 344378548, 344940796, 345249405, 346387138, 347882004, 348824081, 348751488, 349033356, 349639397, 350670967, 351677094, 352190208, 352867088, 353338203, 354035492, 354234581, 354295044, 355062561, 355528946, 355737953, 356126480, 356867065, 357578201, 358084221, 358362503, 359063835, 360319748, 360867233, 361190071, 362002563, 362664261, 363361206, 364505272, 365308075, 365834503, 366612778, 367628670, 368470383, 369030914, 370146790, 371166267, 371541176, 371785812, 372075958, 372277145]
2981.8C72277145N15595P51228o2904j5068K28195N58586O49605j67160N7831P9765
2991.5C74872818J79062R1438n23109n31159m01420j17150p3204Q4992m55780r24378
3001.1C72202110o40068m13399r7351r53407j168747j32255j8845n74989p08313o30684
3010.8C66864052m40865k37121r93958j112175n21698l79410m83932l83797l63312
3019.5C61947784q85849o69593p56455q10394l84140o88553r45206j055488p87697
3028.1C54964409p98149q15850o41708q39806q94966p62329m97436q56972r78775p25288
3037.8C47153130n99747o96678j027489q49228q09936q36640r78279p28302n54047
3046.5C40072784q18481o47736j019859j107140r95864q82378m83322p25022j069755
$$ y = [372277145, 372792740, 373543968, 373481064, 373465996, 373694191, 374252777, 374902382, 374735222, 374793053, 374872818, 375051880, 375143318, 374620209, 374089050, 373687630, 373570480, 373497276, 373582268, 373126488, 372202110, 371562042, 371148643, 371051292, 370097885, 368929138, 368796883, 368778038, 368203049, 367494736, 366864052, 366423187, 366186066, 365192108, 364079933, 363558235, 363178825, 362694893, 362311096, 361947784, 361061935, 360392342, 359635887, 358825493, 358441353, 357752800, 356807594, 355752106, 354964409, 354166260, 353350410, 352708702, 351868896, 350973930, 350211601, 349714165, 348857193, 347878418, 347153130, 346553383, 345856705, 344829216, 343979988, 343170052, 342333412, 341355133, 340626831, 340072784, 339254303, 338606567, 337586708, 336479568, 335483704, 334601326, 334118004, 333392982, 332323227]
3055.1C32323227q05130p14798j128311o23512m67644o19049n54505j066589r55353
3063.8C25388336q34236p28455o75315o95916m93850m63028q70018j226921p62730
3072.5C18637867r48734p02725k40192m38366p45659r79557k33707m83094o68049n45463
3082.1C12652321m82063o71654j472893o57482r29413p37991m4747r22451q11939o62861
3091.8C05258827m93145q79020p18041n51376j099453n31483o62098l93505l86257
3100.5B99544449p78446o09703q24337p10297q74367r06486q17223o30455o43272q70610
3110.1B91879253n70373n65262p98531j035995n60494l05938q30250q37898p15657
3118.8B85658855j012287j018352m00162n75790o82888m06361o57635p27386p32308
$$ y = [332323227, 331518097, 330803299, 329674988, 329051476, 328583832, 327964783, 327410278, 326343689, 325388336, 324554100, 323825645, 323150330, 322454414, 321960564, 321497536, 320627518, 319400597, 318637867, 317689133, 316986408, 316746216, 316307850, 315562191, 314582634, 314348927, 313865833, 313197784, 312652321, 312170258, 311498604, 310025711, 309368229, 308438816, 307700825, 307656078, 306733627, 305921688, 305258827, 304765682, 303886662, 303168621, 302617245, 301517792, 300986309, 300324211, 299930706, 299544449, 298766003, 298156300, 297331963, 296621666, 295747299, 294840813, 294023590, 293393135, 292749863, 291879253, 291308880, 290743618, 289945087, 288909092, 288348598, 288042660, 287212410, 286374512, 285658855, 284646568, 283628216, 283228054, 282652264, 281969376, 281563015, 280905380, 280177994, 279445686]
3127.5B79445686o95953q76598r87206q42304q29754q95863m60014l28960j095715
3136.1B72433319j085625p64255o49395q92773r01222m38824q52508j117916p04480
3144.8B65026321k52895p72762q05855m28200q83426n83802n95283n86891r38397j210670
3154.5B57968140o00472p13634o81744r07021l54175l66593j323814o32419o80333
3163.1B51707935r48314o57235p18688q05913r52148p34901n07012o71215q29964o88591
3172.8B44193954r14802p77893k63958n18360q76904m37813j58615j117649r92374
3181.5B38135586l51429p42150p01961n13096p03411p57179l17307p06730j111526
3190.1B32230797o07891n63526o39878p34005n88913m06265m45156q24490j109638
$$ y = [279445686, 278749733, 277873135, 276885929, 276043625, 275213871, 274318008, 273857994, 273529034, 272433319, 271347694, 270583439, 269934044, 269041271, 268140049, 267701225, 266848717, 265730801, 265026321, 264773426, 264000664, 263194809, 262766609, 261883183, 261299381, 260704098, 260117207, 259178810, 257968140, 257367668, 256654034, 255972290, 255065269, 254711094, 254344501, 253020687, 252388268, 251707935, 250759621, 250102386, 249383698, 248577785, 247625637, 246890736, 246383724, 245712509, 244882545, 244193954, 243279152, 242501259, 242237301, 241718941, 240842037, 240404224, 240245609, 239127960, 238135586, 237784157, 237042007, 236340046, 235826950, 235123539, 234366360, 234049053, 233342323, 232230797, 231622906, 231059380, 230419502, 229685497, 229096584, 228690319, 228245163, 227420673, 226311035]
3198.8B26311035o31885l27874l96423q96873p75929l83778l89099l37906p25784o41212
3208.5B20804272n13630o35147n94254m55608k32105n13134j002980q24814M5319k19364
3218.1B15858555q77571p52316n01156l18470o06670n65586p17602p95460n30014l66344
3227.8B09827366l04546p59793k59132L204l12424l36761p19128r46445q08506l02658
3237.4B05081177p68128o12793K67506l59650m99839k21310l27759o78844p13768j93005
3247B00973587m16241n94368o04457p65896k71168N6705q6059k16847q36181j146736
3256.7A96092339o63109k44503l9158K15015L0060n90630l53813k81696n83038o49720
3266.3A92931747p29065k20088m70028m86985l27263p28130k79503j44767k4605m73995
$$ y = [226311035, 225679150, 225351276, 224954853, 224057980, 223282051, 222898273, 222509174, 222171268, 221445484, 220804272, 220290642, 219655495, 219061241, 218605633, 218373528, 217860394, 216857414, 216032600, 216077919, 215858555, 214980984, 214228668, 213727512, 213409042, 212802372, 212236786, 211519184, 210723724, 210193710, 209827366, 209522820, 208763027, 208503895, 208507099, 208194675, 207857914, 207138786, 206192341, 205383835, 205081177, 204313049, 203700256, 203967762, 203608112, 203108273, 202886963, 202559204, 201880360, 201166592, 200973587, 200557346, 199962978, 199358521, 198592625, 198321457, 198378162, 198292103, 198075256, 197239075, 196092339, 195429230, 195184727, 195145569, 195360584, 195390644, 194800014, 194446201, 194164505, 193581467, 192931747, 192202682, 191982594, 191512566, 191025581, 190698318, 189970188, 189690685, 189545918, 189521313, 189047318]
3276A89047318p83444p5378j70002k13356j55430p3528l91751p09801k35710l42197
3285.6A85896721l48835p9708k72789k92168R194j12877n02682n17998k16007j53351
3295.3A83409500l69243j35403p7419l27988m68388l49197j83163j04084J5526m51279
3304.9A80958862k32353j22280o39496l06110j09616j92203m40350l33576q0528k5578
3314.6A78476772o6471n66635o44627n21602j53599k42023m61522o4849k41318m85478
3324.2A75028648n11493j68400m66232q36296j85986j79520k39181j5774j79214n99194
3333.8A71647358m12121m0169j56555m03404q02212l36876o5403k13966l06683p18975
3343.5A68190994n38654n68199k81849m2439m89502j31073o4735k42310J25714j54953
$$ y = [189047318, 188263874, 188188496, 188018494, 187805138, 187649708, 187576180, 187184429, 186474628, 186238918, 185896721, 185547886, 185468178, 185195389, 184903221, 184912415, 184799538, 184296856, 183778858, 183562851, 183409500, 183040257, 182904854, 182827435, 182499447, 182031059, 181681862, 181498699, 181394615, 181410141, 180958862, 180726509, 180604229, 179964733, 179658623, 179549007, 179356804, 178916454, 178582878, 178502350, 178476772, 178410301, 177843666, 177199039, 176677437, 176523838, 176281815, 175820293, 175755444, 175514126, 175028648, 174517155, 174348755, 173882523, 173046227, 172860241, 172680721, 172441540, 172425766, 172246552, 171647358, 171235237, 171195068, 171038513, 170635109, 169832897, 169496021, 169430618, 169216652, 168909969, 168190994, 167652340, 167084141, 166802292, 166759853, 166270351, 166139278, 166074543, 165832233, 165957947, 165802994]
3353.1A65802994k81563L10745J9951n83668k62737L90434J28441l85780q3790j47457
3362.8A64907570k10362j93195Q8825K38419o15273m20589K92015L48778K0141J0662
3372.4A64466991J17112k00062j24684l02543o8684R4166k48089n4607R8114j45207
3382.1A63632507n82103K1381R8591o6128M53033K39430M89788j46866n92556N42164
3391.7A64089241P63283j48030o05735J5011n5104j26819M99801Q6041m75006k26956
3401.3A63815727J91117J57470P6561m4784L452K32162J48507j09883r9849N24902
3411A64895382M88071Q4496K08759K24571K41623L49617L07713K20890K22969k59705
3420.6A66984386j15089N34115K98691J21250K59476L42483k7504j91135N02319J064091
$$ y = [165802994, 165521431, 165832176, 165852127, 165268459, 165005722, 165396156, 165524597, 165138817, 165055027, 164907570, 164697208, 164504013, 164592838, 164831257, 164215984, 163795395, 164087410, 164436188, 164456329, 164466991, 164584103, 164384041, 164259357, 163956814, 163888130, 163982296, 163734207, 163679600, 163777714, 163632507, 163050404, 163071785, 163170376, 163104248, 163557281, 163796711, 164286499, 164139633, 163547077, 164089241, 164852524, 164704494, 164098759, 164113770, 164058666, 163931847, 164431648, 164517689, 164042683, 163815727, 164006844, 164164314, 164240875, 164196091, 164199543, 164431705, 164580212, 164470329, 164370480, 164895382, 165383453, 165467949, 165676708, 165901279, 166142902, 166492519, 166800232, 167021122, 167244091, 166984386, 166869297, 167403412, 167702103, 167823353, 168082829, 168425312, 168397808, 168206673, 168708992, 169773083]
3430.3A69773083J79805l79047P03545K68650r0027O06918M16680L50570L07675K27794
3439.9A72365646P0572J06945L34931M76894K23999J57299O94332K84024N54866M77200
3449.6A75746708K41356Q50067N11265P00855L34206K24075M66518K2107Q62960P87526
3459.2A80747643J98669K63634O71901P30229J40037L84179N18569Q90046O53247K91653
3468.8A85489807J097355Q57258J24817L09658Q30097O71310N07298M79946K27604
3477.5A90595150N84202R29279Q90656N66520L60546K82135N37892R27715P49512O71444
3487.2A97095051M51069M50382P37305O55059N31464M07372O17408R29127R45206Q61568
3496.8B03681011P62291P13139R34276M30012N4321J142006R37023K82269R60083J045723
$$ y = [169773083, 169952888, 169573841, 170277386, 170546036, 170456009, 171062927, 171479607, 171830177, 172137852, 172365646, 172436218, 172543163, 172878094, 173354988, 173578987, 173736286, 174430618, 174714642, 175269508, 175746708, 175988064, 176838131, 177349396, 178050251, 178384457, 178608532, 179075050, 179097157, 179960117, 180747643, 180946312, 181209946, 181881847, 182612076, 182752113, 183136292, 183654861, 184544907, 185198154, 185489807, 186587162, 187444420, 187569237, 187878895, 188708992, 189380302, 189887600, 190367546, 190595150, 191179352, 192108631, 192999287, 193565807, 193926353, 194208488, 194746380, 195674095, 196423607, 197095051, 197546120, 197996502, 198733807, 199388866, 199920330, 200327702, 200945110, 201874237, 202819443, 203681011, 204443302, 205156441, 206090717, 206520729, 206575050, 207717056, 208654079, 208936348, 209896431, 210942154]
3506.5B10942154R13849J208305P58495J7796Q14571J084462O97937O58493Q23555
3515.1B17919617R89780M85153M18816Q31566Q41217N82867J212768J892338O16131
3523.8B25790253J28345R96304J651115J303387M25052N35069J382198J026860L74260
3532.5B33612843J312484J345921J557522J105556k38743J038723J459122J290531
3540.2B42483959J049500R83486J300545J517448J413097R61400J579875k70500M71783
3548.9B51490593K020378J839733K541294L19939P44801J544036J257019J823636P62424
3557.6B64343853J555405J599369R39655P82452J684608J634464J112652L155880R92298
3566.2B77800636J752262J922036q05798K275753K061462J645432J265640J574383
$$ y = [210942154, 211856003, 213064308, 213822803, 213840599, 214655170, 215739632, 216437569, 217096062, 217919617, 218909397, 219394550, 219813366, 220644932, 221486149, 222069016, 223281784, 225174122, 225790253, 225918598, 226914902, 228566017, 229869404, 230294456, 230829525, 232211723, 233238583, 233612843, 234925327, 236271248, 237828770, 238934326, 238695583, 239734306, 241193428, 242483959, 243533459, 244516945, 245817490, 247334938, 248748035, 249709435, 251289310, 251018810, 251490593, 253510971, 255350704, 257891998, 258211937, 258956738, 260500774, 261757793, 263581429, 264343853, 265899258, 267498627, 268438282, 269220734, 270905342, 272539806, 273652458, 276808338, 277800636, 279552898, 281474934, 280669136, 282944889, 285006351, 286651783, 287917423, 289491806]
3574B89491806J696816J873111K768822N80826J315250J547203J263142K245560J826152
3582.6C04608688J441765J263695M472980L165970j211414J098499K51122K968159
3590.4C18059464L192672K647286J610069P60078L158265O36138K275887L780594J173706
3599C37294159K162628J536903J213799K248955K352333K294655L269043L431549k5444
3607.7C55778580K934150O89888l43284O242409K639923J011581M447136n36232L244896
3616.4C76109047M993172K025261K282180J1559J314545L575592L291893K048111K472877
3625.1C98124237L177948L366013P252082L774529q627663K837715N669594O216164
3632.8D21790619K729149j04065K970428L368454L079758K089691K393761L570175
$$ y = [289491806, 291188622, 293061733, 295830555, 296411381, 297726631, 299273834, 300536976, 302782536, 304608688, 306050453, 307314148, 311787128, 314953098, 313741684, 314840183, 315091305, 318059464, 321252136, 323899422, 325509491, 326269569, 329427834, 330063972, 332339859, 336120453, 337294159, 339456787, 340993690, 342207489, 344456444, 346808777, 349103432, 352372475, 355804024, 355778580, 358712730, 359402618, 359059334, 365301743, 367941666, 368953247, 373400383, 372864151, 376109047, 381102219, 383127480, 385409660, 385421219, 386735764, 390311356, 393603249, 395651360, 398124237, 401302185, 404668198, 411920280, 415694809, 407067146, 409904861, 415574455, 421790619, 424519768, 424415703, 427386131, 430754585, 433834343, 435924034, 438317795, 441887970]
3640.5D41887970L731842K176590J353149L065644M278030O514702J394730j684647
3648.2D62718010N865669J350060m76876m2152N039406N065880M686088O343956n914612
3656.9D84635429J657105O081314K297821K689667J744041K859459J675034K322197
3664.6E05962067K962417J195069M839134K344589q66127K618942m286079K016220
3672.3E16786232Q432198J0213165K941170j5748864N62020P652397N469322j483536
3680E34824104O17791K784309J784935J678200Q50334Q05015M188080P227783q042449
3688.7E46718102m294243R277115m112893r54589N018615N93338J582642Q97484k0790
3697.4E54704781J142540R32540L513871M091339m648056k822457M498253J604920
$$ y = [441887970, 445619812, 447796402, 449149551, 452215195, 456493225, 463007927, 464402657, 462718010, 468583679, 469933739, 469456863, 469414711, 474454117, 479519997, 484206085, 490550041, 484635429, 486292534, 492373848, 494671669, 497361336, 499105377, 501964836, 503639870, 505962067, 508924484, 510119553, 514958687, 517303276, 516437149, 519056091, 514770012, 516786232, 525218430, 535431595, 538372765, 522623901, 523185921, 530838318, 536307640, 534824104, 535441895, 538226204, 540011139, 541689339, 542539673, 543344688, 547532768, 554760551, 546718102, 542423859, 551700974, 547588081, 546633492, 551652107, 552245445, 553828087, 554725571, 554704781, 555847321, 556779861, 560293732, 564385071, 559737015, 556914558, 561412811, 563017731]
3705.1E63017731J053009J206817K499276N129661o086807L517380N882034j4175720
3712.8E62043381K498550M575539J203155P43485K227974J648025l447838J364556
3720.5E72856827O241340k197227m286270M589844J696357L40462k692718r71718L514671
3729.2E79091568P21054N925522j540184p961006R906120K663155r686737j357193
3736.9E77762299K271347Q09021K275085L413620m209747L121185J3969421q408851
3744.7E91003380k0564079J0064888O419906O668472k421760j2265434J1508026l549309
3752.4E86864090q216858N856743M405594L490295n748100J883697O726151p095032
3760.1E88166580k584572L648072J699447P70073M251480k294426o288108L564796
$$ y = [563017731, 564070740, 565277557, 567776833, 572906494, 566819687, 570337067, 576219101, 562043381, 564541931, 569117470, 570320625, 571064110, 573292084, 574940109, 571492271, 572856827, 579098167, 576900940, 572614670, 577204514, 578900871, 579241333, 576548615, 575576897, 579091568, 579812622, 585738144, 584197960, 576236954, 586143074, 588806229, 579119492, 577762299, 580033646, 580842667, 583117752, 586531372, 582321625, 585442810, 599412231, 591003380, 570439301, 580504189, 586924095, 593592567, 591170807, 578905373, 590413399, 586864090, 578647232, 584503975, 588909569, 592399864, 586651764, 588535461, 595261612, 588166580, 585582008, 589230080, 590929527, 591699600, 595951080, 593656654, 587368546, 590933342]
3767.8E90933342O340218J090660r714508J181106L439751J88598O34118n87120R23957
3776.5E94430122O16417L713379J227112r156380J805153K711487R18236K453575k552261
3785.2E96166840j251526J460533P52258K45590l34816J84250k54631K05193J31912
3793.8E97305603J704750M148827l466759n090714K165719M732322P096520n684204
3801.5F02912064j2474518L200569L136024M791489N846176q988266m711761M955940
3809.3E98667717J289864m43306Q32748j49193J079407O329231m16908j5087433N022354
3817.9E97124481O900177N318032L949127j8781014q48007M961700J668663L664170
3825.7F03957329J113891n406112j014023K465515M503479K856407r656029J361657
$$ y = [590933342, 597273560, 598364220, 588649712, 589830818, 593270569, 593459167, 594093285, 593506165, 594430122, 595046539, 598759918, 599987030, 590830650, 592635803, 595347290, 596265526, 598719101, 596166840, 594915314, 596375847, 597128105, 597373695, 597038879, 597223129, 596968498, 597173691, 597305603, 599010353, 603159180, 599692421, 594601707, 596767426, 601499748, 608596268, 602912064, 590437546, 593638115, 596774139, 601565628, 607411804, 598423538, 593711777, 598667717, 599957581, 599514275, 600347023, 600197830, 601277237, 607606468, 607189560, 592102127, 597124481, 604024658, 609342690, 613291817, 594510803, 593662796, 598624496, 600293159, 603957329, 605071220, 599665108, 598651085, 601116600, 605620079, 608476486, 598820457, 600182114]
3833.4F00182114Q647232n219918j171951Q648796r374656n102044Q349953n454216
3841.1E99505310q17604P941933j626206m731827K281609J122627m5547J602936j600647
3849.8F03632584K386970P654839l764649L158379j6397133k507324R888153k108689
3857.5F01943130j877326K777137K730255L037224o347999o21796P237167n156021
3865.2F03721771o259842L794022N795937O909561o536675j0660667K958145O398163
3872.9F06120415L644142j0413666k82440M369545R80530K368278M316635m651527
3880.6F06451912q680191M644127J177406K780571O991043j3914108j64108M245452
3888.3F03532104O84014M458694n74684q684311O80886L788986j345940R37805J204338
$$ y = [600182114, 608829346, 603609428, 602437477, 611086273, 601711617, 596609573, 604959526, 599505310, 598687706, 606629639, 605003433, 600271606, 602553215, 603675842, 603630295, 605233231, 603632584, 606019554, 613674393, 609909744, 613068123, 596670990, 594163666, 604051819, 601943130, 600065804, 602842941, 605573196, 608610420, 602262421, 601640625, 608877792, 603721771, 597461929, 601255951, 607051888, 613961449, 607424774, 596764107, 599722252, 606120415, 609764557, 599350891, 599068451, 603437996, 604418526, 606786804, 611103439, 606451912, 597771721, 602415848, 603593254, 606373825, 613364868, 599450760, 599286652, 603532104, 604216118, 608674812, 608100128, 599415817, 600096703, 603885689, 602539749, 603477554, 604681892]
3897F04681892J959114J933480r865074N257301L199959n831871M305649l029824j225586
3905.7F01385040O28357p8735J458320k3384Q18825k34451o37741n05448L8033J656914
3915.3F04505730J974563k916870l488884M421044l31994m096679K683182J953849
3923.1F04703941R21707k722091l163338J776695J651307J978111k18239n33218J798362
3931.7F06193237k555504j942367R18159K18087L90968M7607m99382l86276M4136J610832
3941.4F04039497J513482l481102j915741J477928J711120R60656k875214N92499R75456
3950.1F02998581k626953J947479R69544j151467k27127J42403M19922l00179M19083
3958.7F02591286n07584L32298O43006j562081k86255N63965O31333L53775j87874
$$ y = [604681892, 606641006, 608574486, 598709412, 603966713, 607166672, 601334801, 605640450, 602610626, 601385040, 602013397, 601934662, 603392982, 603369598, 604188423, 603953972, 603316231, 602810783, 602848816, 604505730, 606480293, 603563423, 600074539, 604495583, 604163589, 600066910, 602750092, 604703941, 605625648, 602903557, 599740219, 601516914, 603168221, 605146332, 604928093, 604394875, 606193237, 603637733, 601695366, 602613525, 602831612, 603222580, 603270187, 602770805, 602384529, 602428665, 604039497, 605552979, 602071877, 600156136, 601634064, 603345184, 604305840, 601430626, 602023125, 602998581, 600371628, 602319107, 603288651, 602137184, 601910057, 602052460, 602472382, 602172203, 602591286, 602083702, 602416000, 603059006, 601496925, 601210670, 601774635, 602405968, 602759743, 602571869]
3967.4F02571869n9128q4724o65322n03540P1297K10533R44214O70128j62773q60482
3977.1F02132072p1907O26793l52554k49290p6638L17650N30892M00390p00378r91555
3986.7F01565475N14145K02523J18103l54576k23008L71552p3662Q8577l4408M59327
3996.3F02634048k54478k01378L59993k21329
4000.2F02316856
$$ y = [602571869, 602512741, 602428017, 601762695, 601259155, 601330452, 601540985, 602485199, 603155327, 602992554, 602132072, 602060165, 602686958, 602334404, 602085114, 602008476, 602326126, 602857018, 603257408, 602557030, 601565475, 602079620, 602282143, 602400246, 602045670, 601822662, 602194214, 602120552, 602209129, 602174721, 602634048, 602379570, 602178192, 602538185, 602316856]
##END=$$ End of the data block
