##TITLE=$$ Begin of the data block
##JCAMP-DX=5.00 $$ ACD/SpecManager v 10.08
##SPECTROMETER/DATA SYSTEM=Varian
##DATE=15 Jan 2013 11:01:10
##DATA TYPE=INFRARED SPECTRUM
##DATA CLASS=XYDATA
##ORIGIN=
##OWNER=
##NPOINTS=3735
##FIRSTX=399.26403809
##LASTX=4000.35498047
##MAXX=4000.35498047
##MINX=399.26403809
##MAXY=67.46022034
##MINY=16.36862564
##XFACTOR=1.0000000000
##YFACTOR=0.000000100000000
##FIRSTY=34.83308411
##DELTAX=0.96440572
##XUNITS=1/CM
##YUNITS=TRANSMITTANCE
##XYDATA=(X++(Y..Y))
$$ plain form
399.3 348330841 357893944 354902992 350440140 344863205 352488823 361244049 360198021 352288170
407 352288170 345329857 346473961 348038254 349843254 351191368 353386726 350994759 349387169 351889305
415.7 351889305 350193253 347537193 329533577 324669037 345860748 352210045 350768967 349554100
423.4 349554100 351605110 348293724 347520409 349230461 348020706 344552193 342746964 343482018 340410843
432.1 340410843 342024994 347139854 347013702 342312393 339331398 341173515 344138298 347448692 346789856
440.7 346789856 343772507 343858719 348096390 350679779 351232872 350212097 342298965 339892960 342744370
449.4 342744370 345908241 346406708 344626884 345096054 340365028 336878891 338359451 342708397 344633980
458.1 344633980 338712082 336892357 335808105 336227036 337852631 339035454 338832092 335924950 336541557
$$ packed form
399.3C48330841R563103k990952m462852n576935P625618Q755226j046028p909851
407C52288170o958313J144104J564293J805000J348114K195358k391967j607590K502136
415.7C51889305j696052k656060j8003616m864540K1191711O349297j441078j214867
423.4C49554100K051010l311386p73315J710052j209755l468513j805229P35054l071175
432.1C40410843J614151N114860j26152m701309k980995J842117K964783L310394o58836
440.7C46789856l017349Q6212M237671K583389N53093j020775p913132k406005K851410
449.4C42744370L163871M98467j779824M69170m731026l486137J480560M348946J925583
458.1C44633980n921898j819725j084252M18931J625595J182823k03362k907142O16607
$$ plain form
466.8 336541557 337007370 333751259 332268486 332156219 330266953 331305923 333939552 332551193 334140587
475.5 334140587 333975182 330180359 330340805 330829124 330491257 331217270 329035454 324550514 324964485
484.1 324964485 328544083 327951164 326008148 327378197 330798416 330820198 328749008 329860840 330158386
492.8 330158386 328208656 328902931 330261650 329424515 327078362 324581299 323464851 323667717 322768822
501.5 322768822 321270866 325365868 328180199 326013145 325736389 326062012 322627640 320865669 322878799
510.2 322878799 322229843 320012016 319310951 318637924 320748138 321054955 318947334 319335804 319308414
518.9 319308414 318441944 316304417 315307617 316331100 315652199 313242168 311904259 314325962 316034069
527.5 316034069 314731674 314818249 315102272 314137611 315381260 315426121 312932568 311708508 311253414
$$ packed form
466.8C36541557M65813l256111j482773j12267j889266J038970K633629j388359J589394
475.5C34140587j65405l794823J60446M88319l37867P26013k181816m484940M13971
484.1C24964485L579598n92919j943016J370049L420219K1782k071190J111832K97546
492.8C30158386j949730O94275J358719q37135k346153k497063j116448K02866q98895
501.5C22768822j497956M095002K814331k167054k76756L25623l434372j761971K013130
510.2C22878799o48956k217827p01065o73027K110214L06817k107621L88470k7390
518.9C19308414q66470k137527r96800J023483o78901k410031j337909K421703J708107
527.5C16034069j302395Q6575K84023r64661J243649M4861k493553j224060m55094
$$ plain form
536.2 311253414 311399193 312686977 313152466 311254406 309645977 309817429 310375175 309898605 308765545
544.9 308765545 308618813 307472858 306941757 308074970 308030758 307488232 306312256 304737034 304149208
553.6 304149208 304419727 304926949 304751148 303391476 302467308 302251987 301580162 302078838 302967472 302803268
563.2 302803268 302957096 304190331 304489822 303234425 303149242 303143311 302334976 302199383 302715607 303700867
572.9 303700867 303946171 302888107 302206516 302864971 302719250 302074165 301536522 300862579 301718140 302823086
582.5 302823086 302905941 302585964 302571831 302420731 302106152 301795101 301597157 302364731 302143250 301960640
592.1 301960640 302802029 303437786 304467125 303776855 302827682 303136635 303376770 303671570 303822556 303844681
601.8 303844681 303234043 302394371 301595669 301642609 302258453 301318645 300278435 299861870 299107609 297935162
$$ packed form
536.2C11253414J45779J287784M65489j898060j608429J71452N57746m76570j133060
544.9C08765545j46732j145955n31101J133213m4212n42526j175976j575222n87826
553.6C04149208K70519N07222j75801j359672r24168k15321o71825M98676Q88634j64204
563.2C02803268J53828J233235K99491j255397q5183n931q08335j35593N16224R85260
572.9C03700867K45304j058064o81591O58455j45721o45085n37643o73943Q55561J104946
582.5C02823086Q2855l19977j4133j51100l14579l11051j97944P67574k21481j82610
592.1C01960640Q41389O35757J029339o90270r49173L08953K40135K94800J50986K2125
601.8C03844681o10638q39672p98702M6940O15844r39808j040210m16565p54261j172447
$$ plain form
611.4 297935162 296918983 295907001 294744511 294833031 296097374 297611980 298161983 297605400 297872295
620.1 297872295 298525887 298068638 297880230 299269428 300639286 300550117 301122246 303064194 304022713
628.8 304022713 304437389 305378494 306771355 308504753 309751740 311252728 312225361 311587791 312700615
637.5 312700615 315717068 317430344 318161011 318763313 319703426 321654396 323060913 323337708 324065094
646.2 324065094 324967232 325270920 325523834 326577721 328195763 329178162 329468498 329107666 329590912
654.8 329590912 330219536 329824409 330713806 330948868 330083504 328949051 328204193 328613930 328059654 328377190
664.5 328377190 329631157 330259552 329668236 326718521 329488792 330836411 331461487 331368103 331233978
673.2 331233978 333026352 335474701 336875954 336692657 337450523 338858032 339470215 341268997 343166008
$$ packed form
611.4B97935162j016179j011982j162490Q8520J264343J514606N50003n56583K66895
620.1B97872295O53592m57249j88408J389198J369858q9169N72129J941948R58519
628.8C04022713M14676R41105J392861J733398J246987J500988R72633o37570J112824
637.5C12700615L016453J713276P30667O02302R40113J950970J406517K76795P27386
646.2C24065094R02138L03688K52914J053887J618042R82399K90336l60832M83246
654.8C29590912O28624l95127Q89397K35062q65364j134453p44858M09737n54276L17536
664.5C28377190J253967O28395n91316k949715K770271J347619O25076r3384j34125
673.2C31233978J792374K448349J401253j83297P57866J407509O12183J798782J897011
$$ plain form
681.8 343166008 343515968 343674088 345219879 347017784 347784233 348835487 350177765 350119553 349742241
690.5 349742241 350216751 351276321 352459602 352980003 353434753 353031197 353239098 355194473 356171608
699.2 356171608 356649094 357038345 357700920 358307877 358236198 358400917 358824310 360385742 362161331 362692642
708.8 362692642 362822075 363574219 363917503 364666214 366804504 367772293 368201714 368665619 369695015
717.5 369695015 371246452 372032623 372997627 373238602 372995148 373314781 374455490 375264320 375955772
726.2 375955772 378050880 380227165 381605377 382088890 383064270 383938217 384676819 385761909 385855026
734.9 385855026 386741753 387809677 387754288 387680359 388540497 389169922 389697418 390904922 392043877 393707542
744.5 393707542 393906746 394206657 395452843 396456528 397806892 398470612 399663696 399849625 400025826
$$ packed form
681.8C43166008L49960J58120J545791J797905P66449J051254J342278n8212l77312
690.5C49742241M74510J059570J183281N20401M54750m03556K07901J955375R77135
699.2C56171608M77486L89251O62575O06957p1679J64719M23393J561432J775589N31311
708.8C62692642J29433P52144L43284P48711K138290R67789M29421M63905J029396
717.5C69695015J551437P86171R65004K40975k43454L19633J140709Q08830O91452
726.2C75955772K095108K176285J378212M83513R75380Q73947P38602J085090R3117
734.9C85855026Q86727J067924n5389p3929Q60138O29425N27496J207504J138955J663665
744.5C93707542J99204K99911J246186J003685J350364O63720J193084J85929J76201
$$ plain form
753.2 400025826 400891266 401618690 403350525 404412384 405948563 407063942 407963791 409688454 410958252
761.9 410958252 411833038 413011589 414619026 414541168 414792557 414910812 414612579 414615517 414069061 415224800
771.5 415224800 416057396 416445427 416952705 417220917 417110176 416567688 416667671 416287079 416770821 416937943
781.2 416937943 417033234 417919998 418661156 420168991 421134682 421960182 422084274 421988182 421968193 421683502
790.8 421683502 421637764 421676826 422782135 423963203 424682846 423504982 422831230 423024330 421514854
799.5 421514854 420071259 417950096 416202621 414572411 413704414 413766899 413086586 412492180 411348038
808.2 411348038 410169182 407910538 406034966 404173927 401129150 399127159 397509308 396990547 395879669
816.9 395879669 394598389 394614487 394758606 395471573 395327454 395698776 396992226 397715302 398558922 400618210
$$ packed form
753.2D00025826Q65440P27424J731835J061859J536179J115379Q99849J724663J269798
761.9D10958252Q74786J178551J607437p7858K51389J18255k98233K938n46456J155739
771.5D15224800Q32596L88031N07278K68212j10741n42488R9983l80592M83742J67122
781.2D16937943R5291Q86764P41158J507835R65691Q25500J24092r6092j9989k84691
790.8D21683502m5738L9062J105309J181068P19643j177864o73752J93100j509476
799.5D21514854j443595k121163j747475j630210q67997O2485o80313n94406j144142
808.2D11348038j178856k258644j875572j861039l044777k001991j617851n18761j110878
816.9C95879669j281280J6098J44119P12967j44119L71322J293450P23076Q43620K059288
$$ plain form
826.5 400618210 404419975 408348846 411392975 414396248 418535423 421971893 424046860 426046066
834.2 426046066 428326950 430443840 432594109 435634766 438240433 441067696 443366814 445706940
841.9 445706940 448163414 449219246 450659065 451679306 452576485 453372993 454862595 456519547 458184853
850.6 458184853 461030884 463074226 465374756 467138138 468103065 468392754 469609070 472086029 473674622
859.3 473674622 475279846 475755310 477942543 480469131 481381683 481361580 480351410 479908180 477838974
868 477838974 476378212 474130096 470699539 467870750 465636177 464436073 462479630 462754860 462785645
876.7 462785645 461307983 460204277 459325256 459119034 458052368 458016586 458278313 458843575 459284439
885.3 459284439 459121094 458769455 456994972 455625839 453965492 452490234 450953217 450605736 451549072
$$ packed form
826.5D00618210L801765L928871L044129L003273M139175L436470K074967J999206
834.2D26046066K280884K116890K150269L040657K605667K827263K299118K340126
841.9D45706940K456474J055832J439819J020241Q97179P96508J489602J656952J665306
850.6D58184853K846031K043342K300530J763382R64927K89689J216316K476959J588593
859.3D73674622J605224M75464K187233K526588R12552k0103j010170m43230k069206
868D77838974j460762k248116l430557k828789k234573j200104j956443K75230L0785
876.7D62785645j477662j103706q79021k06222j066666l5782K61727N65262M40864
885.3D59284439j63345l51639j774483j369133j660347j475258j537017l47481R43336
$$ plain form
894 451549072 451853180 452634048 452250938 452013741 451664276 450857887 449732742 447767029 446336441 445446243
903.7 445446243 446405296 448501320 452332039 456016312 458077011 459977951 460935593 461632423 460904770
912.3 460904770 460693474 460219269 459221687 458504829 456850319 456089211 453984299 451478767 449097404
921 449097404 446709099 443972893 439771156 436220169 432574692 429686813 426546555 423229561 420550804
929.7 420550804 417159233 414510536 412453346 410487480 408176765 406346397 405075569 403855209
937.4 403855209 403016052 402305450 402290535 401662521 400157356 398017502 396402321 395603409 394728737
946.1 394728737 394496002 393691406 393259735 393676567 393934708 393587036 393046951 392790222 391345558 389781685
955.7 389781685 387401733 384500465 382374840 379975624 378214302 376437950 373886452 371522141
$$ packed form
894D51549072L04108P80868l83110k37197l49465q06389j125145j965713j430588q90198
903.7D45446243R59053K096024L830719L684273K060699J900940R57642O96830p27653
912.3D60904770k11296m74205r97582p16858j654510p61108k104912k505532k381363
921D49097404k388305k736206m201737l550987l645477k887879l140258l316994k678757
929.7D20550804l391571k648697k057190j965866k310715j830368j270828j220360
937.4D03855209q39157p10602j4915o28014j505165k139854j615181p98912q74672
946.1C94728737k32735q04596m31671M16832K58141l47672n40085k56729j444664j563873
955.7C89781685k379952k901268k125625k399216j761322j776352k551498k364311
$$ plain form
963.4 371522141 369457664 367297096 365145645 362982903 360719032 358352127 356039352 353826408
971.2 353826408 351249809 349025383 346234398 342669334 339402351 335889015 332372169 328361168
978.9 328361168 324233589 320330086 315538254 310035629 304730148 300485306 296709938 292032356
986.6 292032356 286970501 281939316 277207623 273207054 269239311 265518837 262085896 259216213
994.3 259216213 256348915 253545551 251497345 248863106 245677624 242539387 240337334 238319645
1002 238319645 235999413 233738842 231435947 229687405 227721119 226371098 225099373 223475475 221769218
1010.7 221769218 219996376 218709240 216389084 214024982 211893330 210075150 208489094 206348038
1018.4 206348038 204383068 202452507 200729599 198400459 196539974 195024242 193178692 191339073
$$ packed form
963.4C71522141k064477k160568k151451k162742k263871k366905k312775k212944
971.2C53826408k576599k224426k790985l565064l266983l513336l516846m011001
978.9C28361168m127579l903503m791832n502625n305481m244842l775368m677582
986.6B92032356n061855n031185m731693m000569l967743l720474l432941k869683
994.3B59216213k867298k803364k048206k634239l185482l138237k202053k017689
1002B38319645k320232k260571k302895j748542j966286j350021j271725j623898j706257
1010.7B21769218j772842j287136k320156k364102k131652j818180j586056k141056
1018.4B06348038j964970j930561j722908k329140j860485j515732j845550j839619
$$ plain form
1026.1 191339073 189205170 187437477 185653648 184769440 184095230 183739605 182714005 181238613 180764656
1034.8 180764656 180143318 181148129 182024860 183167992 184648933 186165161 188058414 188758907 189738750
1043.5 189738750 189503498 189236374 188753624 188910904 189813595 188724041 187840595 185959091 184321766
1052.2 184321766 182645435 181546898 181388855 180255508 179864292 178896503 178939590 178763962 180060825
1060.9 180060825 182714806 183677387 185063610 185836773 187944126 189887085 191342907 192693214 193224087
1069.5 193224087 194099159 194675751 195860538 195906372 196248989 196777000 197493935 198199730 198010273 199217472
1079.2 199217472 199069481 199969807 201503048 201461353 202022209 203748779 205515785 205501060 206596012
1087.9 206596012 207986240 209595299 211174870 212436333 214419365 215593586 217568340 219069443
$$ packed form
1026.1A91339073k133903j767693j783829q84208o74210l55625j025600j475392m73957
1034.8A80764656o21338J004811Q76731J143132J480941J516228J893253P00493R79843
1043.5A89738750k35252k67124m82750J57280R02691j089554q83446j881504j637325
1052.2A84321766j676331j098537j58043j133347l91216r67789M3087j75628J296863
1060.9A80060825K653981R62581J386223P73163K107353J942959J455822J350307N30873
1069.5A93224087Q75072N76592J184787M5834L42617N28011P16935P05795j89457J207199
1079.2A99217472j47991R00326J533241m1695N60856J726570J767006j4725J094952
1087.9B06596012J390228J609059J579571J261463J983032J174221J974754J501103
$$ plain form
1095.6 219069443 220306454 221199875 222192421 224265194 225772171 227019310 227200527 228206863 229427433
1104.2 229427433 230816269 232517452 233121433 234236927 234942722 235607548 235559177 235600929 236524563
1112.9 236524563 237294788 238389072 239540539 240934925 240891380 241213722 242066822 242034321 241876469
1121.6 241876469 241452732 241968441 242386322 243308849 244072266 244698601 245944271 246990070 249475441
1130.3 249475441 251648769 253490105 255338383 256794128 259002590 261639214 263735352 265079746
1138 265079746 266875954 268341045 270004730 272058640 273158875 274025078 274732399 275355568 276217308
1146.7 276217308 276633339 276401844 276773949 276816311 276067715 276022835 275963631 275319901 274354973 274252529
1156.3 274252529 274001713 272647209 271506004 270404930 269981728 269907093 270131912 270523300 270985851
$$ packed form
1095.6B19069443J237011Q93421R92546K072773J506977J247139J81217J006336J220570
1104.2B29427433J388836J701183O03981J115494P05795O64826m8371M1752R23634
1112.9B36524563P70225J094284J151467J394386m3545L22342Q53100l2501j57852
1121.6B41876469m23737N15709M17881R22527P63417O26335J245670J045799K485371
1130.3B49475441K173328J841336J848278J455745K208462K636624K096138J344394
1138B65079746J796208J465091J663685K053910J100235Q66203P07321O23169Q61740
1146.7B76217308M16031k31495L72105M2362p48596m4880n9204o43730r64928j02444
1156.3B74252529k50816j354504j141205j101074m23202p4635K24819L91388M62551
$$ plain form
1165 270985851 272271519 274208488 276796227 278766193 280994949 283847065 286786060 289910183 292819481
1173.7 292819481 296177120 299818096 303061199 305892849 308871384 311663914 314500256 317545605
1181.4 317545605 319953575 321964188 324517212 327113419 328879471 330370636 331646385 333051453
1189.1 333051453 334145775 334517860 334721489 335100403 335177650 334459496 334240036 334100647 333168221 332193336
1198.8 332193336 331614685 330959435 330010567 328983917 328173866 327620926 326505127 325753670 325181541
1207.4 325181541 324388809 324413872 324127159 323810768 323741951 323418083 323238411 323113251 322965202 322185287
1217.1 322185287 321368294 321043167 320855713 320402031 319888878 319785652 319292412 318882446 318454895 317516994
1226.7 317516994 316640682 315937405 315408649 314513912 313760967 313231468 312423458 311814804 311393719 311185684
$$ packed form
1165B70985851J285668J936969K587739J969966K228756K852116K938995L124123K909298
1173.7B92819481L357639L640976L243103K831650K978535K792530K836342L045349
1181.4C17545605K407970K010613K553024K596207J766052J491165J275749J405068
1189.1C33051453J094322L72085K03629L78914P7247p18154k19460j39389r32426r74885
1198.8C32193336n78651o55250r48868j026650q10051n52940j115799p51457n72129
1207.4C25181541p92732K5063k86713l16391o8817l23868j79672j25160j48049p79915
1217.1C22185287q16993l25127j87454m53682n13153j03226m93240m09966m27551r37901
1226.7C17516994q76312p03277n28756q94737p52945n29499q08010o08654m21085k08035
$$ plain form
1236.4 311185684 311157265 311317940 310875530 310022259 310037136 310146351 309791508 309517326 309563560 309250431
1246 309250431 308737907 308321400 307760487 307482052 307150059 306915073 306773872 306941261 307194767 306755848
1255.7 306755848 306921387 307257748 307158279 307275448 307431450 307476597 307534866 307931709 308710632 309646645
1265.3 309646645 310034103 310578079 311683235 312692738 313670349 314479923 315404968 316487064 317507572
1274 317507572 318168812 318984661 319930420 320933151 322675247 323994255 324704361 325829887 327374268
1282.7 327374268 328620605 329939842 331430168 332772598 334320602 335559998 336853065 337986336
1290.4 337986336 338787041 339472237 340187187 341009636 341838493 342519379 342384682 342489281 342610283 343224907
1300 343224907 344308281 344204292 344041290 343947945 343892212 343880386 343693657 343268814 342423172 341536865
$$ packed form
1236.4C11185684k8419J60675m42410q53271J4877J09215l54843k74182M6234l13129
1246C09250431n12524m16507n60913k78435l31993k34986j41201J67389K53506m38919
1255.7C06755848J65539L36361r9469J17169J56002M5147N8269L96843P78923R36013
1265.3C09646645L87458N43976J105156J009503R77611Q09574R25045J082096J020508
1274C17507572O61240Q15849R45759J002731J742096J319008P10106J125526J544381
1282.7C27374268J246337J319237J490326J342430J548004J239396J293067J133271
1290.4C37986336Q00705O85196P14950Q22449Q28857O80886j34697J04599J21002O14624
1300C43224907J083374j03989j63002r3345n5733j1826j86729m24843q45642q86307
$$ plain form
1309.7 341536865 340861893 340645370 340109596 339420166 338741837 338215675 338294792 338297768 338245163 338355217
1319.3 338355217 339186325 340467262 341626549 342253761 342588806 343404007 344150009 344820061 345002937
1328 345002937 344834824 344258232 343541298 343183289 342469254 341595001 340945244 340957603 340813713 340696106
1337.6 340696106 340732155 340264282 340732880 341268959 342068787 342990036 343638687 344373550 345111847 346062050
1347.3 346062050 346509666 347065239 346948280 346765938 346941109 346419182 345785789 344817963 344410439 344225922
1356.9 344225922 344010086 343540764 343169594 342879791 342372093 342396736 340809860 340486488 340279236 339265709
1366.6 339265709 338986664 337977142 337302856 336858673 336528740 336350441 336348953 336577377 336333504 336571312
1376.2 336571312 336086311 335826302 335786819 335823708 335870285 335389633 334704666 333289642 332578011 331983566
$$ packed form
1309.7C41536865o74972k16523n35774o89430o78329n26162P9117K976n2605J10054
1319.3C38355217Q31108J280937J159287O27212L35045Q15201P46002O70052J82876
1328C45002937j68113n76592p16934l58009p14035q74253o49757J2359j43890j17607
1337.6C40696106L6049m67873M68598N36079P99828R21249O48651P34863P38297R50203
1347.3C46062050M47616N55573j16959j82342J75171n21927o33393r67826m07524j84517
1356.9C44225922k15836m69322l71170k89803n07698K4643j586876l23372k07252j013527
1366.6C39265709k79045j009522o74286m44183l29933j78299j488K28424k43873K37808
1376.2C36571312m85001k60009l9483L6889M6577m80652o84967j415024p11631n94445
$$ plain form
1385.8 331983566 331444130 329589577 327759438 327392998 326114502 324730568 323222694 322213478 319762993
1394.5 319762993 315952148 314355831 312078781 310388069 307868404 305686913 304142170 301639709
1402.2 301639709 299451942 297492638 294960918 292389984 291313820 289688625 287340298 285805168
1409.9 285805168 284052410 282618446 280831718 279506741 278642883 277515202 276929131 275960789 275723248
1418.6 275723248 273628387 273118477 273831692 273659420 274019928 272929707 273450623 274472332 274729137
1427.3 274729137 275834446 276580009 277251663 277212830 278395576 279703388 280936508 283039303 284678898
1436 284678898 286008224 286289082 288464088 290119190 291567154 293183689 293827324 295031643 295984955
1444.7 295984955 297703381 299138832 300702782 301630707 302664413 304511013 305292492 307011414 308249264
$$ packed form
1385.8C31983566n39436j854553j830139l66440j278496j383934j507874j009216k450485
1394.5C19762993l810845j596317k277050j690712k519665k181491j544743k502461
1402.2C01639709k187767j959304k531720k570934j076164j625195k348327j535130
1409.9B85805168j752758j433964j786728j324977q63858j127681n86071r68342k37541
1418.6B75723248k094861n09910P13215j72272L60508j090221N20916J021709K56805
1427.3B74729137J105309P45563O71654l8833J182746J307812J233120K102795J639595
1436B84678898J329326K80858K175006J655102J447964J616535O43635J204319R53312
1444.7B95984955J718426J435451J563950R27925J033706J846600P81479J718922J237850
$$ plain form
1453.3 308249264 310601807 312472534 312334347 314355602 315074978 318895760 321071739 323709564 325531654
1462 325531654 327087746 329793968 330838547 333080788 334983902 337824135 340127068 342739067 346517448
1470.7 346517448 349157143 352791061 355344391 359084549 361718674 363613663 366871567 369619675
1478.4 369619675 372080841 374384918 376925774 378508949 380403137 382439728 383862419 385365257
1486.1 385365257 385910301 386431274 387994156 388534126 387996101 388237038 388635864 388039360 387492065
1494.8 387492065 387694283 383733253 383243904 382308922 378469849 377559166 376498260 375480042 374817390
1503.5 374817390 375349426 374953957 369986877 368084946 367961502 368589096 367666206 368316917 367574959
1512.2 367574959 365111771 364643745 363880386 363797379 362112541 359540710 360687981 362297592 362159081
$$ packed form
1453.3C08249264K352543J870727j38187K021255P19376L820782K175979K637825J822090
1462C25531654J556092K706222J044579K242241J903114K840233K302933K611999L778381
1470.7C46517448K639695L633918K553330L740158K634125J894989L257904K748108
1478.4C69619675K461166K304077K540856J583175J894188K036591J422691J502838
1486.1C85365257N45044N20973J562882N39970n38025K40937L98826n96504n47295
1494.8C87492065K02218l961030m89349r34982l839073r10683j060906j018218o62652
1503.5C74817390N32036l95469m967080j901931j23444O27594r22890O50711p41958
1512.2C67574959k463188m68026p63359q3007j684838k571831J147271J609611j38511
$$ plain form
1520.8 362159081 359799042 359182816 360216064 362105865 362076263 362684937 363823128 364154091 364692955
1529.5 364692955 365256500 365915375 366485710 366866455 365480423 366628342 368085709 369127884 370680008
1538.2 370680008 368992386 366572304 368447800 369663200 369261475 371071892 372491341 371239281
1545.9 371239281 372842331 373809700 374986191 375631256 375295334 376658249 377225418 378342400 376797791
1554.6 376797791 377205925 380194969 382747726 380787888 375400543 375435333 375963478 377056808 376283684
1563.3 376283684 375729103 373329506 370374374 369446297 367651863 367230110 360333595 358205490 357211342
1572 357211342 354154854 351488953 349188690 348717308 336643600 333572502 330775261 327326622 323927155
1580.6 323927155 318753586 315352249 309997139 306295853 301143341 296728973 292666740 287685051
$$ packed form
1520.8C62159081k360039o16226J033248J889801k9602O08674J138191L30963N38864
1529.5C64692955N63545O58875N70335L80745j386032J147919J457367J042175J552124
1538.2C70680008j687622k420082J875496J215400m01725J810417J419449j252060
1545.9C71239281J603050R67369J176491O45065l35922J362915N67169J116982j544609
1554.6C76797791M08134K989044K552757j959838n387345L4790N28145J093330p73124
1563.3C76283684n54581k399597k955132r28077j794434m21753o896515k128105r94148
1572C57211342l056488k665901k300263m71382j2073708l071098k797241l448639l399467
1580.6C23927155n173569l401337n355110l701286n152512m414368m062233m981689
$$ plain form
1588.4 287685051 284477291 278994751 275797157 270798893 267512856 263748760 259212761 256438408
1596.1 256438408 251475372 248973103 244351254 241989059 238634605 235604801 233774471 229695492
1603.8 229695492 228262749 224997501 224359550 221648617 220168343 218895760 215817661 215999355 213759727
1612.5 213759727 213800201 211754799 211640568 211861591 207516479 209058628 207962914 208903465 207284794
1621.1 207284794 208078403 208225174 205897903 206712093 206148891 208092728 206812859 207708435 207720337
1629.8 207720337 208175774 209207916 208780060 210855923 210760155 212638226 210701160 212577362 213840618
1638.5 213840618 214775009 217350998 217438812 219717884 220093155 221965714 223278542 222696457 225842342
1647.2 225842342 224953098 228000736 228881950 232110176 234378967 233397446 234653149 234457722 238417072
$$ packed form
1588.4B87685051l207760n482540l197594m998264l286037l764096m535999k774353
1596.1B56438408m963036k502269m621849k362195l354454l029804j830330m078979
1603.8B29695492j432743l265248o37951k710933j480274j272583l078099J81694k239628
1612.5B13759727M0474k045402j14231K21023m345112J542149j095714R40551j618671
1621.1B07284794P93609J46771k327271Q14190n63202J943837j279869Q95576J1902
1629.8B07720337M55437J032142m27856K075863r5768J878071j937066J876202J263256
1638.5B13840618R34391K575989Q7814K279072L75271J872559J312828n82085L145885
1647.2B25842342q89244L047638Q81214L228226K268791r81521J255703j95427L959350
$$ plain form
1655.9 238417072 239305229 241726379 243204155 245406513 247800407 249660492 253162975 253856468 257799282
1664.5 257799282 260177784 263183880 266445599 269519176 273128262 274616508 279790382 281981030
1672.3 281981030 285888977 289650402 293105545 296849136 299713497 304152203 307327690 312024345
1680 312024345 315088291 319516640 325299873 328731728 332310524 333936806 340062599 344878769 349939461
1688.6 349939461 354617271 358175774 363059235 367451363 372693863 378398437 384435158 385652237
1696.4 385652237 390790977 397040672 402786484 406386757 406100883 414311104 419939995 424060326
1704.1 424060326 427292137 431350822 434671135 437303200 441558723 444460793 446817780 449501724
1711.8 449501724 452081451 455125771 456995049 458432961 461975479 465102615 460421295 463023796
$$ packed form
1655.9B38417072Q88157K421150J477776K202358K393894J860085L502483O93493L942814
1664.5B57799282K378502L006096L261719L073577L609086J488246N173874K190648
1672.3B81981030L907947L761425L455143L743591K864361M438706L175487M696655
1680C12024345L063946M428349N783233L431855L578796J626282O125793M816170N060692
1688.6C49939461M677810L558503M883461M392128N242500N704574O036721J217079
1696.4C85652237N138740O249695N745812L600273k85874Q210221N628891M120331
1704.1D24060326L231811M058685L320313K632065M255523K902070K356987K683944
1711.8D49501724K579727L044320J869278J437912L542518L127136m681320K602501
$$ plain form
1719.5 463023796 467045250 469553604 471617622 472583694 473370667 475075874 476513176 477732277 479570961
1728.2 479570961 481768379 481921921 482669296 486777153 491130257 491185455 487310562 490701218 494688683
1736.9 494688683 497131958 500442963 501357346 500311127 505131874 509147644 511051750 513608780
1744.6 513608780 517886429 522375336 525742607 529048309 531352615 536571388 539721222 541082001
1752.3 541082001 546311226 550494423 554836006 558993301 559951134 562081337 565820732 569081917
1760 569081917 573063316 573673553 573491173 577204895 579955978 582259140 584714203 587124367 586689682
1768.7 586689682 589113312 593861084 595228462 593681717 591724930 596077003 598543167 598094368
1776.4 598094368 601013680 602489967 604620399 605568619 604601898 605718956 607659569 609690895 609462013
$$ packed form
1719.5D63023796M021454K508354K064018R66072P86973J705207J437302J219101J838684
1728.2D79570961K197418J53542P47375M107857M353104N5198l874893L390656L987465
1736.9D94688683K443275L311005R14383j046219M820747M015770J904106K557030
1744.6E13608780M277649M488907L367271L305702K304306N218773L149834J360779
1752.3E41082001N229225M183197M341583M157295R57833K130203L739395L261185
1760E69081917L981399O10237j82380L713722K751083K303162K455063K410164m34685
1768.7E86689682K423630M747772J367378j546745j956787M352073K466164m48799
1776.4E98094368K919312J476287K130432R48220r66721J117058J940613K031326k28882
$$ plain form
1785.1 609462013 609845734 611831703 613693314 614690170 616469421 617982674 619198494 618185234 616786385
1793.8 616786385 620384521 621591873 621384926 623333931 625869980 627023201 626038666 628316994 628464508
1802.4 628464508 629114113 630922050 631371574 632652817 633241196 633733864 635064278 637243156 636941643
1811.1 636941643 637130890 638421021 638994827 640359573 640345840 641127853 641187592 641746292 643286209
1819.8 643286209 643768311 645022583 645059814 646590652 647869186 645347443 645387421 647604141 650070419
1828.5 650070419 650524673 647433701 647483597 650005264 651053314 651989517 652865524 653324814 653691025
1837.2 653691025 652778244 653485184 653666229 654244308 654834900 656630020 658749008 653558350 655530243
1845.8 655530243 658256531 658442993 657895355 658000717 659150620 659201660 659665680 659318771 659753494
$$ packed form
1785.1F09462013L83721J985969J861611R96856J779251J513253J215820j013260j398849
1793.8F16786385L598136J207352k06947J949005K536049J153221r84535K278328J47514
1802.4F28464508O49605J807937M49524J281243N88379M92668J330414K178878l01513
1811.1F36941643J89247J290131N73806J364746j3733P82013N9739N58700J539917
1819.8F43286209M82102J254272L7231J530838J278534k521743L9978K216720K466278
1828.5F50070419M54254l090972M9896K521667J048050R36203Q76007M59290L66211
1837.2F53691025r12781P06940J81045N78079N90592J795120K118988n190658J971893
1845.8F55530243K726288J86462n47638J05362J149903N1040M64020l46909M34723
$$ plain form
1854.5 659753494 660448990 660922012 661886139 662112885 662824097 662360992 662276459 661973953 662249908 662878799
1864.2 662878799 662989655 664368896 664183960 665032349 664818878 663551712 664435501 665248718 666114883
1872.8 666114883 665722885 665664444 665466232 666045456 666576538 666686401 667591858 667785645 668251114 667916183
1882.5 667916183 668379135 668502731 668115997 668507309 668127823 669255676 669642181 668580399 669140091
1891.2 669140091 670463028 670651550 670493622 670483398 669335098 669823914 670095978 670163498 670229721 670242767
1900.8 670242767 670881348 671230087 671991196 671614532 671697006 671828461 671593475 671491699 670963516 670943222
1910.4 670943222 670792694 672063828 672530975 673111191 673636627 673359070 674602203 672707443 671529465
1919.1 671529465 672188950 672591476 673454971 673238831 672994843 673309479 674133377 673934097 673837357 673745422
$$ packed form
1854.5F59753494O95496M73022R64127K26746P11212m63105q4533l02506K75955O28891
1864.2F62878799J10856J379241j84936Q48389k13471j267166Q83789Q13217Q66165
1872.8F66114883l91998n8441j98212N79224N31082J09863R05457J93787M65469l34931
1882.5F67916183M62952J23596l86734L91312l79486J127853L86505j061782N59692
1891.2F69140091J322937J88522j57928j0224j148300M88816K72064O7520O6223J3046
1900.8F70242767O38581L48739P61109l76664Q2474J31455k34986j01776n28183k0294
1910.4F70943222j50528J271134M67147N80216N25436k77557J243133j894760j177978
1919.1F71529465O59485M02526Q63495k16140k43988L14636Q23898j99280r6740r1935
$$ plain form
1928.8 673745422 673445358 673258820 672569962 672864227 672847748 673323517 673611679 673676147 673799286 673759079
1938.4 673759079 674155197 673322754 673985519 673594589 671563950 672231064 673070068 673657379 673372726
1947.1 673372726 673655319 673742371 673553543 673543930 673389435 673213272 672800369 672942505 672295303 672592545
1956.7 672592545 673122635 673143158 673487701 673165817 673179550 672613373 672540588 672279510 672073822 672697678
1966.4 672697678 672120438 671829147 672081146 672693100 672637634 672546997 672541122 672164154 672330322 672166290
1976 672166290 672162094 671799011 671776810 671975174 672216949 672654343 672446289 672456512 671831589 671523895 671430817
1986.6 671430817 671420059 671375351 670664139 671022110 671168594 670629501 670578995 671458130 671776352 671283569
1996.3 671283569 671039810 670560608 670287170 669558487 669424133 669693146 670084457 670416336 669966431 669847260
$$ packed form
1928.8F73745422l00064j86538o88858K94265j6479M75769K88162O4468J23139m0207
1938.4F73759079L96118q32443O62765l90930k030639O67114Q39004N87311k84653
1947.1F73372726K82593Q7052j88828r613j54495j76163m12903J42136o47202K97242
1956.7F72592545N30090K0523L44543l21884J3733n66177p2785k61078k05688O23856
1966.4F72697678n77240k91291K51999O11954n5466r0637n875l76968J66168j64032
1976F72166290m196l63083k2201J98364K41775M37394k08054J0223o24923l07694r3078
1986.6F71430817j0758m4708p11212L57971J46484n39093n0506Q79135L18222m92783
1996.3F71283569k43759m79202k73438p28683j34354K69013L91311L31879m49905j19171
$$ plain form
2005.9 669847260 669461365 669634018 669549637 669125366 668740921 668385849 668880844 668552017 668290634 668171692
2015.6 668171692 668116684 667808075 667265091 667248230 667200851 667600174 666940308 666629333 666876831 666733246
2025.2 666733246 666762390 666348877 666275787 665718689 665372391 665034485 664828339 665045242 664684906 664644318
2034.9 664644318 664410934 664507217 664333420 664025040 663934250 663546066 663239212 662855301 662939606 662726135
2044.5 662726135 663112411 663176804 662678223 662808838 662715378 662746429 662003555 661653748 661546783 661453705
2054.1 661453705 661547928 661375427 661585693 661191177 661593781 661657639 661269608 661056290 660499344 660850296
2063.8 660850296 660486069 660193939 660239868 660251007 660144806 659936676 660187454 659981537 660015717 659713974
2073.4 659713974 659590378 659374771 658965454 659164581 659183044 659405212 659317245 659496613 659424438 659248047
$$ packed form
2005.9F69847260l85895J72653q4381m24271l84445l55072M94995l28827k61383j18942
2015.6F68171692n5008l08609n42984j6861m7379L99323o59866l10975K47498j43585
2025.2F66733246K9144m13513p3090n57098l46298l37906k06146K16903l60336m0588
2034.9F64644318k33384R6283j73797l08380r0790l88184l06854l83911Q4305k13471
2044.5F62726135L86276O4393m98581J30615r3460L1051p42874l49807j06965r3078
2054.1F61453705R4223j72501K10266l94516M02604O3858l88031k13318n56946L50952
2063.8F60850296l64227k92130M5929J1139j06201k08130K50778k05917L4180l01743
2073.4F59713974j23596k15607m09317J99127J8463K22168q7967J79368p2175j76391
$$ plain form
2083.1 659248047 659006348 658427429 658411713 657925415 657710571 657389221 657359085 657429581 657253418 657393570
2092.7 657393570 656826859 656685638 656270218 656169968 656402588 656224060 656119690 655716248 655765152 655535431
2102.4 655535431 655736847 655926590 655754852 655350571 654621048 654438934 653974304 654415970 654686508 654401398
2112 654401398 654273300 654294662 654437637 653773041 653922958 653726196 653159180 652586975 652292786 652570496
2121.6 652570496 652239761 652715683 652763138 652920837 652991638 652555084 652710114 652376633 652470779 652316589
2131.3 652316589 652029648 651799774 651970825 652201157 651895599 652374573 652510147 652704849 652373276 651832123
2140.9 651832123 651634827 651411667 651789322 651582794 651509857 651490707 651818542 652136459 652130661 652345810
2150.6 652345810 651989975 651872787 651437302 651121597 651015549 651312637 651912155 652085571 652432480 652304001
$$ packed form
2083.1F59248047k41699n78919j5716m86298k14844l21350l0136P0496j76163J40152
2092.7F57393570n66711j41221m15420j00250K32620j78528j04370m03442M8904k29721
2102.4F55535431K01416J89743j71738m04281p29523j82114m64630M41666K70538k85110
2112F54401398j28098K1362J42975o64596J49917j96762n67016n72205k94189K77710
2121.6F52570496l30735M75922M7455J57699P0801m36554J55030l33481R4146j54190
2131.3F52316589k86941k29874J71051K30332l05558M78974J35574J94702l31573n41153
2140.9F51832123j97296k23160L77655k06528p2937j9150L27835L17917n798K15149
2150.6F52345810l55835j17188m35485l15705j06048K97088N99518J73416L46909j28479
$$ plain form
2160.2 652304001 652577362 652475052 652363968 652323837 651874008 651976929 651465988 651500549 651697159 652096634
2169.9 652096634 652570419 652507401 652742004 652548141 652475204 652023010 652042389 652207031 652140808 652605133
2179.5 652605133 652685699 652948532 652840958 652943497 653065491 653138885 653071365 652566299 652768097 652711716
2189.1 652711716 652916489 652942276 653039932 653550568 653841171 654100113 653916779 654043274 653810120 653681183
2198.8 653681183 653356400 653203506 653447342 653247986 653966217 654120789 654197311 654369125 654450226 654417801
2208.4 654417801 653808670 653939438 653693542 653862152 654025421 654097900 654396667 654408875 654759827 654337997
2218.1 654337997 654429779 654473953 654378891 654383698 653768005 653680267 654006348 654678955 654524841 654514542 654777298
2228.7 654777298 654717712 654542389 654104767 654136124 653554611 653810272 654366379 654371185 654438934 654511337 655070496
$$ packed form
2160.2F52304001K73361j02310j11084m0131m49829J02921n10941L4561J96610L99475
2169.9F52096634M73785o3018K34603j93863p2937m52194J9379J64642o6223M64325
2179.5F52605133Q0566K62833j07574J02539J21994P3394o7520n05066K01798n6381
2189.1F52711716K04773K5787R7656N10636K90603K58942j83334J26495k33154j28937
2198.8F53681183l24783j52894K43836j99356P18231J54572P6522J71814Q1101l2425
2208.4F54417801o09131J30768k45896J68610J63269P2479K98767J2208L50952m21830
2218.1F54337997R1782M4174r5062M807o15693q7738L26081O72607j54114j0299K62756
2228.7F54777298n9586j75323m37622L1357n81513K55661N56107M806O7749P2403N59159
$$ plain form
2239.3 655070496 654731369 654630051 654471512 654322662 654146118 653626785 654099274 654215851 654490662 654453659
2248.9 654453659 654430771 654505997 654231110 654288025 653998718 654280090 654125443 654089203 654222488 653919983
2258.6 653919983 653897095 653832474 654317551 654379807 654393539 654154205 654061356 653977356 653476181 653770218 653565063
2269.2 653565063 653638458 653538818 653740158 654242401 654014511 654181976 653846512 653764954 653588409 653506393
2278.8 653506393 653334961 653157272 653588562 653347778 653606415 653535080 653561935 653611450 653260880 653270645
2288.5 653270645 652783813 652811661 652592163 652621689 652711029 652644272 653020935 653013382 653265533 652910156 652604446
2299.1 652604446 652381363 652244263 652424240 652489243 652749252 652620621 653039627 652973404 652889175 652875519
2308.7 652875519 652631760 653127289 652900772 652814941 652263947 652281113 653104477 653305511 653267517 652730484
$$ packed form
2239.3F55070496l39127j01318j58539j48850j76544n19333M72489J16577K74811l7003
2248.9F54453659k2888P5226k74887N6915k89307K81372j54647l6240J33285l02505
2258.6F53919983k2888o4621M85077O2256J3732k39334r2849q4000n01175K94037k05155
2269.2F53565063P3395r9640K01340N02243k27890J67465l35464q1558j76545q2016
2278.8F53506393j71432j77689M31290k40784K58637p1335K6855M9515l50570R765
2288.5F53270645m86832K7848k19498K9526Q9340o6757L76663p553K52151l55377l05710
2299.1F52604446k23083j37100J79977O5003K60009j28631M19006o6223q4229j3656
2308.7F52875519k43759M95529k26517q5831n50994J7166Q23364K01034l7994n37033
$$ plain form
2318.4 652730484 652918777 652661362 652491379 653025589 653328323 653021698 653369064 654547272 654005737
2327.1 654005737 653856583 653412933 653509293 653914185 652957077 652815018 652471390 652401352 651594009 651485367
2336.7 651485367 651952438 652290649 652254791 651137009 652487564 652585373 651493759 651371002 651628952
2345.4 651628952 651480637 649888611 649132843 649926300 651770630 652451553 652380219 651717834 650960770
2354.1 650960770 651909103 652357941 653761444 653029556 651584702 651028976 650193710 649737930 650125732
2362.7 650125732 651888885 651270981 651340256 649809265 648518219 648852615 647631912 647911758 647299805
2371.4 647299805 646453247 646119766 646173172 645951843 644770584 644084396 643168106 642686844 642270737 641885986
2381.1 641885986 641373062 640723419 640625229 640619278 640711594 640148544 639598541 639264069 639007797 638843956
$$ packed form
2318.4F52730484J88293k57415j69983N34210L02734l06625L47366J178208n41535
2327.1F54005737j49154m43650R6360M04892r57108j42059l43628p0038q07343j08642
2336.7F51485367M67071L38211l5858j117782J350555R7809j091614j22757K57950
2345.4F51628952j48315j592026p55768P93457J844330O80923p1334o62385p57064
2354.1F50960770R48333M48838J403503p31888j444854n55726q35266m55780L87802
2362.7F50125732J763153o17904O9275j530991j291046L34396j220703K79846o11953
2371.4F47299805q46558l33481N3406k21329j181259o86188r16290m81262m16107l84751
2381.1F41885986n12924o49643r8190n951R2316n63050n50003l34472k56272j63841
$$ plain form
2390.7 638843956 638530083 638528214 638407211 638631783 638395271 637787056 637315788 636901016 636916008 636764984
2400.3 636764984 636589355 635887489 635753822 635842972 635606117 635590591 635039978 634985313 634671707 634188347
2410 634188347 633760223 633270302 633236923 633135338 633162918 632716599 632479935 631958694 631203728 631181297
2419.6 631181297 631204491 631142120 630552521 630208778 630007973 630031891 629861183 629149933 628477898 627691040
2429.3 627691040 627762680 627616882 627481232 627260132 626551666 626413803 626015739 625653915 625203819 625084915
2438.9 625084915 625023308 624695587 624491692 624031715 623781128 622972450 622279053 622236099 622242241 621847649
2448.6 621847649 621434975 621339417 620758591 620364265 619692421 619502640 619598389 618996773 618648453 618186226
2458.2 618186226 617934074 617463188 617034950 616742592 616282272 616040955 615637321 615135002 614488144 614222641
$$ packed form
2390.7F38843956l13873j869j21003K24572k36512o08215m71268m14772J4992j51024
2400.3F36764984j75629p01866j33667Q9150k36855j5526n50613n4665l13606m83360
2410F34188347m28124m89921l3379j01585K7580m46319k36664n21241p54966k2431
2419.6F31181297K3194o2371n89599l43743k00805K3918j70708p11250o72035p86858
2429.3F27691040P1640j45798j35650k21100p08466j37863l98064l61824m50096j18904
2438.9F25084915o1607l27721k03895m59977k50587q08678o93397m2954O142l94592
2448.6F21847649m12674r5558n80826l94326o71844j89781R5749o01616l48320m62227
2458.2F18186226k52152m70886m28238k92358m60320k41317m03634n02319o46858k65503
$$ plain form
2467.8 614222641 613575020 613059692 613116913 613039246 613002663 612224503 611577377 611000710 610680809 610593338
2477.5 610593338 609963417 609226227 608378716 608139114 607866364 607486076 607110100 606914482 606631203 605881386
2487.1 605881386 605697212 605011215 604470940 604052277 603285065 602882462 602761078 602589340 601427307
2495.8 601427307 600653572 600142212 599880180 599709053 599017143 598743095 598206825 597786674 596943932 596318703
2505.5 596318703 596026993 595371056 595108643 594620399 594651222 594278908 593664055 593358955 592785568 592340126
2515.1 592340126 591491966 590894012 590367966 590372887 590414314 589802780 589462204 589059105 588778305 588463783
2524.7 588463783 588247910 587567253 586842041 586780243 586527061 585828133 584971809 584684372 584043350 583604774
2534.4 583604774 583441696 583055840 582989159 582500839 582020493 581224861 580488205 579905624 579455528 579530029
$$ packed form
2467.8F14222641o47621n15328N7221p7667l6583p78160o47126n76667l19901q7471
2477.5F10593338o29921p37190q47511k39602k72750l80288l75976j95618k83279p49817
2487.1F05881386j84174o85997n40275m18663p67212m02603j21384j71738j162033
2495.8F01427307p73735n11360k62032j71127o91910k74048n36270m20151q42742o25229
2505.5E96318703k91710o55937k62413m88244L0823l72314o14853l05100n73387m45442
2515.1E92340126q48160n97954n26046M921M1427o11534l40576m03099k80800l14522
2524.7E88463783k15873o80657p25212o1798k53182o98928q56324k87437o41022m38576
2534.4E83604774j63078l85856o6681m88320m80346p95632p36656n82581m50096P4501
$$ plain form
2544 579530029 579397697 579298439 578856773 578412476 577715378 577185555 577010307 576511879 576294556 575745163
2553.7 575745163 575468216 575142517 574635658 574028320 573428802 573625145 573127937 572587547 572289124 571963005
2563.3 571963005 571373672 570376663 570052299 569612312 569177475 568953133 568934479 568755035 568343887 568010139
2573 568010139 567330933 566945915 566369934 565751915 565344048 564971237 564689331 564515915 564593620 563960686
2582.6 563960686 563123131 562431374 562030258 561826630 561507111 561199875 560454483 560064011 559607277 559018211
2592.2 559018211 558852119 558629608 558320770 557845802 557176781 556300468 555705872 555307236 555210533 554930878
2601.9 554930878 554381218 554090347 553299370 552730217 552491875 552208290 551586304 551034355 550761681 549851036
2611.5 549851036 549101486 548436813 548109055 547854576 547302170 546923027 546419830 545820580 544656982
$$ packed form
2544E79530029j32332r9258m41666m44297o97098n29823j75248m98428k17323n49393
2553.7E75745163k76947l25699n06859o07338n99518J96343m97208n40390k98423l26119
2563.3E71963005n89333r97009l24364m39987m34837k24342j8654j79444m11148l33748
2573E68010139o79206l85018n75981o18019m07867l72811k81906j73416P7705o32934
2582.6E63960686q37555o91757m01116k03628l19519l07236p45392l90472m56734n89066
2592.2E59018211j66092k22511l08838m74968o69021q76313n94596l98636r6703k79655
2601.9E54930878n49660k90871p90977n69153k38342k83585o21986n51949k72674r10645
2611.5E49851036p49550o64673l27758k54479n52406l79143n03197n99250j163598
$$ plain form
2620.2 544656982 544226532 544219818 543604240 543095779 542710037 542331238 541336670 540816612 540629616 540039444
2629.9 540039444 539385147 538561134 538099976 537673302 537273064 536705017 536048813 535571289 535263138 535044212
2639.5 535044212 534428444 533636742 532794037 532471695 531958694 531315727 530932045 530212440 529805870 529188805
2649.1 529188805 528585205 528206482 527936516 527488556 526745262 526551132 526156120 525537834 524816437 524319000
2658.8 524319000 524055214 523814468 523572502 522690620 521981010 521295662 520793457 520326424 519713669 519561539
2668.4 519561539 519340477 519236717 518985672 518925705 518658905 517835884 517186546 516525383 516110725 515734367
2678.1 515734367 515404396 515008354 514707603 514217072 513510475 513168259 512709274 512449036 511838684 511121101
2687.7 511121101 510722237 510534325 510391769 509875374 509851685 509634476 509363060 509116631 508591652 507959671
$$ packed form
2620.2E44656982m30450o714o15578n08461l85742l78799r94568n20058j86996n90172
2629.9E40039444o54297q24013m61158m26674m00238n68047o56204m77524l08151k18926
2639.5E35044212o15768p91702q42705l22342n13001o42967l83682p19605m06570o17065
2649.1E29188805o03600l78723k69966m47960p43294j94130l95012o18286p21397m97437
2658.8E24319000k63786k40746k41966q81882p09610o85348n02205m67033o12755j52130
2668.4E19561539k21062j03760k51045n9967k66800q23021o49338o61163m14658l76358
2678.1E15734367l29971l96042l00751m90531p06597l42216m58985k60238o10352p17583
2687.7E11121101l98864j87912j42556n16395k3689k17209k71416k46429n24979o31981
$$ plain form
2697.4 507959671 506960678 506672211 506404495 505884743 505488968 505205498 505258102 505128136 504656601 503881264
2707 503881264 503270721 502583847 502165451 501827850 501433144 501406784 501113167 501000671 500569916 500103378
2716.6 500103378 499894600 499588013 499230347 498484726 498175240 497885437 497544136 497296829 497081223 496877861
2726.3 496877861 496554375 496245918 495386848 495083847 494907761 494553261 494520454 494332504 494216080 493614769
2735.9 493614769 493308830 493379631 493404503 493060570 492542038 492569809 492317696 492244720 491719398 491023064
2745.6 491023064 490899239 490736542 490832405 490682983 490436172 489995575 489626160 489375992 488841057 488335724
2755.2 488335724 487854919 487802467 487818108 487729149 487467270 487329330 487172852 486786079 486661835 486066895
2764.9 486066895 485490036 485011520 484230919 483414536 483155403 483518066 483338737 482984352 482656021 482343521
$$ packed form
2697.4E07959671r98993k88467k67716n19752l95775k83470N2604j29966m71535p75337
2707E03881264o10543o86874m18396l37601l94706k6360k93617j12496m30755m66538
2716.6E00103378k08778l06587l57666p45621l09486k89803l41301k47307k15606k03362
2726.3D96877861l23486l08457q59070l03001j76086l54500l2807j87950j16424o01311
2735.9D93614769l05939P0801K4872l43933n18532K7771k52113p2976n25322o96334
2745.6D91023064j23825j62697R5863j49422k46811m40597l69415k50168n34935n05333
2755.2D88335724m80805n2452J5641q8959k61879j37940j56478l86773j24244n94940
2764.9D86066895n76859m78516p80601q16383k59133L62663j79329l54385l28331l12500
$$ plain form
2774.5 482343521 481769562 481081810 480797195 480237846 479586296 479071274 478812485 478260269 477693748 477453995
2784.2 477453995 476949120 476718330 476312447 475560989 474942207 474561615 474041252 473241501 472500267 472259789
2793.8 472259789 472406082 471647224 471017265 470579681 469463921 468463669 467771111 467393341 466591759
2802.5 466591759 465623016 464848213 464460487 464035721 462967758 462312622 461890526 461348991 460435333
2811.2 460435333 459656219 458793297 457374420 456535530 455706520 454880753 454345551 453841667 453201256
2819.8 453201256 452482910 451629601 450219879 449081841 448233566 447405777 446265411 445318527 444719048
2828.5 444719048 443522377 442588005 441663666 440395203 439468346 438878975 437663193 436159668 435069237
2837.2 435069237 433363533 431764221 430306778 428493919 426435165 424449310 422835197 420711250
$$ packed form
2774.5D82343521n73959o87752k84615n59349o51550n15022k58789n52216n66521k39753
2784.2D77453995n04875k30790m05883p51458o18782l80592n20363p99751p41234k40478
2793.8D72259789J46293p58858o29959m37584j115760j000252o92558l77770q01582
2802.5D66591759r68743p74803l87726m24766j067963o55136m22096n41535r13658
2811.2D60435333p79114q62922j418877q38890q29010q25767n35202n03884o40411
2819.8D53201256p18346q53309j409722j138038q48275q27789j140366r46884n99479
2828.5D44719048j196671r34372r24339j268463r26857n89371j215782j503525j090431
2837.2D35069237j705704j599312j457443j812859k058754j985855j614113k123947
$$ plain form
2844.9 420711250 418440895 415894966 413188591 410662270 408391647 406427689 404348068 402756042
2852.6 402756042 401371269 400775299 400882607 400935135 401082191 400902138 400564499 400015984 399891281 399590721
2862.3 399590721 399109192 398854446 397755356 396703911 395682259 394657707 393972511 393441429 392855873
2870.9 392855873 391970787 391222115 390073471 389094353 388582726 387972717 387677879 387378769 386626244
2879.6 386626244 385643806 384739723 384091072 383680801 382855988 381935387 380971985 379670982 378601418
2888.3 378601418 377485352 376413231 375168839 373864784 372839966 372041168 371364250 370262794 369437828
2897 369437828 368810120 367984428 366999931 365948639 365027657 364277534 363965645 363231010 362244835 361280823
2906.6 361280823 360471802 359863510 358754311 357675285 356412735 355106354 353646278 351730995 349976501
$$ packed form
2844.9D20711250k270355k545929k706375k526321k270623j963958k079621j592026
2852.6D02756042j384773n95970J07308N2528J47056j80053l37639n48515j24703l00560
2862.3C99590721m81529k54746j099090j051445j021652j024552o85196n31082n85556
2870.9C92855873q85086p48672j148644r79118n11627o10009k94838k99110p52525
2879.6C86626244r82438r04083o48651m10271q24813r20601r63402j301003j069564
2888.3C78601418j116066j072121j244392j304055j024818p98798o76918j101456q24966
2897C69437828o27708q25692r84497j051292r20982p50123l11889p34635r86175r64012
2906.6C61280823q09021o08292j109199j079026j262550j306381j460076j915283j754494
$$ plain form
2915.3 349976501 348508072 347020493 345157242 343802643 342534332 341131668 340148010 339333076 338854141
2924 338854141 338304863 337787361 337392807 337615356 338191795 338446159 338391151 338152084 338754883 339623222
2933.6 339623222 340684814 341552010 341957436 342804947 343573837 344562836 345423279 346160889 346868553
2942.3 346868553 347403259 348232193 348774490 349681244 350901260 351636505 351936493 352332420 353132591
2951 353132591 353858452 354545555 354435158 354055672 354750404 355318184 355418358 356160507 356660919 356909256
2960.6 356909256 357764549 358186836 358710480 359804344 360873985 361568260 361924553 362740440 363714180
2969.3 363714180 364728546 365548515 366429939 367528191 367972031 368371773 369072533 369928131 370892372
2978 370892372 371575584 371807594 372105179 372590485 372856255 372900391 372958069 373664856 374097557 374079094
$$ packed form
2915.3C49976501j468429j487579j863251j354599j268311j402664r83658q14934m78935
2924C38854141n49278n17502l94554K22549N76439K54364n5008k39067O02799Q68339
2933.6C39623222J061592Q67196M05426Q47511P68890R88999Q60443P37610P07664
2942.3C46868553N34706Q28934N42297R06754J220016P35245K99988L95927Q00171
2951C53132591P25861O87103j10397l79486O94732N67780J00174P42149N00412K48337
2960.6C56909256Q55293M22287N23644J093864J069641O94275L56293Q15887R73740
2969.3C63714180J014366Q19969Q81424J098252M43840L99742P00760Q55598R64241
2978C70892372O83212K32010K97585M85306K65770M4136N7678P06787M32701j8463
$$ plain form
2987.6 374079094 374488373 374867477 374963837 374817009 374938278 374932823 374653969 374443398 374314270 374338226
2997.3 374338226 373962746 373470955 372909889 372452583 372066612 371591339 371239014 370591545 370006104 369175034
3006.9 369175034 368389931 368270187 367962189 367210617 366547661 365968781 365433922 365410194 364859161 363882484
3016.6 363882484 363275299 362389145 361576271 361101341 360611076 359773483 359116554 358535118 357514801
3025.2 357514801 356564980 355941887 355382538 354593048 354139214 353447609 352378998 351455269 350559349
3033.9 350559349 349942398 349032974 348317299 347436218 346123505 345382309 345095100 344810371 344048691
3042.6 344048691 343117294 341820908 340746651 340059090 339226036 338598938 337631912 336747055 335932312
3051.3 335932312 335169220 334253082 333211212 332725410 331909294 330999146 329946671 329092407 328728752
$$ packed form
2987.6C74079094M09279L79104R6360j46828J21269n455k78854k10571j29128K3956
2997.3C74338226l75480m91791n61066m57306l85971m75273l52325o47469n85441q31070
3006.9C69175034p85103j19744l07998p51572o62956n78880n34859k3728n51033r76677
3016.6C63882484o07185q86154q12874m74930m90265q37593o56929n81436j020317
3025.2C57514801r49821o23093n59349p89490m53834o91605j068611r23729q95920
3033.9C50559349o16951r09424p15675q81081j312713p41196k87209k84729p61680
3042.6C44048691r31397j296386j074257o87561q33054o27098r67026q84857q14743
3051.3C35932312p63092r16138j041870m85802q16116r10148j052475q54264l63655
$$ plain form
3060 328728752 328053513 327199059 326326866 325665398 324721451 324139290 323795891 322905388 322192955 321358910
3069.6 321358910 320338631 319342117 318884144 318538361 317641487 316938095 316517487 315891571 314936371
3078.3 314936371 314404507 314069691 313388023 312398148 311446953 310830307 310155106 309538193 308844814 308334694
3087.9 308334694 307610378 306646729 306183758 305532360 304722481 303966236 303638554 303212090 301928005
3096.6 301928005 300851841 300532036 300507641 299963818 299067650 298193474 297475758 296596203 295528984
3105.3 295528984 294787331 294040432 293428135 292751942 291967049 291408596 291126041 290641251 289845924 289217186
3114.9 289217186 288145695 287394466 286671696 285581264 285033283 284352379 283750286 283131008 282405167
3123.6 282405167 281831608 281099873 280316658 279872665 279420185 278386574 277551365 276435280 275308456
$$ packed form
3060C28728752o75239q54454q72193o61468r43947n82161l43399q90503p12433q34045
3069.6C21358910j020279r96514m57973l45783q96874p03392m20608o25916r55200
3078.3C14936371n31864l34816o81668r89875r51195o16646o75201o16913o93379n10120
3087.9C08334694p24316r63649m62971o51398q09879p56245l27682m26464j284085
3096.6C01928005j076164l19805k4395n43823q96168q74176p17716q79555j067219
3105.3B95528984p41653p46899o12297o76193p84893n58453k82555m84790p95327o28738
3114.9B89217186j071491p51229p22770j090432n47981o80904o02093o19278p25841
3123.6B82405167n73559p31735p83215m43993m52480j033611q35209j116085j126824
$$ plain form
3132.3 275308456 274556732 273524723 273091755 272877350 272242107 271168404 270346832 269810276 269031715
3141 269031715 268442764 267484112 266223793 265194321 264653988 264024887 263250122 263003902 262608738 261936417
3150.6 261936417 261091824 260559387 259996834 258919296 257958469 257214222 256396484 255246773 254652901
3159.3 254652901 254071846 253188763 252663288 251985016 251392918 250771561 250104294 249288406 248512726 247879696
3168.9 247879696 247106209 246523285 245724983 244935436 244238071 243733673 243058243 241958065 241132965
3177.6 241132965 240314236 240001717 239454861 238326015 237733707 237396183 237076130 236480408 235658951
3186.3 235658951 234903660 234173508 233467026 233001938 232293186 231198254 230606117 230043926 229435177
3195 229435177 228893299 228312092 227748680 227065086 226874905 226718426 225843849 224854507 224335594 223472233
$$ packed form
3132.3B75308456p51724j032009m32968k14405o35243j073703q21572n36556p78561
3141B69031715n88951r58652j260319j029472n40333o29101p74765k46220l95164o72321
3150.6B61936417q44593n32437n62553j077538r60827p44247q17738j149711n93872
3159.3B54652901n81055q83083n25475o78272n92098o21357o67267q15888p75680o33030
3168.9B47879696p73487n82924p98302p89547o97365n04398o75430j100178q25100
3177.6B41132965q18729l12519n46856j128846n92308l37524l20053n95722q21457
3186.3B35658951p55291p30152p06482m65088p08752j094932n92137n62191o08749
3195B29435177n41878n81207n63412o83594j90181j56479q74577r89342n18913q63361
$$ plain form
3204.6 223472233 222706738 222557430 221632690 220650883 220034676 219661541 219495010 218785286 218414078 218199749
3214.3 218199749 217635880 217365513 216932297 216210957 215718174 214892159 213876171 213261242 212541142
3222.9 212541142 212285118 212296638 211666431 210991993 210386753 209600964 209062462 209121208 208978996 208310242
3232.6 208310242 207827282 207178307 206243286 205923195 205411530 204326954 204216690 204336605 203803501
3241.3 203803501 203117046 202548428 202544289 202298546 201536140 201049805 200605488 199978771 199804478 199838295
3250.9 199838295 199611053 199572964 199063797 198237438 197593307 196748428 196219730 195916195 195395184 194865932
3260.5 194865932 194665375 194512711 194107742 193550396 193236389 193279705 192945385 192385197 191804523 191217117
3270.2 191217117 190701103 190395432 190413303 190234146 190227699 189924431 189090633 188665180 188272781 187796001
$$ packed form
3204.6B23472233p65495j49308r24740r81807o16207l73135j66531p09724l71208k14329
3214.3B18199749n63869k70367m33216p21340m92783q26015j015988o14929p20100
3222.9B12541142k56024J1520o30207o74438o05240p85789n38502N8746j42212o68754
3232.6B08310242m82960o48975r35021l20091n11665j084576j10264J19915n33104
3241.3B03803501o86455n68618m139k45743p62406m86335m44317o26717j74293L3817
3250.9A99838295k27242l8089n09167q26359o44131q44879n28698l03535n21011n29252
3260.5A94865932k00557j52664m04969n57346l14007M3316l34320n60188n80674n87406
3270.2A91217117n16014l05671J7871j79157o447l03268q33798m25453l92399m76780
$$ plain form
3279.8 187796001 187388935 187063007 186962833 186994057 186843834 186421509 185967789 185756092 185696297 185314388
3289.5 185314388 185004578 184764729 184357510 184270763 184316540 184102516 183625507 183106556 182879524 182968025
3299.1 182968025 182802086 182449799 182026138 181605797 181597977 181481419 181267242 180908928 180568027 180293331
3308.8 180293331 179894810 179981499 179730492 179409580 179297142 178755722 178356152 177944126 177634144 177523575
3318.4 177523575 177231712 176847115 176804180 176621304 175994911 175733967 175329113 174871368 174614296 174104061
3328.1 174104061 173463955 172913113 172472668 171973114 172140388 172171345 171611633 171348114 170693188 170013504
3337.7 170013504 169784393 169628086 169132195 168683910 168771114 168662605 168512821 167934361 167281227 167186165
3347.3 167186165 166822777 166845760 166985836 166841354 166871510 166591072 166537685 166539745 166120319 165935421
$$ packed form
3279.8A87796001m07066l25928j00174L1224j50223m22325m53720k11697n9795l81909
3289.5A85314388l09810k39849m07219q6747M5777k14024m77009n18951k27032Q8501
3299.1A82968025j65939l52287m23661m20341p820j16558k14177l58314l40901k74696
3308.8A80293331l98521Q6689k51007l20912j12438n41420l99570m12026l09982j10569
3318.4A77523575k91863l84597m2935j82876o26393k60944m04854m57745k57072n10235
3328.1A74104061o40106n50842m40445m99554J67274L0957n59712k63519o54926o79684
3337.7A70013504k29111j56307m95891m48285Q7204j08509j49784n78460o53134r5062
3347.3A67186165l63388K2983J40076j44482L0156k80438n3387K060m19426j84898
$$ plain form
3357 165935421 165761604 165483055 165281086 164977589 164612293 164697628 165143700 165334225 165272999 164904938
3366.6 164904938 164768734 165058613 165053501 164712162 164430695 164412613 164194698 164060822 164251442 164426708
3376.3 164426708 164421921 164125309 164161301 164204922 164082737 164058666 164184074 164285736 163879280 163821564 163959045
3386.9 163959045 164235821 164522514 164140263 163813915 163686256 163897781 164110126 164377708 164804821 164859428
3396.5 164859428 164594402 164101810 164209251 164513721 164878120 165092239 164940414 165153618 164947186 164965382
3406.2 164965382 165252132 165206356 165179806 165390224 166109829 166196842 165725918 165410671 165779686 166488247
3415.8 166488247 166723633 167215118 167580910 167665920 167285347 166570110 166695290 167706184 168692570 168784504
3425.5 168784504 168916779 169069881 168846855 169077282 169331551 169740887 170680218 171092548 170955486 170905380
$$ packed form
3357A65935421j73817k78549k01969l03497l65296Q5335M46072J90525o1226l68061
3366.6A64904938j36204K89879n112l41339k81467j8082k17915j33876J90620J75266
3376.3A64426708m787k96612L5992M3621j22185k4071J25408J01662m06456n7716J37481
3386.9A63959045K76776K86693l82251l26348j27659K11525K12345K67582M27113N4607
3396.5A64859428k65026m92592J07441L04470L64399K14119j51825K13204k06432J8196
3406.2A64965382K86750m5776k6550K10418P19605Q7013m70924l15247L69015P08561
3415.8A66488247K35386M91485L65792Q5010l80573p15237J25180J010894R86386R1934
3425.5A68784504J32275J53102k23026K30427K54269M09336R39331M12330j37062n0106
$$ plain form
3435.1 170905380 170943604 171559868 171988010 172229519 172697906 172549057 172780018 173426723 174309711 175044613
3444.7 175044613 175289211 175803814 175513821 175633793 176553745 177027473 177286453 177780609 178293495 178120098
3454.4 178120098 178444576 179372654 180451298 181028881 180569344 180799980 181356163 181703663 181981373
3463.1 181981373 182603626 183659172 184012451 184274502 184986210 186001873 186606884 186688881 187103462
3471.7 187103462 187757664 188471851 189009247 189656811 190288734 190830002 191654167 192349739 192740993 193364239
3481.4 193364239 193973961 194233837 195080929 195685253 196192474 197607555 198547764 198623791 198873634 199834862
3491 199834862 200562744 201076241 201943645 202675018 203520012 204014091 204142265 204293938 204955559 206295433
3500.7 206295433 207948799 209262676 209000988 208853550 209533348 210325089 211428738 213207493 214356537
$$ packed form
3435.1A70905380L8224O16264M28142K41509M68387j48849K30961O46705Q82988P34902
3444.7A75044613K44598N14603k89993J19972R19952M73728K58980M94156N12886j73397
3454.4A78120098L24478R28078J078644N77583m59537K30636N56183L47500K77710
3463.1A81981373O22253J055546L53279K62051P11708J015663O05011Q1997M14581
3471.7A87103462O54202P14187N37396O47564O31923N41268Q24165O95572L91254O23246
3481.4A93364239O09722K59876Q47092O04324N07221J415081R40209P6027K49843R61228
3491A99834862P27882N13497Q67404P31373Q44994M94079J28174J51673O61621J339874
3500.7B06295433J653366J313877k61688j47438O79798P91741J103649J778755J149044
$$ plain form
3509.4 214356537 213950176 214773617 215632324 216079407 217149277 217827587 218731537 219927025 221016312
3518 221016312 221474667 221956749 223261604 224733429 225882511 226281853 226836643 227546597 228693981
3526.7 228693981 229933720 230370426 230920429 232095718 233235912 233952923 235196609 236346436 237564449
3535.4 237564449 238485851 238563786 240051918 242229347 243570614 243808861 244593830 245960083 247375603
3544.1 247375603 248548126 248965340 250667477 251396923 252660847 254191437 255132713 257352028 257893829
3552.7 257893829 259525852 261321411 262225571 263712521 264406757 266287880 267864418 268990440 270029926
3561.4 270029926 271648521 273073425 273804874 277172146 277992687 278760567 280778313 280652962 283092384
3570.1 283092384 284653111 286087284 288141537 290124435 291360321 292939262 295384140 295974693
$$ packed form
3509.4B14356537m06361Q23441Q58707M47083J069870O78310R03950J195488J089287
3518B21016312M58355M82082J304855J471825J149082L99342N54790P09954J147384
3526.7B28693981J239739M36706N50003J175289J140194P17011J243686J149827J218013
3535.4B37564449R21402P7935J488132K177429J341267K38247P84969J366253J415520
3544.1B47375603J172523M17214J702137P29446J263924J530590R41276K219315N41801
3552.7B57893829J632023J795559R04160J486950O94236J881123J576538J126022J039486
3561.4B70029926J618595J424904P31449L367272Q20541P67880K017746j25351K439422
3570.1B83092384J560727J434173K054253J982898J235886J578941K444878N90553
$$ plain form
3577.8 295974693 297514572 299291649 301015949 303280010 305503139 307629070 308877926 312536488
3585.5 312536488 314532967 313673172 315057602 315005398 317585602 320562630 323701172 325438614 325950317
3594.2 325950317 328802528 329503365 332143745 336187019 338039589 340287933 341471558 342653580
3601.9 342653580 344762993 346679344 348919334 352754097 356208076 355418091 358051796 359411659
3609.6 359411659 359686241 365942879 367891922 367269821 371717148 372698746 376462517 380924149 382085495
3618.3 382085495 384147339 384489555 386704788 390239906 392674561 395119133 398214684 401413460
3626 401413460 404938049 410707626 411309090 405603180 409930534 415110092 421111221 424020767 423280334
3634.7 423280334 425953522 430110092 433812523 435908546 438119507 441303368 445168877 447798576
$$ packed form
3577.8B95974693J539879J777077J724300K264061K223129K125931J248856L658562
3585.5C12536488J996479q59795J384430n2204K580204K977028L138542J737442N11703
3594.2C25950317K852211P00837K640380M043274J852570K248344J183625J182022
3601.9C42653580K109413J916351K239990L834763L453979p89985K633705J359863
3609.6C59411659K74582O256638J949043o22101M447327R81598L763771M461632J161346
3618.3C82085495K061844L42216K215233L535118K434655K444572L095551L198776
3626D01413460L524589N769577O01464n705910M327354N179558O001129K909546p40433
3634.7D23280334K673188M156570L702431K096023K210961L183861L865509K629699
$$ plain form
3642.4 447798576 448697662 451480713 455741997 462027588 463092537 459897156 466235504 469744949
3650.1 469744949 468593674 468138161 473392029 478999176 483907204 490088921 484534874 485972939
3657.9 485972939 491861763 494118156 496733093 498309708 501189232 502904968 504841232 507533798
3665.6 507533798 508554955 514030724 517850876 517569847 519910736 514000015 515788918 524731789
3673.3 524731789 534995956 537335205 520155792 521368217 530142174 536347084 534047585 533660469
3681 533660469 536854668 539205208 540953217 541636200 542087021 546744385 555432968 547606544 542489815
3689.7 542489815 552236977 547897720 546223869 551107750 551636620 553309784 554384804 554562035 556013832
3698.4 556013832 556470451 559115067 563317833 558887558 555594444 560240822 562008934 562686348 563841209
$$ packed form
3642.4D47798576Q99086K783051M261284O285591J064949l195381O338348L509445
3650.1D69744949j151275m55513N253868N607147M908028O181717n554047J438065
3657.9D85972939N888824K256393K614937J576615K879524J715736J936264K692566
3665.6E07533798J021157N475769L820152k81029K340889n910721J788903Q942871
3673.3E24731789J0264167K339249j7179413J212425Q773957O204910k299499l87116
3681E33660469L194199K350540J748009O82983M50821M657364Q688583p826424n116729
3689.7E42489815R747162m339257j673851M883881N28870J673164J075020J77231J451797
3698.4E56013832M56619K644616M202766m430275l293114M646378J768112O77414J154861
$$ plain form
3707 563841209 566464119 571365166 565273209 568900604 574496689 560769424 564536209 569241829
3714.8 569241829 569742813 570902138 573565292 575165749 571292572 572056160 578304825 575605698 571286736
3723.4 571286736 576662941 577846718 576974678 574711838 574817314 579169693 579778252 584270439 582693558
3732.1 582693558 575568542 584642181 587337303 578467827 577229004 578938332 579288330 581893921
3739.8 581893921 585561523 581774559 585172997 598535080 588925133 569503632 579906578 586497307
3747.5 586497307 592247658 588925896 579455566 591526184 587022896 577942581 583438416 588066750
3755.3 588066750 591898270 586365318 588192482 595089569 587996635 585350990 589161034 589976044
3763 589976044 589957428 594449425 593028717 587408752 590031624 595423927 597065735 587538643 588148499
$$ packed form
3707E63841209K622910M901047o091957L627395N596085j3727265L766785M705620
3714.8E69241829N00984J159325K663154J600457l873177P63588O248665k699127m318962
3723.4E71286736N376205J183777q72040k262840J05476M352379O08559M492187j576881
3732.1E82693558p125016R073639K695122q869476j238823J709328L49998K605591
3739.8E81893921L667602l786964L398438J3362083r609947j9421501J0402946O590729
3747.5E86497307N750351l321762r470330J2070618m503288r080315N495835M628334
3755.3E88066750L831520n532952J827164O897087p092934k645645L810044Q15010
3763E89976044j8616M491997j420708n619965K622872N392303J641808r527092O09856
$$ plain form
3771.7 588148499 591525383 592288818 593704338 593200569 593814621 594370651 597699242 598346062 589760170
3780.3 589760170 591837654 594404030 595514374 597776642 595054054 593928299 594968758 595672951
3788 595672951 596335106 596252060 596332893 596134262 596571121 596285400 597504234 601567039 598696327 593816071
3797.7 593816071 595070076 599575043 607515030 601788330 589016800 592906113 595753288 600218773
3805.4 600218773 606324883 597848091 593348694 598159866 599430542 598542175 599081650 599525108 601066284
3814.1 601066284 607916069 608043289 591607552 595007820 601413803 607503662 611658478 593178673
3821.8 593178673 592296448 597761841 600069389 603033600 603846283 599660606 599026451 600405273 603844376
3830.5 603844376 605875359 596298866 598623924 607082520 601888847 601128120 609716034 600772552
$$ packed form
3771.7E88148499L376884P63435J415520n03769O14052N56030L328591O46820q585892
3780.3E89760170K077484K566376J110344K262268k722588j125755J040459P04193
3788E95672951O62155q3046Q0833j98631M36859k85721J218834M062805k870712m880256
3797.7E93816071J254005M504967P939987n726700j2771530L889313K847175M465485
3805.4F00218773O106110q476792m499397M811172J270676q88367N39475M43458J541176
3814.1F01066284O849785J27220j6435737L400268O405983O089859M154816j8479805
3821.8E93178673q82225N465393K307548K964211Q12683m185677o34155J378822L439103
3830.5F03844376K030983r576493K325058Q458596n193673p60727Q587914q943482
$$ plain form
3838.2 600772552 595547523 604700546 599481697 597917747 605781670 603771896 599223022 602159462
3845.9 602159462 603491821 602868271 604055290 603053818 605565224 612702713 608589020 610588989
3853.6 610588989 593825912 592388916 603098755 601463737 598806801 601360512 604288101 607487373
3861.3 607487373 602094574 601511116 607622375 601377831 595997696 600284424 605926476 613306694
3869.1 613306694 606720390 594847031 597456436 603696556 608192406 599242058 599226952 603365707
3876.8 603365707 603537254 605741882 610511398 604768944 595692444 601840057 603280907 604177170 609921761
3885.4 609921761 596901779 597516403 602254181 603359833 608342590 607959518 598751259 599187737 603025856
3894.1 603025856 602345200 603025627 603650627 606153984 608664207 599011230 603804703 605548897 598861771
$$ packed form
3838.2F00772552n225029R153023n218849j563950P863923k009774m548874K936440
3845.9F02159462J332359o23550J187019j001472K511406P137489m113693J999969
3853.6F10588989j6763077j436996J0709839j635018k656936K553711K927589L199272
3861.3F07487373n392799n83458O111259o244544n380135M286728N642052P380218
3869.1F13306694o586304j1873359K609405O240120M495850q950348j5106M138755
3876.8F03365707J71547K204628M769516n742454r076500O147613J440850Q96263N744591
3885.4F09921761j3019982O14624M737778J105652M982757l83072r208259M36478L838119
3894.1F03025856o80656O80427O25000K503357K510223r652977M793473J744194o687126
$$ plain form
3902.8 598861771 603914909 602007751 600393105 600419121 600460014 602404556 602661438 603307800 602730865
3911.5 602730865 602211685 602254715 602027512 603328590 605297394 602303696 599158020 604243927 604570122
3920.2 604570122 599532928 601520233 603723717 605418358 603574944 599550438 600968666 602273750
3927.9 602273750 603410988 603156700 602002678 603980598 602682037 600743637 601366577 601024704 600998383
3936.6 600998383 601408615 601495323 601501350 601681747 603236847 604622078 600784492 599009628 600311737
3945.2 600311737 600993729 602408791 601075783 601825447 602168503 599075012 600936317 601764679 601105614
3953.9 601105614 601415825 601543770 601783562 601170158 601618309 600848846 601298370 601925392 599550705
3962.6 599550705 599733696 600486259 600609474 601061249 601165771 601692390 601787186 601082802 601169281 601181755
$$ packed form
3902.8E98861771N053138j907158j614646K6016M0893J944542K56882O46362n76935
3911.5F02730865n19180M3030k27203J301078J968804k993698l145676N085907L26195
3920.2F04570122n037194J987305K203484J694641j843414m024506J418228J305084
3927.9F02273750J137238k54288j154022J977920j298561j938400O22940l41873k6321
3936.6F00998383M10232Q6708O027J80397J555100J385231l837586j774864J302109
3945.2F00311737O81992J415062j333008P49664L43056l093491J861305Q28362o59065
3953.9F01105614L10211J27945K39792o13404M48151p69463M49524O27022k374687
3962.6E99550705J82991P52563J23215M51775J04522N26619R4796p04384Q6479J2474
$$ plain form
3972.2 601181755 600152016 600532341 601288223 601043320 600593987 600199242 600304794 600923233 601240044
3980.9 601240044 600902901 601156769 601464348 601954231 601753769 600827827 601006165 601156044 601908607 602304382
3990.6 602304382 601784325 600691185 599730835 600471764 600728798 601059532 601585999 602019043 602232285
3999.2 602232285 601405640
4000.2 601405640
$$ packed form
3972.2F01181755j029739L80325P55882k44903m49333l94745J05552O18439L16811
3980.9F01240044l37143K53868L07579M89883k00462r25942J78338J49879P52563L95775
3990.6F02304382n20057j093140r60350P40929K57034L30734N26467M33044K13242
3999.2F02232285q26645
4000.2F01405640
##END=$$ End of the data block
