##TITLE=$$ Begin of the data block
##JCAMP-DX=5.00 $$ ACD/SpecManager v 10.08
##SPECTROMETER/DATA SYSTEM=Varian
##DATE=15 Jan 2013 11:01:06
##DATA TYPE=INFRARED SPECTRUM
##DATA CLASS=XYDATA
##ORIGIN=
##OWNER=
##NPOINTS=3735
##FIRSTX=399.26403809
##LASTX=4000.35498047
##MAXX=4000.35498047
##MINX=399.26403809
##MAXY=67.49334717
##MINY=16.46152878
##XFACTOR=1.0000000000
##YFACTOR=0.000000100000000
##FIRSTY=36.74222565
##DELTAX=0.96440572
##XUNITS=1/CM
##YUNITS=TRANSMITTANCE
##XYDATA=(X++(Y..Y))
$$ plain form
399.3 367422256 356197014 356633911 357375221 356447945 358563309 358543320 358580551 356590309 352540207
407.9 352540207 348722496 345311852 350865822 359636040 355760765 350511360 354993896 351121101
415.7 351121101 344791451 346748619 350869446 352123413 347050400 349986115 350853958 349483643 351508446
424.3 351508446 347302208 346826515 350422554 350762939 343997078 345364151 358637352 357694664 351506844
433 351506844 344674683 337977638 337847176 341828117 347634315 347714996 349154549 348898048 344530563
441.7 344530563 347364502 349151573 346040115 342730103 345150642 348118095 346976585 349106750
449.4 349106750 349513474 346266556 345973129 350805779 350307465 345549583 344555092 347305222 347026634
458.1 347026634 340073967 338512611 340219383 340949974 341664085 339421005 339223366 339611282 336108780
$$ packed form
399.3C67422256j1225242M36897P41310r27276K115364j9989L7231j990242m050102
407.9C52540207l817711l410644N553970Q770218l875275n249405M482536l872795
415.7C51121101o329650J957168M120827J253967n073013K935715Q67843j370315K024803
424.3C51508446m206238m75693L596039L40385o765861J367073J3273201r42688o187820
433C51506844o832161o697045j30462L980941N806198Q0681J439553k56501m367485
441.7C44530563K833939J787071l111458l310012K420539K967453j141510K130165
449.4C49106750M06724l246918k93427M832650m98314m757882r94491K750130k78588
458.1C47026634o952667j561356J706772P30591P14111k243080j97639L87916l502502
$$ plain form
466.8 336108780 338091812 341451454 338137321 335800858 334217300 331652374 333706932 336057625
474.5 336057625 338290596 338880692 334056129 329436226 330735359 333547745 332304306 331793785 331723518
483.2 331723518 328485413 327689590 326464233 326413078 329185448 329710999 329952278 328880615 328056984
491.8 328056984 329370003 329628296 329431610 328221436 327216682 329205856 331141815 327913589 325455208
500.5 325455208 326821785 324532204 322874832 326266670 329266129 327346954 325068779 325575294 325329285
509.2 325329285 324493561 323791237 324079742 323064499 321515350 321241379 320600929 319691753 317930889
517.9 317930889 318283882 317568512 314982891 315212402 315752869 315686951 314537373 313717747 315400143
526.6 315400143 316775341 316296844 315100060 314422874 313318291 313768921 315159035 315131702 314365292
$$ packed form
466.8C36108780J983032L359642l314133k336463j583558k564926K054558K350693
474.5C36057625K232971N90096m824563m619903J299133K812386j243439n10521p0267
483.2C31723518l238105p95823j225357n1155K772370N25551K41279j071663q23631
491.8C28056984J313019K58293j96686j210174j004754J989174J935959l228226k458381
500.5C25455208J366577k289581j657372L391838K999459j919175k278175N06515k46009
509.2C25329285q35724p02324K88505j015243j549149k73971o40450r09176j760864
517.9C17930889L52993p15370k585621K29511N40467o5918j149578q19626J682396
526.6C15400143J375198m78497j196784o77186j104583M50630J390114k7333p66410
$$ plain form
535.2 314365292 313600597 313566322 314023418 314908257 313601742 311261501 312622433 313803921 311087132
543.9 311087132 308794670 309617958 310154991 309799538 308527374 305914040 305682583 307551422 307839947
552.6 307839947 306749535 305787659 304661102 303998451 303510571 302485409 302371178 302646542 302434807
561.3 302434807 302936993 304183121 304512444 304068031 303267117 302842388 303247356 303087368 303468552 304159679
570.9 304159679 303608284 303116245 303393917 303273544 303014469 303492222 303584404 303613930 304167042 304569721
580.6 304569721 304091473 303069706 302011852 301520119 301997681 302309055 302928066 303146191 302747898
589.3 302747898 303462696 304275856 304346886 303270874 302512074 303456707 305030594 305972805 305642662 305101223
598.9 305101223 304987087 304821072 304354210 303742867 302130032 300585270 301414089 302195683 301642437
$$ packed form
535.2C14365292p64695l4275M57096Q84839j306515k340241J360932J181488k716789
543.9C11087132k292462Q23288N37033l55453j272164k613334k31457J868839K88525
552.6C07839947j090412r61876j126557o62651m87880j025162j14231K75364k11735
561.3C02434807N02186J246128L29323m44413q00914m24729M04968j59988L81184O91127
570.9C04159679n51395m92039K77672j20373k59075M77753R2182K9526N53112M02679
580.6C04569721m78248j021767j057854m91733M77562L11374O19011K18125l98293
589.3C02747898P14798Q13160P1030j076012p58800R44633J573887R42211l30143n41439
598.9C05101223j14136j66015m66862o11343j612835j544762Q28819P81594n53246
$$ plain form
607.6 301642437 300753269 300373688 300274143 299422131 299038868 298945217 297978802 296534634 295875416 295889130
617.2 295889130 296364326 297153454 297610474 298347626 298390770 298709488 300249233 302322826 303323994
625.9 303323994 302828121 303391552 303909435 305089722 307430668 308744583 309683151 310488262 311452599
634.6 311452599 312483311 313479557 314543343 316295223 318353939 318437862 318679276 320288620 321086578
643.3 321086578 322293777 324066315 324354286 324795723 326597595 328046799 328465843 328208199 329028587
651.9 329028587 331552086 333289566 333462143 332469292 331541138 331386452 330416679 329575272 329130363
660.6 329130363 329563065 329935646 328426056 328574715 330608521 332434769 333862724 332235184 332422218
669.3 332422218 332701912 332338295 332316093 333469048 335136337 336102524 337197647 337857323 338875885
$$ packed form
607.6C01642437q89168l79581r9545q52012l83263r3651r66415j444168o59218J3714
617.2B95889130M75196P89128M57020P37152M3144L18718J539745K073593J001168
625.9C03323994m95873N63431N17883J180287K340946J313915R38568Q05111R64337
634.6C11452599J030712R96246J063786J751880K058716Q3923K41414J609344P97958
643.3C21086578J207199J772538K87971M41437J801872J449204M19044k57644Q20388
651.9C29028587K523499J737480J72577r92851r28154j54686r69773q41407m44909
660.6C29130363M32702L72581j509590J48659K033806J826248J427955j627540J87034
669.3C32422218K79694l63617k2202J152955J667289R66187J095123O59676J018562
$$ plain form
678 338875885 339875221 340255699 342006073 343682671 344701920 345785675 346865463 348405914 349283714
686.7 349283714 349611320 350737076 351170425 350919266 351458855 352008896 352430687 352584763 353018417 354276657
696.3 354276657 355467224 356109581 356491432 357588272 358117371 358278236 359291763 359814682 359758492
705 359758492 359250870 359837608 362238808 363996964 364899635 365279007 365102654 365466118 366031189 367157211
714.6 367157211 368360100 368384666 369535294 371305885 372451248 373647957 374098892 374352303 375353851
723.3 375353851 377249184 377891388 377994690 379402046 380912628 381536369 381086693 382340279 384044342
732 384044342 384925194 386017685 386622810 387788734 388244591 388496399 389846420 391297722 391735840
740.7 391735840 392387733 393937950 394288979 394904022 394820747 394414864 394759140 395545731 397830276 399366570
$$ packed form
678C38875885R99336L80478J750374J676598J019249J083755J079788J540451Q77800
686.7C49283714L27606J125756M33349k51159N39589N50041M21791J54076M33654J258240
696.3C54276657J190567O42357L81851J096840N29099J60865J013527N22919n6190
705C59758492n07622N86738K401200J758156R02671L79372j76353L63464N65071J126022
714.6C67157211J202889K4566J150628J770591J145363J196709M50935K53411J001548
723.3C75353851J895333O42204J03302J407356J510582O23741m49676J253586J704063
732C84044342Q80852J092491O05125J165924M55857K51808J350021J451302M38118
740.7C91735840O51893J550217L51029O15043q3275m05883L44276P86591K284545J536294
$$ plain form
750.3 399366570 400872841 401692963 401599197 402398071 403766060 405222511 405583496 406314201 407011147
759 407011147 408274155 410619659 412304268 413391991 414376183 415936470 416394997 416271820 415933571
767.7 415933571 415884171 416156197 415977859 416368179 415924606 416679192 418207512 418583717 418170776 417165070
777.3 417165070 417736549 418604584 418494034 417266541 416761551 417639160 418780403 420335808 421298103
786 421298103 422310028 422296829 422230186 423019333 423465996 423832588 423620644 423681107 423639832 423797340 424359550
796.6 424359550 425019569 425116119 423762054 421899185 419942665 418240051 416387329 415817719 415172386
805.3 415172386 413232231 411960068 410911217 409781494 408018532 406261826 403789024 400864449
813 400864449 398929787 397578316 396640701 395491333 395527573 395826263 395721550 396233139 396422005 396503220
$$ packed form
750.3C99366570J506271Q20122r3766P98874J367989J456451L60985P30705O96946
759D07011147J263008K345504J684609J087723R84192J560287M58527j23177l38249
767.7D15933571m9400K72026j78338L90320m43573P54586J528320L76205m12941j005706
777.3D17165070N71479Q68035j10550j227493n04990Q77609J141243J555405R62295
786D21298103J011925j3199o6643P89147M46663L66592k11944O0463m1275J57508N62210
796.6D24359550O60019R6550j354065j862869j956520j702614j852722n69610o45333
805.3D15172386j940155j272163j048851j129723j762962j756706k472802k924575
813D00864449j934662j351471r37615j149368L6240K98690j04713N11589J88866Q1215
$$ plain form
822.6 396503220 397037468 398409615 399982262 402402725 405290756 408689194 412766037 416127129 419802895
831.3 419802895 422138329 424631424 427482224 428844376 430498505 432711029 435940590 438742294
839 438742294 441715775 443960571 445945854 449211922 451340523 452617607 452588844 452756844 453712654
847.7 453712654 455632057 457536888 459030495 461357231 463222809 466028366 467207870 467483330 468871422
856.4 468871422 470743599 472939873 473872490 475603294 477174377 478831444 479577866 480210457 481903419
865.1 481903419 481437798 480837631 479332047 477013092 474285202 471088829 467951622 465664330 464723396
873.8 464723396 463351631 463000336 462328224 461740074 460985680 459616814 459394875 458774452 458635788
882.4 458635788 458547935 459105072 458611832 457502060 457905731 456953087 455583191 454169617 453332024
$$ packed form
822.6C96503220N34248J372147J572647K420463K888031L398438M076843L361092L675766
831.3D19802895K335434K493095K850800J362152J654129K212524L229561K801704
839D38742294K973481K244796J985283L266068K128601J277084k8763J68000R55810
847.7D53712654J919403J904831J493607K326736J865578K805557J179504K75460J388092
856.4D68871422J872177K196274R32617J730804J571083J657067P46422O32591J692962
865.1D81903419m65621o00167j505584k318955k727890l196373l137207k287292r40934
873.8D64723396j371765l51295o72112n88150p54394j368866k21939o20423j38664
882.4D58635788q7853N57137m93240j109772M03671r52644j369896j413574q37593
$$ plain form
891.1 453332024 452260513 451644096 452176628 452405891 453171120 453085098 452758675 451564903 450494766
899.8 450494766 449634628 448038483 446983452 445440292 446131172 448849831 452367249 455177803 456867409
908.5 456867409 459759178 461629181 462413673 461854744 461180878 460507507 459650040 458962669 456810455
917.2 456810455 455464630 454258537 452380295 449784546 446393661 442970047 439475403 435972252
924.9 435972252 432483559 429567413 425726852 422124748 419266167 416675835 415012856 412874489
932.6 412874489 410651169 408639450 406893501 405295143 404150963 402920151 401674728 401787338 401216507
941.3 401216507 399971046 398662682 397053032 395146980 393956375 393911781 393195801 393046799 393626099
949.9 393626099 394255714 393775291 392584114 391995926 390669022 389556503 387015953 383869972 382101173
$$ packed form
891.1D53332024j071511o16417N32532K29263P65229q6022l26423j193772j070137
899.8D50494766q60138j596145j055031j543160O90880K718659L517418K810554J689606
908.5D56867409K891769J870003P84492n58929o73866o73371q57467o87371k152214
917.2D56810455j345825j206093j878242k595749l390885l423614l494644l503151
924.9D35972252l488693k916146l840561l602104k858581k590332j662979k138367
932.6D12874489k223320k011719j745949j598358j144180j230812j245423J12610n70831
941.3D01216507j245461j308364j609650j906052j190605m4594p15980j49002N79300
949.9C93626099O29615m80423j191177n88188j326904j112519k540550l145981j768799
$$ plain form
958.6 382101173 380003090 377809143 375331802 373040314 371022453 369143181 367234840 364987755
966.3 364987755 362830124 360275726 357754631 355391998 353522606 351694870 348568611 345436630
974.1 345436630 342964554 339753227 336007118 332389526 327888947 323285446 319223557 314477406
981.8 314477406 309896393 305548515 300365295 295611172 291114216 286512089 282368832 278269539
989.5 278269539 273806171 269564400 266392078 262870846 259933529 257180195 253451653 250787506
997.2 250787506 248447819 245912018 243176136 240607395 238201141 235583839 233073158 230821476
1004.9 230821476 229127388 227383976 225851498 224022312 223071804 221974773 219151363 217160187
1012.6 217160187 215797653 214380226 212382965 210575466 208735714 206731758 204854927 202553825
$$ packed form
958.6C82101173k098083k193947k477341k291488k017861j879272j908341k247085
966.3C64987755k157631k554398k521095k362633j869392j827736l126259l131981
974.1C45436630k472076l211327l746109l617592m500579m603501m061889m746151
981.8C14477406m581013m347878n183220m754123m496956m602127m143257m099293
989.5B78269539m463368m241771l172322l521232k937317k753334l728542k664147
997.2B50787506k339687k535801k735882k568741k406254k617302k510681k251682
1004.9B30821476j694088j743412j532478j829186r50508j097031k823410j991176
1012.6B17160187j362534j417427j997261j807499j839752k003956j876831k301102
$$ plain form
1020.3 202553825 200750809 197947254 195778027 193899002 191898994 191155281 189783802 187974644
1028.1 187974644 185873203 184761238 183254662 182010803 181431427 180505753 180385704 179821053 180857048
1036.7 180857048 182146168 183616753 185113869 186024418 187204151 187255020 188392296 188848038 189312935
1045.4 189312935 189695415 189222069 189336529 188190670 186987476 185569267 185264950 184483471 182726440
1054.1 182726440 181182232 179673538 180195007 179721031 179419632 179461117 180059834 181497078 182914314
1062.8 182914314 185166397 186476250 188408527 189449253 190850697 192156544 192759800 194813480
1070.5 194813480 195431194 196164036 196501389 196571217 196563435 196824532 198108406 198619823 199148369 198946323
1080.1 198946323 200059223 201246319 201593761 202109470 202781811 204592896 205513840 206947708 208374290
$$ packed form
1020.3B02553825j803016k803555k169227j879025k000008p43713j371479j809158
1028.1A87974644k101441j111965j506576j243859n79376r25674j20049n64651J035995
1036.7A80857048J289120J470585J497116R10549J179733N0869J137276M55742M64897
1045.4A89312935L82480m73346J14460j145859j203194j418209l04317p81479j757031
1054.1A82726440j544208j508694N21469m73976l01399M1485N98717J437244J417236
1062.8A82914314K252083J309853J932277J040726J401444J305847O03256K053680
1070.5A94813480O17714P32842L37353O9828p782K61097J283874N11417N28546k02046
1080.1A98946323J112900J187096L47442N15709O72341J811085R20944J433868J426582
$$ plain form
1088.8 208374290 210073376 211887856 212974434 214503174 215587807 216935692 217714233 219243240
1096.5 219243240 221287346 222992573 224150410 224913921 226786060 227615585 229015312 230195293 230707817
1105.2 230707817 232150383 233241138 233791561 233711796 234803047 235330257 235317364 236138630 237076817
1113.9 237076817 238415966 239362698 240562019 241294231 241914310 241841297 240993423 240567493 240766125
1122.6 240766125 242238941 242396908 242775307 244601765 246174755 246927929 247615891 249644642 251385155
1131.2 251385155 253296642 255647507 257932663 259455853 260722275 262790546 265045509 267746296
1139 267746296 269490833 270954456 272043972 272470932 273728027 274711056 275337753 275623913 275559292
1147.6 275559292 275678444 276399441 276953239 276410332 275589142 275071259 275154324 274696674 273956299 273454628
$$ packed form
1088.8B08374290J699086J814480J086578J528740J084633J347885P78541J529007
1096.5B19243240K044106J705227J157837P63511J872139Q29525J399727J179981N12524
1105.2B30707817J442566J090755N50423p9765J091251N27210j2893Q21266R38187
1113.9B37076817J339149R46732J199321P32212O20079p3013q47874m25930J98632
1122.6B40766125J472816J57967L78399J826458J572990P53174O87962K028751J740513
1131.2B51385155J911487K350865K285156J523190J266422K068271K254963K700787
1139B67746296J744537J463623J089516M26960J257095R83029O26697K86160o4621
1147.6B75559292J19152P20997N53798n42907q21190n17883Q3065m57650p40375n01671
$$ plain form
1157.3 273454628 272591629 271440449 270140095 269570942 268911285 268652020 269140739 270008144 271743317
1166 271743317 273696060 276265411 279213848 282351055 285187225 287934570 290565071 293303738 296962051
1174.6 296962051 300218105 302806606 305295219 308246059 311411228 314365940 317221413 319803505
1182.4 319803505 321905441 324159813 326384239 327961655 329636841 331069450 332641220 334001007
1190.1 334001007 334721794 335051765 335017319 335226860 334886093 334326096 333767624 333160934 332530403 331494484
1199.7 331494484 330496712 329444809 328607025 327788048 326803894 325860176 325061378 324635086 324271088
1208.4 324271088 324245033 324219322 323835602 323415680 323235550 323192978 322937584 322637901 321908493 321504021
1218 321504021 321455574 320924606 320405235 319876385 319508305 318981209 318275032 317747612 317201633 316627369
$$ packed form
1157.3B73454628q62999j151180j300354n69153o59657k59265M88719Q67405J735173
1166B71743317J952743K569351K948437L137207K836170K747345K630501K738667L658313
1174.6B96962051L256054K588501K488613K950840L165169K954712K855473K582092
1182.4C19803505K101936K254372K224426J577416J675186J432609J571770J359787
1190.1C34001007P20787L29971l4446K09541l40767n59997n58472o06690o30531j035919
1199.7C31494484r97772j051903q37784q18977r84154r43718p98798m26292l63998
1208.4C24271088k6055k5711l83720m19922j80130m2572k55394k99683p29408m04472
1218C21504021m8447n30968n19371n28850l68080n27096p06177n27420n45979n74264
$$ plain form
1227.7 316627369 315883999 315259418 314454174 313611221 313134632 312730160 312400494 311966553 311653309 311310368
1237.3 311310368 311023254 310954571 310555153 309874706 309688110 309975014 309733868 309544888 309206219 308484192
1247 308484192 307998600 307321243 307034168 307127953 307248096 307060070 306852627 307059937 307044392 307194958
1256.6 307194958 306828823 306257019 306562252 306964245 307131023 307508144 308210869 308816242 309717140 310575390
1266.3 310575390 311009941 311276588 311757488 312858086 314205837 315445633 316117306 316983318 318132496
1274.9 318132496 319368324 320811157 321879463 322713776 323753777 325266151 326445770 327500801
1282.7 327500801 328814964 330045929 331475983 333019371 334192352 335202827 336735878 337949562
1290.4 337949562 338849945 339498711 340283813 341052055 341349182 342278709 342706566 342908096 343218346 343504181
$$ packed form
1227.7C16627369p43370o24581q05244q42953m76589m04472l29666m33941l13244l42941
1237.3C11310368k87114o8683l99418o80447j86596K86904k41146j88980l38669p22027
1247C08484192m85592o77357k87075R3785J20143j88026k07443K07310j5545J50566
1256.6C07194958l66135n71804L05233M01993J66778L77121P02725O05373R00898Q58250
1266.3C10575390M34551K66647M80900J100598J347751J239796O71673Q66012J149178
1274.9C18132496J235828J442833J068306Q34313J040001J512374J179619J055031
1282.7C27500801J314163J230965J430054J543388J172981J010475J533051J213684
1290.4C37949562R00383O48766P85102P68242K97127R29527M27857K01530L10250K85835
$$ plain form
1300 343504181 344125710 344295311 344610062 344852257 344708824 344282761 343816833 343027725 342246208 341739616
1309.7 341739616 340857964 340521278 340088577 339477043 339031754 338568115 338322334 338028641 338503189 338845711
1319.3 338845711 339229240 340327797 341304665 342089920 342785683 343796692 344422264 344746590 344634666
1328 344634666 344247475 344038849 343621445 343146286 342508507 341870422 341152153 340841217 340688057 340754700
1337.6 340754700 341403503 341314087 341387749 341699867 342298088 343105888 343506813 344236603 345295792 346279030
1347.3 346279030 346639633 347058296 347115784 346961861 346722107 346009979 345593758 344872856 344485435 344271431
1356.9 344271431 344068184 343926697 343578224 342795982 341827774 341772881 340701370 340364304 340198441 339204674
1366.6 339204674 338674431 337978668 337588081 337264481 337072716 336779938 336563797 336343117 335780754 336368217
$$ packed form
1300C43504181O21529J69601L14751K42195j43433m26063m65928p89108p81517n06592
1309.7C41739616q81652l36686m32701o11534m45289m63639k45781k93693M74548L42522
1319.3C38845711L83529J098557R76868P85255O95763J011009O25572L24326j11924
1328C44634666l87191k08626m17404m75159o37779o38085p18269l10936j53160O6643
1337.6C40754700O48803q9416P3662L12118N98221Q07800M00925P29790J059189R83238
1347.3C46279030L60603M18663N7488j53923k39754p12128m16221p20902l87421k14004
1356.9C44271431k03247j41487l48473p82242r68208n4893j071511l37066j65863r93767
1366.6C39204674n30243o95763l90587l23600j91765k92778k16141k20680n62363N87463
$$ plain form
1376.2 336368217 336557503 336726036 336475105 335999680 335866623 335317917 334731903 333532867 332697754
1384.9 332697754 332211647 331599541 329506798 328090172 327678604 326037598 324638405 323101158 321907158
1393.6 321907158 319776077 316350307 315001335 313176651 311752644 308685951 305494614 303782425
1401.3 303782425 301501789 299548588 297670345 295192890 292798195 291418037 289736099 287764549
1409 287764549 286256351 284001217 282419338 281332531 280325623 279284687 277854843 277122631 276327610
1417.7 276327610 276540813 274571095 273097725 273654346 273394947 273737736 273240833 273903065 275087605
1426.3 275087605 275254364 275780888 276223373 277168579 277736797 279399700 280718155 281385422 282994823
1435 282994823 284242744 285839767 286849213 288901348 290260830 291713753 293289471 294077969 295808334
$$ packed form
1376.2C36368217J89286J68533k50931m75425j33057n48706n86014j199036q35113
1384.9C32697754m86107o12106k092743j416626m11568j641006j399193j537247j194000
1393.6C21907158k131081l425770j348972j824684j424007l066693l191337j712189
1401.3C03782425k280636j953201j878243k477455k394695j380158j681938j971550
1409B87764549j508198k255134j581879j086807j006908j040936j429844p32212p95021
1417.7B76327610K13203j969718j473370N56621k59399L42789m96903O62232J184540
1426.3B75087605J66759N26524M42485R45206N68218J662903J318455O67267J609401
1435B82994823J247921J597023J009446K052135J359482J452923J575718P88498J730365
$$ plain form
1443.7 295808334 296941032 298367996 299515648 301128960 301749592 302493839 304567585 305423927 307532902
1452.4 307532902 308914375 310627232 312275219 312901497 315839806 316461258 319616337 320976601 323764076
1461.1 323764076 326090469 327798653 330486488 331045456 333523941 335425148 338031693 340590401
1468.8 340590401 343275223 346911278 349341393 353308296 355507050 359071770 362334290 364554405
1476.5 364554405 367494507 370129433 372557716 374521751 377050171 378999214 380684814 382500954
1484.2 382500954 383920059 385643845 386186447 386594315 388569183 389641037 388686790 388354225 389016991
1492.9 389016991 388682785 387821388 387315979 382882347 382600555 381267891 377963829 377837029 377105217
1501.6 377105217 375901337 374918098 375515022 376021652 373360710 367720909 367327461 368895454 367742538
$$ packed form
1443.7B95808334J132698J426964J147652J613312O20632P44247K073746Q56342K108975
1452.4C07532902J381473J712857J647987O26278K938309O21452L155079J360264K787475
1461.1C23764076K326393J708184K687835N58968K478485J901207K606545K558708
1468.8C40590401K684822L636055K430115L966903K198754L564720L262520K220115
1476.5C64554405K940102K634926K428283J964035K528420J949043J685600J816140
1484.2C82500954J419105J723786N42602M07868J974868J071854r54247l32565O62766
1492.9C89016991l34206q61397n05409m433632k81792j332664l304062j26800p31812
1501.6C77105217j203880r83239N96924N06630k660942n639801l93448J567993j152916
$$ plain form
1510.2 367742538 368070641 366975098 364946251 364913826 363905678 363209457 361553879 359528885 360350037
1518.9 360350037 361998596 362347527 360693016 360135269 360747643 362735901 362579994 363223038 364716835
1527.6 364716835 364904366 365252724 365902252 366571198 367262077 368494377 366925888 367476196 368214607
1536.3 368214607 368851776 371072350 368642426 364775162 368484497 371096611 370834808 371331902 372674370
1545 372674370 372051849 373549385 374650345 375741997 376288376 376080589 377658386 378694229 379963646
1553.6 379963646 378132935 377745705 380039673 382513809 381500359 377186661 377915726 377326012 377792397
1562.3 377792397 376822701 376031876 373748169 371169090 370365486 368900337 368258400 360979652 359219246
1571 359219246 357876358 354681091 352000618 349659042 349362526 337830124 335516319 332264023 327898026
$$ packed form
1510.2C67742538L28103j095543k028847l2425j008148o96221j655578k024994Q21152
1518.9C60350037J648559L48931j654511n57747O12374J988258j55907O43044J493797
1527.6C64716835J87531L48358O49528O68946O90879J232300j568489N50308P38411
1536.3C68214607O37169K220574k429924l867264L709335K612114k61803M97094J342468
1545C72674370o22521J497536J100960J091652N46379k07787J577797J035843J269417
1553.6C79963646j830711l87230K293968K474136j013450m313698P29065n89714M66385
1562.3C77792397r69696p90825k283707k579079q03604j465149o41937p278748j760406
1571C59219246j342888l195267k680473k341576k96516j1532402k313805l252296m365997
$$ plain form
1579.7 327898026 324429207 319277916 315698013 310243073 306631718 301812191 297538738 293368111
1587.4 293368111 288329945 284934063 279481068 276343842 270999126 267711697 264122295 259618740
1595.1 259618740 256754379 251738720 249451294 245001812 242752171 239243221 235942917 234086342
1602.8 234086342 230240669 229149208 225759525 224773159 221991940 220536556 219356003 216273689
1610.5 216273689 216072922 213556747 213627453 211682453 212235527 213222389 207636108 208735256 207678089
1619.2 207678089 208687878 207262516 208374062 208638153 206593513 207661610 207132645 208936920 207445621
1627.9 207445621 208325729 208121738 208308239 209271927 208923359 211068401 211144600 214045792 211507359
1636.6 211507359 213528690 214822426 215255070 217510109 217455540 219988823 220345936 222162571 224010944
$$ packed form
1579.7C27898026l468819n151291l579903n454940l611355m819527m273453m170627
1587.4B93368111n038166l395882n452995l137226n344716l287429l589402m503555
1595.1B59618740k864361n015659k287426m449482k249641l508950l300304j856575
1602.8B34086342l845673j091461l389683r86366k781219j455384j180553l082314
1610.5B16273689k00767k516175P0706j945000N53074R86862n586281J099148j057167
1619.2B07678089J009789j425362J111546K64091k044640J068097n28965J804275j491299
1627.9B07445621Q80108k03991J86501R63688l48568K145042P6199K901192k538433
1636.6B11507359K021331J293736M32644K255039n4569K533283L57113J816635J848373
$$ plain form
1645.3 224010944 224133434 227056198 225294094 228446598 229391079 232399254 234512577 231304474 234583588
1653.9 234583588 234832973 238616314 239846611 242585239 244187527 246248436 248427486 250450706
1661.6 250450706 254053288 254636612 258466225 260751953 263753624 266710701 269701138 273851318
1669.4 273851318 275001602 279879208 281912518 286013603 290158787 293705673 297100048 300026608
1677.1 300026608 304657383 308072605 313112106 316080418 320051422 325361671 329475555 334899979
1684.8 334899979 335277328 341289482 345799332 350158768 355087967 359285393 364167976 368373642
1692.5 368373642 373400383 378498611 383939590 386031609 391792603 398342819 404308167 409559250
1700.2 409559250 408120842 415170593 420562477 424970169 428223267 431759720 435073318 437609749
$$ packed form
1645.3B24010944J22490K922764j762104L152504R44481L008175K113323l208103L279114
1653.9B34583588K49385L783341J230297K738628J602288K060909K179050K023220
1661.6B50450706L602582N83324L829613K285728L001671K957077K990437M150180
1669.4B73851318J150284M877606K033310M101085M145184L546886L394375K926560
1677.1C00026608M630775L415222N039501K968312L971004N310249M113884N424424
1684.8C34899979L77349O012154M509850M359436M929199M197426M882583M205666
1692.5C68373642N026741N098228N440979K092019N760994O550216N965348N251083
1700.2D09559250j438408P049751N391884M407692L253098L536453L313598K536431
$$ plain form
1707.9 437609749 441901054 445077934 447448540 450067444 452579842 455519600 457015610 458387146
1715.6 458387146 461861496 465031548 461674576 463943481 467477303 469782181 471920624 472857246
1723.4 472857246 473442154 475193214 477036476 478529396 480028038 482292099 482964478 483480988 487384987
1732 487384987 491752815 491541710 487451706 491100655 494851723 497146606 500741119 502135582 501230125
1740.7 501230125 505765152 509911842 511673965 513905945 518191147 522126999 525529099 529121437
1748.4 529121437 531160431 536454315 539298477 540770073 546209183 550339203 554759712 558810081
1756.2 558810081 559550705 561802330 565559044 568875465 572685051 572917290 573370056 577463264 580037842
1764.8 580037842 582136841 584592400 587045097 586402168 588742943 593754807 595485001 593941498
$$ packed form
1707.9D37609749M291305L176880K370606K618904K512398K939758J496010J371536
1715.6D58387146L474350L170052l356972K268905L533822K304878K138443R36622
1723.4D72857246N84908J751060J843262J492920J498642K264061O72379N16510L903999
1732D87384987M367828k11105m090004L648949L751068K294883L594513J394463r05457
1740.7E01230125M535027M146690J762123K231980M285202L935852L402100L592338
1748.4E29121437K038994N293884K844162J471596N439110M130020M420509M050369
1756.2E58810081P40624K251625L756714L316421L809586K32239M52766M093208K574578
1764.8E80037842K098999K455559K452697o42929K340775N011864J730194j543503
$$ plain form
1772.5 593941498 591671219 595830460 598748131 598756523 601354752 602489281 604552612 605832596 605189590
1781.2 605189590 606268578 608002396 609700661 609510345 610186119 612161179 613893242 615022125 616829071
1789.9 616829071 618004913 619136086 618172874 616798515 620552940 622179260 622097168 623571205 625833511
1798.6 625833511 626930618 625973740 628531151 628873177 629284630 630983582 631431160 632450867 632976608
1807.3 632976608 633746109 635269699 637473183 637086983 637475967 638809967 638974190 640383835 640750504
1815.9 640750504 641532669 641363449 641653595 643070908 643386459 644733429 645158463 646873779 648515015
1824.6 648515015 646001282 645843658 648045044 650600433 651234512 647250519 647440414 650462570 651426468
1833.3 651426468 652124329 652862473 653464966 653910294 653190460 653893204 653656693 653996429 654775314 657100067
$$ packed form
1772.5E93941498k270279M159241K917671Q392K598229J134529K063331J279984o43006
1781.2F05189590J078988J733818J698265j90316O75774J975060J732063J128883J806946
1789.9F16829071J175842J131173r63212j374359L754425J626320q2092J474037K262306
1798.6F25833511J097107r56878K557411L42026M11453J698952M47578J019707N25741
1807.3F32976608P69501J523590K203484l86200L88984J334000J64223J409645L66669
1815.9F40750504P82165j69220K90146J417313L15551J346970M25034J715316J641236
1824.6F48515015k513733j57624K201386K555389O34079l983993J89895L022156R63898
1833.3F51426468O97861P38144O02493M45328p19834P02744k36511L39736P78885K324753
$$ plain form
1842.9 657100067 659411545 654107819 655714493 658196106 658519363 657874680 658138809 659180298 658688354
1851.6 658688354 658997498 658826447 659776154 660681763 660920181 661916962 662251434 662866364 662369843 662384491
1861.3 662384491 662154388 662232513 662706146 662880173 664245071 664526672 665810471 665166855 663756638
1869.9 663756638 664864502 665617371 666100845 665498276 665615234 665517197 665858459 666539993 667110596 667774811
1879.6 667774811 667774124 668531952 668283844 668496170 668355865 667718353 667941818 667997742 669417725 669455185
1889.2 669455185 668175507 668868408 670293732 670449295 670410080 670552597 669379120 669810410 669994049
1897.9 669994049 670171814 670730133 671013718 671291199 671475983 672404709 671945496 671656113 671599121 671515427
1907.6 671515427 671571503 671399841 671695099 671374435 672414627 672896118 673272018 673534775 673556595 674933472
$$ packed form
1842.9F57100067K311478n303726J606674K481613L23257o44683K64129J041489m91944
1851.6F58688354L09144j71051R49707R05609K38418R96781L34472O14930m96521J4648
1861.3F62384491k30103P8125M73633J74027J364898K81601J283799o43616j410217
1869.9F63756638J107864P52869M83474o02569J16958r8037L41262O81534N70603O64215
1879.6F67774811o87P57828k48108K12326j40305o37512K23465N5924J419983L7460
1889.2F69455185j279678O92901J425324J55563l9215J42517j173477M31290J83639
1897.9F69994049J77765N58319K83585K77481J84784R28726m59213k89383n6992q3694
1907.6F71515427N6076j71662K95258l20664J040192M81491L75900K62757K1820J376877
$$ plain form
1917.2 674933472 672888031 671409302 671865082 672541580 673488846 673005524 672726974 673138123 673795013
1925.9 673795013 673771133 674111938 673742065 673073654 672995148 672710419 672906418 672546921 673234558 673622818
1935.5 673622818 673776932 674068375 673929901 674384232 673870239 674480057 673830566 671749802 672440414
1944.2 672440414 673258820 673406067 673231888 673842545 673792191 673917847 673907166 673248978 672918549 672734985
1953.8 672734985 673219070 672755051 672957458 673330917 673537674 673967743 673399963 673306198 673074799 673163986
1963.5 673163986 672842941 672488937 672660522 672437210 672377167 672285080 672812805 672781525 673075638 673028641
1973.1 673028641 672262878 672201691 671987457 672147598 671948471 672175751 672221222 672222137 672497025 672259750
1982.8 672259750 672539597 672101746 671939087 671638031 671376953 671318665 670847702 671532593 671883087 671342621
$$ packed form
1917.2F74933472k045441j478729M55780O76498R47266m83322k78550M11149O56890
1925.9F73795013k3880L40805l69873o68411p8506k84729J95999l59497O87637L88260
1935.5F73622818J54114K91443j38474M54331n13993O09818o49491k080764O90612
1944.2F72440414Q18406J47247j74179O10657n0354J25656j0681o58188l30429j83564
1953.8F72734985M84085m64019K02407L73459K06757M30069n67780r3765k31399Q9187
1963.5F73163986l21045l54004J71585k23312o0043r2087N27725l1280K94113m6997
1973.1F73028641p65763o1187k14234J60141j99127K27280M5471R15K74888k37275
1982.8F72259750K79847m37851j62659l01056k61078n8288m70963O84891L50494n40466
$$ plain form
1992.4 671342621 670765839 671275711 671606369 671428757 671104813 670242615 670267792 669983978 670012894 670143280
2002.1 670143280 670576248 670712204 669959488 670191956 669852219 670001984 669707184 668987961 668828354 668585358
2011.7 668585358 669078674 668754883 668742752 668797302 668504257 668017349 667644653 667704849 667232819 667322159
2021.3 667322159 666863174 667002792 667275696 666987381 667026825 666519012 666615982 666154861 665915070 665836334
2031 665836334 665474243 665310974 664928589 665091858 664722366 664700623 664672775 664446945 664151077 663854980
2040.6 663854980 663983994 663401108 663225784 663073730 663483582 663414993 662788696 662940369 663027802 663402023
2050.3 663402023 662672195 662406082 662420578 662034378 661756287 661372681 661856613 661673355 661933899 661675873
2059.9 661675873 661275711 661698303 661228561 661256943 661094208 660814209 660437241 660561295 660874557 660615997
$$ packed form
1992.4F71342621n76782N09872L30658j77612l23944q62198K5177k83814K8916J30386
2002.1F70143280M32968J35956p52716K32468l39737J49765k94800p19223j59607k42996
2011.7F68585358M93316l23791j2131N4550k93045m86908l72696O0196m72030Q9340
2021.3F67322159m58985J39618K72904k88315L9444n07813R6970m61121k39791p8736
2031F65836334l62091j63269l82385J63269l69492k1743k7848k25830k95868k96097
2040.6F63854980J29014n82886j75324j52054M09852o8589o26297J51673Q7433L74221
2050.3F63402023p29828k66113J4496l86200k78091l83606M83932j83258K60544k58026
2059.9F61675873m00162M22592m69742K8382j62735k79999l76968J24054L13262k58560
$$ plain form
2069.6 660615997 660555878 660258484 660588684 660397415 660262833 660160217 659604950 659521179 659407349 659786377
2079.2 659786377 659690323 659603271 659543686 659472351 659150848 658669510 658911209 658479156 658317795 658127060
2088.9 658127060 658171921 657987213 657656860 658217773 657919235 657731247 657116165 656665955 656467361 656190414
2098.5 656190414 656527634 656405487 656544724 656432114 656507645 656268921 656145401 656110458 655304108 655319748
2108.1 655319748 654901886 654673462 654526672 654509583 654581375 654295731 654309311 653722153 654081497 654314346
2117.8 654314346 654241333 653913879 653146286 652947159 652615356 653221970 653333664 653537903 653761749 653420334
2127.4 653420334 653601608 653140869 652847519 652312927 652071533 652022095 652143860 652498550 652302856 652581711
2137.1 652581711 652543030 652822647 652804947 652513733 652360992 652059250 652167587 651809540 651977844 652123184
$$ packed form
2069.6F60615997o0119k97394L30200j91269j34582j02616n55267q3771j13830L79028
2079.2F59786377r6054q7052n9585p1335l21503m81338K41699m32053j61361j90735
2088.9F58127060M4861j84708l30353N60913k98538j87988o15082m50210j98594k76947
2098.5F56190414L37220j22147J39237j12610P5531k38724j23520l4943q06350J5640
2108.1F55319748m17862k28424j46790j7089P1792k85644J3580n87158L59344K32849
2117.8F54314346p3013l27454p67593j99127l31803O06614J11694K04239K23846l41415
2127.4F53420334J81274m60739k93350n34592k41394m9438J21765L54690j95694K78855
2137.1F52581711l8681K79617j7700k91214j52741l01742J08337l58047J68304J45340
$$ plain form
2146.7 652123184 652428894 652797394 652824020 652835617 652525940 652727585 652209167 651895523 651824799 652058182
2156.4 652058182 652593460 652548981 653031311 652754364 652618942 652671051 652891312 652865448 652240448 652474060
2166 652474060 652174149 652276840 652261124 652539291 653354111 653414764 653492966 653252106 653558197 653227310
2175.6 653227310 652831268 652759933 652577972 653078079 653229523 653538818 653308640 653466415 653973541 653977737
2185.3 653977737 654009781 653760910 653770905 653460999 653631058 653821335 653790894 653730240 653698502 654239960 654199295
2195.9 654199295 654346085 654097366 653839722 653820038 653862000 654315033 654085312 654379654 654689102 654777756
2205.5 654777756 654827881 654997635 655055008 654546432 654381943 653825607 653869171 654208221 654740067 655181122
2215.2 655181122 655085297 655322723 654869995 654938583 654935684 654750900 654804611 654696045 654708176 654323883 654670944
$$ packed form
2146.7F52123184L05710L68500K6626J1597l09677K01645n18418l13644p0724K33383
2156.4F52058182N35278m4479M82330k76947j35422N2109K20261k5864o25000K33612
2166F52474060k99911J02691j5716K78167Q14820O0653P8202k40860L06091l30887
2175.6F53227310l96042p1335j81961N00107J51444L09295k30178J57775N07126M196
2185.3F53977737L2044k48871R995l09906J70059J90277l0441o0654l1738N41458m0665
2195.9F54199295J46790k48719k57644j9684M1962M53033k29721K94342L09448Q8654
2205.5F54777756N0125J69754N7373n08576j64489n56336M3564L39050N31846M41055
2215.2F55181122r5825K37426m52728O8588k899j84784N3711j08566J2131l84293L47061
$$ plain form
2225.8 654670944 654904938 655222397 655437469 655269928 655239563 654950562 655030518 654507065 654427948 654350433
2235.4 654350433 654258423 654817810 655107498 655549774 655378799 655335617 654747696 654469070 654818497 654581451
2245.1 654581451 654571228 654219742 654639206 654866791 654969406 655222397 654952621 655019608 654834518 654894104
2254.7 654894104 654601517 654719849 654772797 654367828 654600067 654607773 654845047 654928741 655079193 654702530
2264.4 654702530 654366837 654386826 654227295 654504471 654098206 654299164 654511490 654534607 654629288 654193649
2274 654193649 654243469 654452362 654850693 654401779 654177246 653987198 653637238 654000320 653887634 654094315
2283.7 654094315 654069138 654206314 653888474 653472900 653591919 653162537 653320999 653130417 653489227 653594284
2293.3 653594284 653271866 653594894 653617783 653988113 653639908 653659134 653762970 653600388 653434296 652849121
$$ packed form
2225.8F54670944K33994L17459K15072j67541l0365k89001P9956n23453p9117p7515
2235.4F54350433r2010N59387K89688M42276j70975m3182n87921k78626L49427k37046
2245.1F54581451j0223l51486M19464K27585J02615K52991k69776O6987j85090N9586
2254.7F54894104k92587J18332N2948m04969K32239P706K37274Q3694J50452l76663
2264.4F54702530l35693J9989j59531K77176m06265K00958K12326K3117R4681m35639
2274F54193649M9820K08893L98331m48914k24533j90048l49960L63082j12686K06681
2283.7F54094315k5177J37176l17840m15574J19019m29382J58462j90582L58810J05057
2293.3F53594284l22418L23028K2889L70330l48205J9226J03836j62582j66092n85175
$$ plain form
2302.9 652849121 652937164 652864609 653413315 653706665 653617554 653468018 653457184 653784561 653156052 653535767
2312.6 653535767 653313751 652991104 653367538 653220367 653270187 653075714 653626328 653669205 653842239 653636627
2322.2 653636627 653267288 653857193 653757248 654223175 654168701 653960114 653603516 654031906 654440079 653569641
2331.9 653569641 653559418 652934113 652657852 651949234 651428070 651889725 652848206 653006363 652100601 653830643
2341.5 653830643 654111404 653734436 653840103 652448654 651105576 650038986 649830246 650363388 651679230
2350.2 651679230 652223511 652400436 651971893 651311340 652640152 653118210 653696823 652485046 651086273
2358.9 651086273 650794983 650919037 651449738 651277618 652460175 651555405 650903091 650533371 650151062
2367.6 650151062 650286331 649586105 649593506 649275055 648916473 647360229 646469727 646272812 645309525 644428482
$$ packed form
2302.9F52849121Q8043p2555N48706K93350q9111j49536j0834L27377o28509L79715
2312.6F53535767k22016l22647L76434j47171M9820j94473N50614M2877J73034k05612
2322.2F53636627l69339N89905r9945M65927n4474k08587l56598M28390M08173q70438
2331.9F53569641j0223o25305k76261p08618n21164M61655R58481J58157r05762J730042
2341.5F53830643K80761l76968J05667j391449j343078j066590k08740N33142J315842
2350.2F51679230N44281J76925m28543o60553J328812M78058N78613j211777j398773
2358.9F51086273k91290J24054N30701j72120J182557r04770o52314l69720l82309
2367.6F50151062J35269p00226P401l18451l58582j556244q90502j96915r63287q81043
$$ plain form
2377.2 644428482 643408508 643071213 642449875 642440033 642417374 641707993 641525040 641250381 640941391 640261917
2386.8 640261917 640154419 639958344 639527092 639475060 639126434 639323120 639033775 638804245 638778076 638491592
2396.5 638491592 638107147 637369766 637253304 637031403 636830063 636626778 636529846 636414757 635974960 636030617
2406.1 636030617 635958138 635926857 635393143 634660225 634502296 634426651 634065475 633366928 633120537 633202400
2415.8 633202400 633272362 632719307 632472343 632469330 631992531 631678467 631044998 630823402 630455246 630033150
2425.4 630033150 629859123 629483681 629187622 628562927 628494949 628373489 628077660 627821159 627428665 627040787
2435.1 627040787 626491394 626375198 625975533 625770607 625443840 624997025 624924355 624509506 624178734 623553886
2444.7 623553886 623190269 622775002 622367058 622172928 621715546 621476326 621154594 621041985 620203514 619743423
$$ packed form
2377.2F44428482j019974l37295o21338r842k2659p09381j82953k74659l08990o79474
2386.8F40261917j07498j96075m31252n2032l48626J96686k89345k29530k6169k86484
2396.5F38491592l84445p37381j16462k21901k01340k03285r6932j15089m39797N5657
2406.1F36030617p2479l1281n33714p32918j57929p5645l61176o98547k46391Q1863
2415.8F33202400O9962n53055k46964l013m76799l14064o33469k21596l68156m22096
2425.4F30033150j74027l75442k96059o24695o7978j21460k95829k56501l92494l87878
2435.1F27040787n49393j16196l99665k04926l26767m46815p2670m14849l30772o24848
2444.7F23553886l63617m15267m07944j94130m57382k39220l21732j12609q38471m60091
$$ plain form
2454.3 619743423 620127869 619652443 619150352 618832436 618469696 617683029 616952553 616515427 616476326 616518898
2464 616518898 615881081 615355377 614983521 615110321 614884453 614223518 613841629 613410454 612967224 612353821
2473.6 612353821 612215729 611737747 611341324 611311989 610747490 610134697 609492111 609026146 608352318 607935677
2483.3 607935677 607575302 607219505 606852341 606023598 605778694 605493736 605023384 604186096 603631592 603570786
2492.9 603570786 603015556 602376900 601609535 601337051 600872040 600436325 600186806 599718132 599351463 598561630
2502.6 598561630 598291512 597793159 597053566 596543770 596223602 595861053 595073318 594924889 594260368 593987160
2512.2 593987160 594175835 593790436 593333359 592472458 592013969 591266365 590690765 590536118 590383377 590280190
2521.9 590280190 589720726 589167290 588345184 588120880 588126411 587723236 587169495 586521759 586050301 585387383
$$ packed form
2454.3F19743423L84446m75426n02091l17916l62740p86667p30476m37126l9101M2572
2464F16518898o37817n25704l71856J26800k25868o60935l81889m31175m43230o13403
2473.6F12353821j38092m77982l96423k9335n64499o12793o42586m65965o73828m16641
2483.3F07935677l60375l55797l67164q28743k44904k84958m70352q37288n54504o0806
2492.9F03570786n55230o38656p67365k72484m65011m35715k49519m68674l66669p89833
2502.6E98561630k70118m98353p39593n09796l20168l62549p87735j48429o64521k73208
2512.2E93987160J88675l85399m57077q60901m58489p47604n75600j54647j52741j03187
2521.9E90280190n59464n53436q22106k24304N531m03175n53741o47736m71458o62918
$$ plain form
2531.5 585387383 584910469 584351425 584232216 583928566 583555107 583584633 582913589 582652931 582088280 581316223
2541.1 581316223 580751457 580398521 580480003 580031700 579730682 579399872 579265938 578873596 578245888 577926254
2550.8 577926254 577278519 576911850 576390343 575911179 575460091 575099564 574965439 574740562 574576340 573749580
2560.4 573749580 572964211 572689934 572574768 571985207 571356621 570951920 570344391 570402298 570216446 569736595
2570.1 569736595 569397583 569059753 568525200 567762566 567316208 566736488 566419792 565994682 565595093 565492783
2579.7 565492783 565413551 565234184 564553452 564140244 563405266 562705765 562329712 561960449 561531334 560909576
2589.4 560909576 560901413 560497398 560019646 559639626 559345703 559068146 557923813 557399406 557203369 556736412
2599 556736412 556570015 556569824 555870514 555118942 554981499 554247093 553470230 552883415 552684517 552285767
$$ packed form
2531.5E85387383m76914n59044j19209l03650l73459K9526o71044k60658n64651p72057
2541.1E81316223n64766l52936Q1482m48303l01018l30810j33934l92342o27708l19634
2550.8E77926254o47735l66669n21507m79164m51088l60527j34125k24877j64222q26760
2560.4E73749580p85369k74277j15166n89561o28586m04701o07529N7907j85852m79851
2570.1E69736595l39012l37830n34553p62634m46358n79720l16696m25110l99589j02310
2579.7E65492783p9232j79367o80732m13208p34978o99501l76053l69263m29115o21758
2589.4E60909576q163m04015m77752l80020k93923k77557j144333n24407j96037m66957
2599E56736412j66397j91o99310p51572j37443p34406p76863n86815j98898l98750
$$ plain form
2608.6 552285767 551658058 551110954 550010605 549553185 549236984 549020576 548692665 548260727 548049850
2617.3 548049850 547270546 546668129 545701218 545122871 544985466 544265976 543573608 543218994 542999802 542341995
2627 542341995 541947708 541441727 540947113 540321426 539495964 539122620 538439445 537939568 537125549 536620331
2636.6 536620331 536355400 535726051 535374184 534731865 534034653 532867622 532520027 532445717 531864014 531602592
2646.3 531602592 530607109 530280800 530442810 530012741 529069099 528623390 528448410 527432289 527149429
2654.9 527149429 526572952 525930672 525831757 525351639 524928932 524284859 523829384 523332634 522974777 522613106
2664.6 522613106 521648064 521047325 520825539 520496483 520352554 520193176 519805679 519823723 519362221 518501434
2674.2 518501434 517948761 517428017 516961594 516404572 516474342 516268578 515746231 515375710 514625130 514230118
$$ packed form
2608.6E52285767o27709n47104j100349m57420l16201k16408l27911m31938k10877
2617.3E48049850p79304o02417r66911n78347j37405p19490o92368l54614k19192o57807
2627E42341995l94287n05981m94614o25687q25462l73344o83175m99877q14019n05218
2636.6E36620331k64931o29349l51867o42319o97212j167031l47595p4310n81703k61422
2646.3E31602592r95483l26309J62010m30069r43642m45709j74980j016121k82860
2654.9E27149429n76477o42280r8915m80118m22707o44073m55475m96750l57857l61671
2664.6E22613106r65042o00739k21786l29056j43929j59378l87497J8044m61502q60787
2674.2E18501434n52673n20744m66423n57022O9770k05764n22347l70521p50580l95012
$$ plain form
2683.9 514230118 513755951 513376846 513283615 512758217 511927643 511741753 511680870 511006470 510636711 510090179
2693.5 510090179 509678802 509604454 509318428 508580170 507753410 507544365 507167625 506903801 506560516 506293526
2703.1 506293526 506107941 505486717 505092621 504674988 504327393 503703461 503249168 502838326 502400551 502513580
2712.8 502513580 502395096 502612267 502443886 501734200 500945015 500246468 499894180 499197617 498950615 498801689
2722.4 498801689 498500214 498415947 498580818 498394928 497570610 497194977 496727142 496574821 496755257 496456833
2732.1 496456833 495892029 495280418 494601173 494213371 494656677 494447136 494027252 494027061 494004974 493780632
2741.7 493780632 493020325 492866707 492513962 491993675 491769295 491363831 491235237 491253891 491200447 490673904
2751.4 490673904 490357475 490223160 490187569 490100098 489470215 488982658 488767815 488737488 488206100 487894859
$$ packed form
2683.9E14230118m74167l79105r3231n25398q30574j85890o0883o74400l69759n46532
2693.5E10090179m11377p4348k86026p38258q26760k09045l76740k63824l43285k66990
2703.1E06293526j85585o21224l94096m17633l47595o23932m54293m10842m37775J13029
2712.8E02513580j18484K17171j68381p09686p89185o98547l52288o96563k47002j48926
2722.4D98801689l01475q4267J64871j85890q24318l75633m67835j52321J80436k98424
2732.1D96456833n64804o11611o79245l87802M43306k09541m19884j91k2087k24342
2741.7D93780632p60307j53618l52745n20287k24380m05464j28594J8654n3444n26543
2751.4D90673904l16429j34315l5591q7471o29883m87557k14843l0327n31388l11241
$$ plain form
2761 487894859 487653999 487387657 487624092 487076683 486430931 485687637 485125122 484828453 484487343 484504471
2770.7 484504471 484022064 483584595 483292160 483108673 482751999 482196388 481738396 481187820 480789604 480038795
2780.3 480038795 479731560 479306755 478742943 478801231 478459053 477863312 477245674 476961708 476455994 475746307
2789.9 475746307 474935036 474070930 473675156 473229446 473073235 472460022 471491394 470883827 470564041 469870796
2799.6 469870796 468532143 467939873 467228470 466275787 465762405 465366936 464660339 463876724 463588829
2808.3 463588829 463048744 462529831 461655846 460622292 459453583 458116074 457498665 456767120 456137962
2816.9 456137962 455329895 454679031 454351654 453570099 452632790 451434708 450257607 448786240 447680588
2825.6 447680588 446976357 446237793 445531044 444584808 443820000 442808304 441983490 440998268 439743156
$$ packed form
2761D87894859k40860k66342K36435n47409o45752p43294n62515k96669l41110J7128
2770.7D84504471m82407m37469k92435j83487l56674n55611m57992n50576l98216p50809
2780.3D80038795l07235m24805n63812N8288l42178n95741o17638k83966n05714p09687
2789.9D75746307q11271q64106l95774m45710j56211o13213r68628o07567l19786o93245
2799.6D69870796j338653n92270p11403r52683n13382l95469p06597p83615k87895
2808.3D63588829n40085n18913q73985j033554j168709j337509o17409p31545o29158
2816.9D56137962q08067o50864l27377p81555r37309j198082j177101j471367j105652
2825.6D47680588p04231p38564p06749r46236p64808j011696q24814r85222j255112
$$ plain form
2834.3 439743156 438299751 436539116 435277481 433835449 432589188 431448975 430015755 427841492
2842 427841492 425615005 424123535 421621933 418945389 416635208 414293289 411597633 409259071 407478714
2850.7 407478714 405098000 403764877 403022957 402505341 402199287 401742172 401554146 401312332 401663551
2859.4 401663551 401502609 401190453 400915070 400152550 399635735 398934860 398200607 397079735 396017532
2868.1 396017532 394982605 393892708 393089943 392534294 392377777 391447906 390580292 390104485 389420586
2876.7 389420586 388788910 388267632 387769928 386823845 385702324 384580269 384338341 383951302 382631874
2885.4 382631874 381495209 380332642 379470024 378308563 376895523 375948868 375411987 374597244 373301430
2894.1 373301430 372439194 371604958 370968285 370202141 369277115 368360786 367349358 366717453 365807762
$$ packed form
2834.3D39743156j443405j760635j261635j442032j246261j140213j433220k174263
2842D27841492k226487j491470k501602k676544k310181k341919k695656k338562j780357
2850.7D07478714k380714j333123p41920n17616l06054m57115j88026k41814L51219
2859.4D01663551j60942l12156k75383p62520n16815p00875p34253j120872j062203
2868.1C96017532j034927j089897q02765n55649j56517r29871q67614m75807o83899
2876.7C89420586o31676n21278m97704r46083j121521j122055k41928l87039j319428
2885.4C82631874j136665j162567q62618j161461j413040r46655n36881q14743j295814
2894.1C73301430q62236q34236o36673p66144r25026r16329j011428o31905r09691
$$ plain form
2902.8 365807762 364968224 364141617 363374023 362376518 360995827 360040169 359093094 358214226 356888695
2911.4 356888695 355327148 353707085 352270660 351229553 349954147 348547020 346543846 345140152
2919.2 345140152 343840218 342354088 341529579 340399513 339672127 339074783 338860626 338896027 338996162
2927.8 338996162 339544106 339413033 339416695 339878654 340088234 340180206 340894127 341518059 342002792 343073616
2937.5 343073616 343970413 345100899 345838928 346697311 347917519 348508034 349246025 349844246 350608864
2946.2 350608864 351483955 351939735 352185631 352895660 354054451 354414139 354550171 354928627 355445480
2954.8 355445480 355771179 355837326 356202049 356726761 357449608 358220367 358885231 359411545 360040359 360853043
2964.5 360853043 361688080 362219696 362637215 363677101 365079384 366235313 366655045 367409706 368438873
$$ packed form
2902.8C65807762q39538q26607p67594r97505j380691r55658r47075q78868j325531
2911.4C56888695j561547j620063j436425j041107j275406j407127k003174j403694
2919.2C45140152j299934j486130q24509j130066p27386n97344k14157L5401J00135
2927.8C38996162N47944j31073L662M61959K09580R1972P13921O23932M84733J070824
2937.5C43073616Q96797J130486P38029Q58383J220208N90515P37991N98221P64618
2946.2C50608864Q75091M55780K45896P10029J158791L59688J36032L78456N16853
2954.8C55445480L25699O6147L64723N24712P22847P70759O64864N26314O28814Q12684
2964.5C60853043Q35037N31616M17519J039886J402283J155929M19732P54661J029167
$$ plain form
2973.2 368438873 368935623 369659691 370407600 371213608 371722298 371914673 372119217 372706985 373758698
2981.8 373758698 374074860 374252930 374573975 374677505 374957085 375617752 375954323 375769272 376102753 376466179
2991.5 376466179 376527061 376177750 375828400 375832977 375733147 375613213 375084915 374489594 374001808 373619537
3001.1 373619537 373060875 372721024 372846870 372017174 371020813 370363235 369897156 369618721 369010429 368143539
3010.8 368143539 367378578 367117043 366702995 366128311 365338020 364409027 363830223 363462830 362971382 362327652
3020.4 362327652 362039032 361127472 360339699 359795036 358637886 358026390 357334862 356586151 355981293
3029.1 355981293 355288658 354493523 353785362 353170395 352081108 351333809 350529594 349768829 349090042
3037.8 349090042 348264351 347700691 346803513 345886497 344747658 343751068 343025284 342468643 342000999
$$ packed form
2973.2C68438873M96750P24068P47909Q06008N08690J92375K04544N87768J051713
2981.8C73758698L16162J78070L21045J03530K79580O60667L36571j85051L33481L63426
2991.5C76466179O0882l49311l49350M577r9830j19934n28298n95321m87786l82271
3001.1C73619537n58662l39851J25846q29696r96361o57578m66079k78435o08292q66890
3010.8C68143539p64961k61535m14048n74684p90291r28993n78804l67393m91448o43730
3020.4C62327652k88620r11560p87773n44663j157150o11496o91528p48711o04858
3029.1C55981293o92635p95135p08161o14967j089287p47299q04215p60765o78787
3037.8C49090042q25691n63660q97178r17016j138839r96590p25784n56641m67644
$$ plain form
3046.5 342000999 340957756 340058441 338954849 337666702 336554909 335875130 335431175 334737015 334306946
3055.1 334306946 333362312 332142830 331212578 330441132 329901123 329390182 328428001 327216835 326790886
3063.8 326790886 326259079 325353355 324427795 323765144 323388214 322911339 322318192 321073456 320315666
3072.5 320315666 319571724 318915615 318869076 317993412 317073116 316254807 315658321 315008698 314226055 313678150
3082.1 313678150 313075886 312839127 312206211 311401157 310320549 309498234 309325905 308689022 307886543
3090.8 307886543 306693668 305762978 305035820 304286537 303792305 303288975 302948685 302174778 301417351
3099.5 301417351 300811157 300279579 299401112 298096313 297226181 296594601 296470737 296191959 295698872
3108.2 295698872 295042439 293922272 293047085 292239265 291569653 291213131 290869350 289589386 288506813
$$ packed form
3046.5C42000999j043243q99315j103592j288147j111793o79779m43955o94160m30069
3055.1C34306946r44634j219482r30252p71446n40009n10941r62181j211166m25949
3063.8C26790886n31807r05724r25560o62651l76930m76875n93147j244736p57790
3072.5C20315666p43942o56109m6539q75664r20296q18309n96486o49623p82643n47905
3082.1C13678150o02264k36759o32916q05054j080608q22315j72329o36883q02479
3090.8C07886543j192875r30690p27158p49283m94232n03330l40290p73907p57427
3099.5C01417351o06194n31578q78467j304799q70132o31580j23864k78778m93087
3108.2B95698872o56433j120167q75187q07820o69612l56522l43781j279964j082573
$$ plain form
3116.9 288506813 288448277 287687626 286539326 285693016 285184326 284609928 283769131 283116684 282520046 281733227
3126.5 281733227 280730801 279741268 278826828 278348274 277675648 276685486 275718002 274846020 274667912
3135.2 274667912 274196682 273275299 272370434 271818867 271319542 270479279 269928665 268803596 267787743
3143.9 267787743 267395306 266754799 266053143 265227280 264272537 263569775 263305550 262392216 261129150
3152.5 261129150 260438080 259986229 259507599 258657246 257703838 256878319 256365471 255560455 254573593 253967495
3162.2 253967495 253341713 252500782 251266060 250830460 250466309 249365635 248739319 248395405 247965431
3170.9 247965431 247004185 245996532 245196571 244520035 244170685 243755226 242969475 241883450 241474342
3179.5 241474342 240957756 240012341 239500599 239204636 238914127 238133793 236969147 235887947 235216141
$$ packed form
3116.9B88506813n8536p60651j148300q46310n08690n74398q40797o52447n96638p86819
3126.5B81733227j002426r89533r14440m78554o72626r90162r67484q71982j78108
3135.2B74667912m71230r21383r04865n51567m99325q40263n50614j125069j015853
3143.9B67787743l92437o40507p01656q25863r54743p02762k64225r13334j263066
3152.5B61129150o91070m51851m78630q50353r53408q25519n12848q05016r86862o06098
3162.2B53967495o25782q40931j234722m35600l64151j100674o26316l43914m29974
3170.9B47965431r61246j007653p99961o76536l49350m15459p85751j086025m09108
3179.5B41474342n16586r45415n11742k95963k90509p80334j164646j081200o71806
$$ plain form
3188.2 235216141 234450092 233490696 232776775 232322102 232173538 231493149 230728283 230161381 229793816 229359684
3197.9 229359684 228190823 227600117 227330418 226758862 225859928 224923534 224506321 224044437 223597374
3206.5 223597374 223000565 222365780 221920624 221357231 220600624 219763069 219275112 219375496 219373703 218551445
3216.2 218551445 218135185 217932873 216852913 215720215 215242157 214984417 214264278 213926468 213692207
3224.9 213692207 213003521 212377453 211744194 211291504 210790424 210439568 209966431 209560337 209107666 208092022
3234.5 208092022 207734852 207340164 206710110 206393433 206040115 205644379 205080929 204641838 203967133 203769131
3244.2 203769131 203687515 202517490 201917953 201956081 201800671 201410751 200532379 199919949 199763756 199258881
3253.8 199258881 198683052 198191032 197459106 197126808 197338467 197380390 196944141 196005707 195099678 195085220
$$ packed form
3188.2B35216141p66049r59396p13921m54673j48564o80389p64866n66902l67565m34132
3197.9B29359684j168861n90706k69699n71556q98934r36394m17213m61884m47063
3206.5B23597374n96809o34785m45156n63393p56607q37555m87957J00384j793q22258
3216.2B18551445m16260k02312j079960j132698m78058k57740p20139l37810k34261
3224.9B13692207o88686o26068o33259m52690n01080l50856m73137m06094m52671j015644
3234.5B08092022l57170l94688o30054l16677l53318l95736n63450m39091o74705j98002
3244.2B03769131q1616j170025n99537L8128j55410l89920q78372o12430j56193n04875
3253.8A99258881n75829m92020p31926l32298K11659M1923m36249r38434r06029j4458
$$ plain form
3263.4 195085220 195181637 194723911 194223137 193567581 193246269 193395729 193297958 192692547 192042961 191599331
3273.1 191599331 191227226 191302128 191139259 190504532 189917221 189760723 189851456 189300480 188870201 188565464
3282.7 188565464 188026695 187692776 187358875 187070408 186940575 186505108 185684776 185798626 185979042 185490322
3292.4 185490322 185229740 184707623 184453735 184271812 184122124 184082775 183453083 183196068 183265591 183155651
3302 183155651 183048344 182901783 182375565 181714363 181380825 181223297 181328182 181040077 180479813 180211258
3311.7 180211258 180162373 180164433 179772205 179555206 179462185 178935146 178407249 178324795 178309841 177780380 177232914
3322.3 177232914 176943035 176548691 176367035 176398773 175760479 174925613 174619026 174261951 173709030 173177681
3331.9 173177681 172856274 172706871 172725353 172570515 171878490 171166611 170770264 170728683 170602531 170336418
$$ packed form
3263.4A95085220R6417m57726n00774o55556l21312J49460r7771o05411o49586m43630
3273.1A91599331l72105P4902j62869o34727n87311j56498R0733n50976m30279l04737
3282.7A88565464n38769l33919l33901k88467j29833m35467q20332J13850J80416m88720
3292.4A85490322k60582n22117k53888j81923j49688l9349o29692k57015O9523j09940
3302A83155651j07307j46561n26218o61202l33538j57528J04885k88105n60264k68555
3311.7A80211258m8885K060l92228k16999r3021n27039n27897q2454j4954n29461n47466
3322.3A77232914k89879l94344j81656L1738o38294q34866l06587l57075n52921n31349
3331.9A73177681l21407j49403J8482j54838o92025p11879l96347m1581j26152k66113
$$ plain form
3341.6 170336418 170352192 170148449 169191494 168170280 167764740 167772980 168117046 168074322 167750053 167629108
3351.2 167629108 167479362 167468300 166920490 166640148 167091331 167097797 166887302 166545849 166414642 166529083
3360.8 166529083 166266174 166118259 166292648 166049194 165772343 166014328 166039009 165902042 165906734 165877781
3370.5 165877781 165681591 165699635 165638390 165207748 165455494 165521908 165205288 165084515 164816761 165238914
3380.1 165238914 165824337 165775166 165383854 165256348 165522251 165398178 164966812 164615288 164984589 165850563
3389.8 165850563 166057739 165688763 165630074 165874786 165549812 165117874 165016441 165100784 165619678 165949631
3399.4 165949631 165581760 165214691 165614719 166010876 165841961 165966301 166115456 166042538 165930386 165589333
3409.1 165589333 165911274 166460133 166568832 167056408 167345219 167361565 167651882 167783604 167817707 167998466
$$ packed form
3341.6A70336418J5774k03743r56955j021214m05540Q240L44066m2724l24269j20945
3351.2A67629108j49746j1062n47810k80342M51183O466k10495l41453j31207J14441
3360.8A66529083k62909j47915J74389k43454k76851K41985K4681j36967M692k8953
3370.5A65877781j96190J8044o1245m30642K47746O6414l16620j20773k67754M22153
3380.1A65238914N85423m9171l91312j27506K65903j24073m31366l51524L69301Q65974
3389.8A65850563K07176l68976n8689K44712l24974m31938j01433Q4343N18894L29953
3399.4A65949631l67871l67069M00028L96157j68915J24340J49155p2918j12152l41053
3409.1A65589333L21941N48859J08699M87576K88811J6346K90317J31722L4103J80759
$$ plain form
3418.7 167998466 168325500 168528309 168400078 168444271 168798618 168801365 168763981 169171238 169777374 170177231
3428.3 170177231 170165730 170575428 170937538 171174221 171808529 172131119 172427959 172274189 172173691 172672100
3438 172672100 173218479 173765297 173632374 173703766 174103050 174426651 175079689 175963421 176774101 176529140
3447.6 176529140 176796055 177615681 178060074 178776340 179124641 179130211 179415398 180192890 180605831 180513687
3457.3 180513687 181108665 181823883 182181873 182850475 183700886 183846149 183803043 184328022 185450001 186309605
3466.9 186309605 186467743 187163181 187498550 187588482 188756027 189797707 189952545 189944096 190502243 191330338
3476.6 191330338 191960316 192051811 192602024 193756981 194384270 195075054 195460949 196091080 197240353
3485.2 197240353 198469906 199674835 199651470 199396610 199851112 200482807 200823879 201464424 202865772
$$ packed form
3418.7A67998466L27034K02809j28231M4193L54347K747l7384M07257O06136L99857
3428.3A70177231j1501M09698L62110K36683O34308L22590K96840j53770j00498M98409
3438A72672100N46379N46818j32923P1392L99284L23601O53038Q83732Q10680k44961
3447.6A76529140K66915Q19626M44393P16266L48301N570K85187P77492M12941r2144
3457.3A80513687N94978P15218L57990O68602Q50411J45263m3106N24979J121979Q59604
3466.9A86309605J58138O95438L35369Q9932J167545J041680J54838q449N58147Q28095
3476.6A91330338O29978R1495N50213J154957O27289O90784L85895O30131J149273
3485.2A97240353J229553J204929k3365k54860M54502O31695L41072O40545J401348
$$ plain form
3493.9 202865772 203695850 204183598 204787903 205570412 206257648 206736298 207662277 208832836 209805965
3502.6 209805965 210143280 210843830 211636887 211989880 212833824 214029236 214772015 214937878 215957260
3511.3 215957260 217009563 217433548 218234119 218936844 219484348 220344296 221566048 222477150 222817879
3520 222817879 223560963 225196075 226406193 226846428 228128700 229490356 230684319 231491089 231667824
3528.6 231667824 231997204 233082237 234396591 235376911 236771393 237553635 238693600 239703236 239489479
3537.3 239489479 240808830 242343025 243673763 244533844 245414371 247112484 248421764 249633369 250361919
3546 250361919 251644726 252548981 254171925 255991364 256762600 258698921 259212265 260007877 261585026
3554.7 261585026 262785759 264186001 264823380 266715298 268580494 270051365 270853748 271998558 273834553
$$ packed form
3493.9B02865772Q30078M87748O04305P82509O87236M78650R25979J170559R73129
3502.6B09805965L37315P00550P93057L52993Q43944J195412P42779J65863J019382
3511.3B15957260J052303M23985Q00571P02725N47504Q59948J221752R11102L40729
3520B22817879P43084J635112J210118M40235J282272J361656J193963Q06770J76735
3528.6B31667824L29380J085033J314354R80320J394482P82242J139965J009636k13757
3537.3B39489479J319351J534195J330738Q60081Q80527J698113J309280J211605P28550
3546B50361919J282807R04255J622944J819439P71236J936321N13344P95612J577149
3554.7B61585026J200733J400242O37379J891918J865196J470871Q02383J144810J835995
$$ plain form
3563.4 273834553 275361042 279183865 280479259 280793915 281939735 281207161 283981915 286002846 287473011
3572 287473011 289636192 291572380 292724552 294026966 296515217 297666206 299415970 300955772 302034473
3580.7 302034473 303953285 305970249 307802048 308870811 312412357 314444752 313861008 315796795
3588.4 315796795 316650429 319721203 322082138 324291306 326337318 327552719 330461998 331136513 333893242
3597.1 333893242 337129440 337935333 340627708 342484093 343717766 345626373 347481804 350014801
3604.8 350014801 354036293 357273254 356543846 359879265 361301117 360889778 367057190 369507637 368434982
3613.5 368434982 372224617 373527603 377315636 381908379 383603325 385624390 385703659 387181740 390449791
3622.2 390449791 393633003 396551170 399477882 402313042 405301018 411689415 414016457 407080193
$$ packed form
3563.4B73834553J526489L822823J295394L14656J145820p32574K774754K020931J470165
3572B87473011K163181J936188J152172J302414K488251J150989J749764J539802J078701
3580.7C02034473J918812K016964J831799J068763L541546K032395n83744J935787
3588.4C15796795Q53634L070774K360935K209168K046012J215401K909279O74515K756729
3597.1C33893242L236198Q05893K692375J856385J233673J908607J855431K532997
3604.8C50014801M021492L236961p29408L335419J421852m11339O167412K450447j072655
3613.5C68434982L789635J302986L788033M592743J694946K021065P9269J478081L268051
3622.2C90449791L183212K918167K926712K835160K987976O388397K327042o936264
$$ plain form
3629.9 407080193 411154938 416391945 421942215 424407272 424235497 427071304 430426598 433883858
3637.6 433883858 436136932 438189354 441275940 445067673 447969856 449546394 452465172 456535988
3645.3 456535988 462672768 463478012 461421547 467679367 469963875 469289284 468676376 473944778 478926353
3654 478926353 483097954 489598694 484607315 486427498 492356567 494739456 497465401 498838272 501753082
3662.7 501753082 503667107 505719299 508186646 509293404 514443207 517509079 518456230 521203194
3670.4 521203194 514757957 517079086 526003265 535730782 536911354 521246986 523294754 531198235
3678.1 531198235 536470299 534532127 534563675 537311249 539395027 541168518 541965675 542860909 547751541
3686.8 547751541 556409836 549541321 544629440 553384705 548231773 546550140 551592369 552383499
$$ packed form
3629.9D07080193M074745N237007N550270K465057j71775K835807L355294L457260
3637.6D33883858K253074K052422L086586L791733K902183J576538K918778M070816
3645.3D56535988O136780Q05244k056465O257820K284508o74591o12908N268402M981575
3654D78926353M171601O500740m991379J820183N929069K382889K725945J372871K914810
3662.7E01753082J914025K052192K467347J106758N149803L065872R47151K746964
3670.4E21203194o445237K321129Q924179R727517J180572j5664368K047768P903481
3678.1E31198235N272064j938172L1548K747574K083778J773491P97157Q95234M890632
3686.8E47751541Q658295o868515m911881Q755265n152932j681633N042229P91130
$$ plain form
3694.5 552383499 553683243 554287529 554447784 555930061 557164040 560500221 564439316 559695015 556465073
3703.2 556465073 561588326 563543282 563501625 564373665 567479324 572582779 565387077 568133507 573420830
3711.9 573420830 560453072 564667473 569522018 570240440 571369400 574040184 575653877 571677361
3719.6 571677361 572410736 578694763 577036057 573029213 577485466 578584137 578511162 576353531 575707130
3728.3 575707130 579186935 580085373 585823593 584068375 576531487 586199684 588281174 578534317
3736 578534317 577082214 579126816 580017319 582695427 586426010 581809120 584683723 598859558 589890251
3744.7 589890251 569707108 579677086 585848770 592840462 591336288 579908562 590796242 586800346
3752.4 586800346 578781281 584690399 589133911 592349472 587410126 589907074 596418381 588698425
$$ packed form
3694.5E52383499J299744O04286J60255J482277J233979L336181L939095m744301l229942
3703.2E56465073N123253J954956m1657Q72040L105659N103455p195702K746430N287323
3711.9E73420830j2967758M214401M854545P18422J128960K670784J613693l976516
3719.6E71677361P33375O284027j658706m006844M456253J098671p2975k157631o46401
3728.3E75707130L479805Q98438N738220j755218p536888R668197K081490r746857
3736E78534317j452103K044602Q90503K678108L730583m616890K874603J4175835q969307
3744.7E89890251k0183143R969978O171684O991692j504174j1427726J0887680l995896
3752.4E86800346q019065N909118M443512L215561m939346K496948O511307p719956
$$ plain form
3760.1 588698425 585536461 589165268 590380173 590885582 595467072 593602562 587876930 590726280
3767.8 590726280 596292915 598000832 588978844 589827499 592823792 593062553 593956146 593491135 594600792
3776.5 594600792 595157852 598307571 599427948 591082077 592585869 594896660 596027832 598542786
3784.2 598542786 596101875 594863052 596101112 597097054 597785530 597444992 597410164 596969566 597350349
3792.9 597350349 597755394 598742752 601846428 598490753 594448967 596731148 600539894 606853867 601677322
3801.5 601677322 590705223 593819695 596306381 601434021 607400360 597413864 592739983 597835312
3809.3 597835312 599499969 599236221 600101128 599886627 600776138 607665977 608356972 592619324 596109276
3817.9 596109276 602501297 608506889 612731056 594421196 593024788 597827988 600447197 604246330
$$ packed form
3760.1E88698425l161964L628807J214905N05409M581490j864510n725632K849350
3767.8E90726280N566635J707917r021988Q48655K996293K38761Q93593m65011J109657
3776.5E94600792N57060L149719J120377q345871J503792K310791J131172K514954
3784.2E98542786k440911j238823J238060R95942O88476l40538l4828m40598L80783
3792.9E97350349M05045R87358L103676l355675m041786K282181L808746O313973n176545
3801.5F01677322j0972099L114472K486686N127640N966339r986496m673881N095329
3809.3E97835312J664657k63748Q64907k14501Q89511O889839O90995j5737648L489952
3817.9E96109276O392021O005592M224167j8309860j396408M803200K619209L799133
$$ plain form
3825.7 604246330 604442635 598977623 598809128 601475334 605391045 607452354 598194809 600110092 608049164
3834.3 608049164 602204971 601457291 610283089 600139961 595377579 606278534 601077728 598323250
3842.1 598323250 605858612 603871994 599159508 601955605 603644829 603621368 605118790 604070892 606041145
3850.7 606041145 612340393 607351608 609766541 594527779 592898560 603482399 602308769 599936600
3858.4 599936600 602033844 604229507 607076263 602462196 602860718 609496193 602940674 596365891
3866.2 596365891 600971642 607303123 614189339 606610413 595318909 598431015 604952126 609593468
3873.9 609593468 599496346 599063568 603615570 603644981 605593262 610442200 606761208 598502998 603334732
3882.6 603334732 604441757 605203896 611744690 600327721 599566727 603116798 603986359 608966522 607980042
$$ packed form
3825.7F04246330J96305n465012j68495K666206L915711K061309r257545J915283P939072
3834.3F08049164n844193p47680Q825798j0143128m762382J0900955n200806k754478
3842.1E98323250P535362j986618m712486K796097J689224k3461J497422j047898J970253
3850.7F06041145O299248m988785K414933j5238762j629219J0583839j173630k372169
3858.4E99936600K097244K195663K846756m614067L98522O635475o555519o574783
3866.2E96365891M605751O331481O886216p578926j1291504L112106O521111M641342
3873.9F09593468j0097122m32778M552002K9411J948281M848938l680992q258210M831734
3882.6F03334732J107025P62139O540794j1416969p60994L550071Q69561M980163r86480
$$ plain form
3891.2 607980042 599209404 600131187 603630943 603037453 604068108 604728699 606800880 609408722 600211906
3899.9 600211906 605057449 607623711 601003647 605288925 602562943 600920486 601055946 601003075 603193359
3908.6 603193359 603379211 603510704 602796822 602594452 603023453 603348694 604917793 606666031 603546219
3917.3 603546219 599437447 603315506 604372635 601103668 602579269 603633995 605093575 603781776
3925 603781776 600502319 601579208 602677727 604261971 604147377 602962875 604928856 603283577 600713692
3933.7 600713692 601812439 602229805 602553177 603108978 602632179 602578354 602698288 603916664 605098915
3942.3 605098915 601420212 600499763 601969719 602789879 603875847 601414223 601678848 602276535 600205231
3951 600205231 601986351 602568283 601921806 601755981 602113075 602538528 601639862 601738701 601493988 602442741
$$ packed form
3891.2F07980042q770638R21783L499756n93490J030655O60591K072181K607842r196816
3899.9F00211906M845543K566262o620064M285278k725982j642457J35460n2871K190284
3908.6F03193359J85852J31493p13882k02370M29001L25241J569099J748238l119812
3917.3F03546219m108772L878059J057129l268967J475601J054726J459580j311799
3925F03781776l279457J076889J098519J584244j14594j184502J965981j645279k569885
3933.7F00713692J098747M17366L23372N55801m76799n3825J19934J218376J182251
3942.3F05098915l678703r20449J469956Q20160J085968k461624K64625N97687k071304
3951F00205231J781120N81932o46477j65825L57094M25453q98666R8839k44713R48753
$$ plain form
3960.7 602442741 602634239 601136246 601587296 601337318 601027946 601295967 601513977 601908760 602146034
3969.3 602146034 601973076 602051392 602114792 601181488 601652069 602450027 602256393 601753960 601547546 601919174
3979 601919174 601717415 602063255 602419968 602261620 602064819 602050781 601933289 601462936 601670113 601755638
3988.6 601755638 602251320 602033997 601199226 601354904 601515846 601964684 601778030 601774902 601906929 601815529
3998.3 601815529 601982918 601601982
4000.2 601601982
$$ packed form
3960.7F02442741J91498j497993M51050k49978l09372K68021K18010L94783K37274
3969.3F02146034j72958P8316O3400r33304M70581P97958j93634n02433k06414L71628
3979F01919174k01759L45840L56713j58348j96801j4038j17492m70353K07177Q5525
3988.6F01755638M95682k17323q34771J55678J60942M48838j86654l128J32027r1400
3998.3F01815529J67389l80936
4000.2F01601982
##END=$$ End of the data block
