##TITLE=$$ Begin of the data block
##JCAMP-DX=5.00 $$ ACD/SpecManager v 10.08
##SPECTROMETER/DATA SYSTEM=Varian
##DATE=15 Jan 2013 10:39:14
##DATA TYPE=INFRARED SPECTRUM
##DATA CLASS=XYDATA
##ORIGIN=
##OWNER=
##NPOINTS=3735
##FIRSTX=399.26403809
##LASTX=4000.35498047
##MAXX=4000.35498047
##MINX=399.26403809
##MAXY=66.74090576
##MINY=20.08594131
##XFACTOR=1.0000000000
##YFACTOR=0.000000100000000
##FIRSTY=37.91845322
##DELTAX=0.96440572
##XUNITS=1/CM
##YUNITS=TRANSMITTANCE
##XYDATA=(X++(Y..Y))
399.3C79184532M377213K451515q050156l803863o450768n712013N408249J718674
$$ 379184532 383561745 386013260 377963104 374159241 367708473 361996460 367404709 369123383
407C69123383K790031L585472J002998K76909k900276j52016m840011p278519J266823
$$ 369123383 371913414 375498886 376501884 376778793 373878517 373726501 368886490 361607971 362874794
415.7C62874794O355515R263267J2934647n463486n612221Q3733m745140r960366o442947
$$ 362874794 369230309 378493576 391428223 385964737 380352516 380436249 375691109 365730743 359287796
424.3C59287796O126595J0866432j832619O46896N60799n909729r52301K017212k115173
$$ 359287796 365414391 376280823 374448204 375095100 375655899 369746170 368793869 370811081 368695908
433C68695908M06532M729195j340943n774727k648315M157486N042915k369614p08732
$$ 368695908 369102440 373831635 372490692 366715965 364067650 368225136 373268051 370898437 370189705
441.7C70189705N090561L080063l884392m405861o34041J619988m9668l012924L852501
$$ 370189705 375280266 378360329 374475937 370070076 369436035 371056023 371006355 367993431 371845932
450.4C71845932L757210o306420p911148O59867N614586l20473r480972q747521Q390160
$$ 371845932 375603142 369296722 361385574 362045441 367660027 367339554 357858582 349111061 357501221
459.1C57501221L251304l169593J817131L461074L631821j540031l479767J005287
$$ 357501221 360752525 357582932 359400063 362861137 366492958 364952927 361473160 362478447
466.8C62478447j161766J217613J386719N5084J933365k258911o21529J337128n711708
$$ 362478447 361316681 362534294 363921013 363976097 365909462 363650551 363029022 364366150 358654442
475.5C58654442l965149M678421Q99200k113876j364021k803307j10817K904015J660652
$$ 358654442 354689293 359367714 360266914 358153038 356789017 353985710 353874893 356778908 358439560
484.1C58439560l113289j929855K457924j250153l389778K54135j087761m76417J334877
$$ 358439560 355326271 353396416 355854340 354604187 351214409 351468544 350380783 349904366 351239243
492.8C51239243n21164J299820m29459j332741L078118M99839l241882p97577j266251
$$ 351239243 350718079 352017899 351588440 350255699 353333817 353833656 350591774 349794197 348527946
501.5C48527946k147903K997704L731613K018738l8491p78770r50356k363395p92237
$$ 348527946 346380043 349377747 353109360 355128098 355089607 354310837 353360481 350997086 350204849
510.2C50204849j298561m154777k636376K95296K399254K425804J551704j648292m040642
$$ 350204849 348906288 344751511 342115135 342410431 344809685 347235489 348787193 347138901 343098259
518.9C43098259j647415J08185p29103R98611O71234j407966j897278l10555K966957
$$ 343098259 341450844 341559029 340829926 341828537 342499771 341091805 339194527 338883972 341850929
527.5C41850929p90138j841507P93762j486397j14097J005058J342659J211510j066132
$$ 341850929 341060791 339219284 340013046 338526649 338412552 339417610 340760269 341971779 340905647
536.2C40905647j782875k044105k79770L20205K27509l71056o37168L49044k24533
$$ 340905647 339122772 337078667 336798897 337119102 337346611 336975555 336338387 336687431 336462898
544.9C36462898K76795o33927p97958o68297o76384q6479j568947r31396k79503J064148
$$ 336462898 336739693 336105766 335307808 334639511 333963127 333876648 332307701 331376305 331096802 332160950
554.5C32160950o91643l118019P84721J297913p23877j493073j206512R05723J805993
$$ 332160950 331469307 328351288 329136009 330433922 329710045 328216972 327010460 327916183 329722176
563.2C29722176J240577j3466j50261M44603o05697j229706m98962j04599r5215l71361
$$ 329722176 330962753 330949287 330799026 331243629 330637932 329408226 328909264 328804665 328709450 328338089
572.9C28338089K67372J65672j080284j23405P63o38314j316795J89896K121391k3498
$$ 328338089 328605461 328771133 327690849 327567444 327568207 326929893 325613098 325802994 327924385 327900887
582.5C27900887K61955O47239M84581J04828j339531q10546k50588J562996J379776
$$ 327900887 328162842 328810081 329294662 329399490 328059959 327249413 326998825 328561821 329941597
591.2C29941597K29N29137K59513M98200l98636n52673O72874J542282O06575j953621
$$ 329941597 329941826 330470963 330730476 331228676 330830040 330277367 330950241 332492523 333099098 331145477
600.8C31145477k80609J126442j39618K33269M24766o43920j744652j401406N60074
$$ 331145477 330864868 331991310 331851692 332084961 332509727 331865807 330121155 328719749 329279823
609.5C29279823J91078j463966k18391P08427k93465j300964n39169M87022m46090
$$ 329279823 329470901 328006935 327788544 328496971 328203506 326902542 326363373 326850395 326404305
618.2C26404305m50554j49002O34269J324883M74281K72942O56891M61158K54021P10640
$$ 326404305 325953751 325804749 326439018 327763901 328238182 328511124 329168015 329629173 329883194 330593834
627.8C30593834P56836R80148J608505K069207K377395J366616L48014Q51746J514473
$$ 330593834 331350670 332330818 333939323 336008530 338385925 339752541 340100555 340952301 342466774
636.5C42466774J179619J678467J766319J65100O76193J814385R83734N17082J139717
$$ 342466774 343646393 345324860 347091179 347256279 347932472 349746857 350730591 351247673 352387390
645.2C52387390P50847j634750j723900J489525K563285J174584Q21953J133003N99327
$$ 352387390 353138237 351503487 349779587 351269112 353832397 355006981 355828934 356961937 357561264
653.9C57561264j43928n97916l48053l91045o30073R99031J026993P9002J24969q506
$$ 357561264 357417336 356819420 356471367 356080322 355450249 356449280 357476273 357555275 357680244 357671738
663.5C57671738J33018r23309r71565j030045l081322L421746K599258J447525J159477
$$ 357671738 357804756 356881447 355909882 354879837 351798515 355220261 357819519 359267044 360426521
672.2C60426521L33519J08376N70373M55704J109505J004638K97013J230087J123161
$$ 360426521 360760040 360868416 361438789 361894493 363003998 364008636 364305649 365535736 366658897
680.9C66658897P53785J178512P70989Q03680J259537P58896J94206J069908J471634
$$ 366658897 367412682 368591194 369362183 370165863 371425400 372184296 372378502 373448410 374920044
689.6C74920044R90372P70912N49812R07173J046830K58026l66249O98204J063537
$$ 374920044 375910416 376681328 377231140 378138313 379185143 379443169 379076920 379775124 380838661
698.2C80838661J75095J55716L84712J089439J010247J312065J186790k05078M68063
$$ 380838661 381013756 381169472 381554184 382643623 383653870 384965935 386152725 385947647 386415710
706.9C86415710R49860J043930N13725m84237M63943P80258J45417N10139R50317Q04177
$$ 386415710 387365570 388409500 388923225 388438988 388902931 389683189 389828606 390338745 391289062 392093239
716.6C92093239R11827J226692J660462P94715m04052q7586K4643N27687L89443L56674
$$ 392093239 393005066 394231758 395892220 396686935 396282883 396195297 396219940 396747627 397137070 397493744
726.2C97493744N01823R61953J946067J184311J264344Q94889N56298L67279q01697
$$ 397493744 397995567 398957520 400903587 402087898 403352242 404247131 404803429 405170708 404369011
734.9D04369011n36842m98238R50165J780243J018905Q53920O52771O56319m0779R4528
$$ 404369011 403832169 403333931 404284096 406064339 407083244 407937164 408589935 409246254 409205475 409300003
744.5D09300003k13928n45197L92723J454392J727714N50652r0408J75171J291809
$$ 409300003 409086075 408540878 408933601 410387993 412115707 412666359 412575951 412751122 414042931
753.2D14042931K91481n39399Q52471R33075J451149J966667J900749R05037J046906
$$ 414042931 414334412 413795013 414647484 415580559 417031708 418998375 420899124 421804161 422851067
761.9D22851067J926574P06139k23847k83088P47261O14509P80755P80677K03018J346016
$$ 422851067 424777641 425483780 425259933 424976845 425724106 426338615 427119370 427900047 428103065 429449081
771.5D29449081P39022O0768l48816o51169p78122l3226J404419O24428O9427N2834
$$ 429449081 430188103 430248871 429900055 429248886 428470764 428437538 429841957 430466385 430535812 430588646
781.2D30588646M55551k31323j15395M34952l99208R24072J174088J296386N83497
$$ 430588646 431044197 430812874 430697479 431132431 430733223 431657295 432831383 434127769 434711266
789.9D34711266j329689q70553K53830N98488q77j66855o59370q8807m23164j206055
$$ 434711266 433381577 432511024 432764854 433363342 433362465 433195610 432536240 432447433 432024269 430818214
799.5D30818214q35723j134644j42708p58247j155129j415291j272239k75192j267548
$$ 430818214 429982491 428847847 428705139 427946892 426791763 425376472 424104233 423829041 422561493
808.2D22561493r70841j389617j724434k071724k118950j301613j267395J34926k12441
$$ 422561493 421590652 420201035 418476601 416404877 414285927 412984314 411716919 411851845 411639404
816.9D11639404p51610l48129j13907R0256L85285J575546J173172R98115J90354Q07113
$$ 411639404 410887794 410539665 410425758 410516014 410901299 412476845 413650017 414648132 414838486 415645599
826.5D15645599K743721K768250M017486L455239K561378K161217P66258P25746J641426
$$ 415645599 418389320 421157570 425175056 428630295 431191673 433352890 434119148 434844894 436486320
835.2D36486320K716294L347969L077583K117539K360420J398849J166382J725159
$$ 436486320 439202614 442550583 445628166 447745705 450106125 451504974 452671356 454396515
842.9D54396515O90308J116485J540337J589393O52733J317673K001991J434021J248207
$$ 454396515 455086823 456203308 457743645 459333038 459985771 461303444 463305435 464739456 465987663
851.6D65987663M87557J954803J347351J033173J603470J093101J851464J596374J281738
$$ 465987663 466475220 468430023 469777374 470810547 472414017 473507118 475358582 476954956 478236694
860.3D78236694N26047Q86688j3618J48659J083259j59225M90417p40623q36602r96894
$$ 478236694 478762741 479649429 479635811 479784470 480867729 480708504 481198921 480458298 479621696 478624802
869.9D78624802j531716l05061r18121j257287j361770q23403q92028o46172n83687
$$ 478624802 477093086 476788025 475869904 474612617 473250847 472427444 471535416 470889244 470305557
878.6D70305557r61990j088982k030792j604805j232033N58625N73730r50241m30412
$$ 470305557 469343567 468254585 466223793 464618988 463386955 463945580 464519310 463569069 463138657
887.3D63138657K31933N51110j354180j332092m91676k6665P31964P85484J898842
$$ 463138657 463370590 463921700 462567520 461235428 460743752 460717087 461449051 462234535 464133377
895.9D64133377J293869O71501M64745J86271o39343j306877p34939o15540J105804
$$ 464133377 465427246 466098747 466563492 466749763 466110420 464803543 464068604 463453064 464558868
904.6D64558868K538567L170166K682762K261810J913643J70517n6419m96140o75811
$$ 464558868 467097435 470267601 472950363 475212173 477125816 477296333 477239914 476743774 476067963
913.3D76067963j301918q13179n85556j399765r45054k158966k710228l693389l479462
$$ 476067963 474766045 473952866 473367310 471967545 471022491 468863525 466153297 462459908 458980446
922D58980446k958985l756752l247489l130379k160340j959342k207070k922783l556480
$$ 458980446 456021461 452264709 449017220 445886841 443726501 441767159 439560089 436637306 433080826
930.7D33080826l128815l104820k028618j808548j311035O9885O25115j93253p43866
$$ 433080826 429952011 426847191 424818573 423010025 421698990 421768875 422393990 422200737 421456871
939.3D21456871L77007p53861k133293j579094r94225j263313q77037k05307l46680
$$ 421456871 421833878 421080017 418946724 417367630 416373405 415110092 414233055 414027748 413681068
948D13681068L74337R4375m00963p33680p45850n28602j256524j405487j470985q83637
$$ 413681068 414055405 414149780 413748817 413015137 412269287 411740685 410484161 409078674 407607689 406724052
957.7D06724052j614112k550087k507935j880760j348152k799149k143288j729202
$$ 406724052 405109940 402559853 400051918 398171158 396823006 394023857 391880569 390151367
965.4C90151367j348343p16667k010651j707038k370377k894325k314835k531547k861023
$$ 390151367 388803024 388086357 386075706 384368668 381998291 379103966 376789131 374257584 371396561
974.1C71396561k770691k564621l409157l396988l540268m200973m688721m979363
$$ 371396561 368625870 366061249 362652092 359255104 355714836 351513863 346825142 341845779
981.8C41845779m555244m424057m140968m202385l750458l440018l869056k974186
$$ 341845779 337290535 332866478 328725510 324523125 320772667 317332649 313463593 310489407
989.5C10489407l298531l690987l373317l556576k958431l084698j936073j900463
$$ 310489407 307190876 303499889 300126572 296569996 293611565 290526867 288590794 286690331
997.2B86690331l433152k912216k646122k449741l220368k898197j879082j389293
$$ 286690331 283257179 280344963 277698841 275249100 272028732 269130535 267251453 265862160
1004.9B65862160r37634j437721k97909r18846j426163j528434j870881j164455k148571
$$ 265862160 264924526 263486805 263188896 262270050 260843887 259315453 257444572 256280117 254131546
1013.6B54131546j635475j738663j513996j159573j898517j849156k199840j404514
$$ 254131546 252496071 250757408 249243412 248083839 246185322 244336166 242136326 240731812
1021.3B40731812k289048k287788j265488o95343o01940j527405p63893j310634j298371
$$ 240731812 238442764 236154976 234889488 234194145 233592205 232064800 231300907 229990273 228691902
1030B28691902j311321q26340p17964j158695M96235L21121R99679R19915J443729
$$ 228691902 227380581 226554241 225836277 224677582 225173817 225494938 226494617 227414532 228858261
1038.7B28858261J099434L18623J837978K35310J16844k22950m85153K69012j10931
$$ 228858261 229957695 230276318 232114296 232349606 232466450 232243500 231758347 232027359 231916428
1047.4B31916428l48149j379089o51531n29099l57036j091156j721077q84991m61407
$$ 231916428 231568279 230189190 229537659 229008560 228651524 227560368 225839291 224954300 224492893
1056B24492893P05891J89896N03978k3079M01726J724320J537189J366425Q94050K201271
$$ 224492893 225198784 225388680 225892658 225869579 226271305 227995625 229532814 230899239 231793289 233994560
1065.7B33994560J652737J854706J526012Q46939J153374j66760M49048Q3198N34477
$$ 233994560 235647297 237502003 239028015 239874954 241028328 240861568 241310616 241393814 241928291
1074.4B41928291L22190J92909P82623m01745R68628J219483N60913N1117J326294
$$ 241928291 242250481 242443390 243226013 242824268 243792896 245012379 245573292 245624409 246950703
1083B46950703J942730J109008J236935J92127J617718J660271J318130J346131Q90369
$$ 246950703 248893433 250002441 251239376 251431503 253049221 254709492 256027622 257373753 258264122
1091.7B58264122J227798N90668J742668J641388J782971J775646J696873J998691
$$ 258264122 259491920 260082588 261825256 263466644 265249615 267025261 268722134 270720825
1099.4B70720825R29165J354275K02236J84040J197033J675835J988449J530819K015400
$$ 270720825 271649990 273004265 273206501 273390541 274587574 276263409 278251858 279782677 281798077
1108.1B81798077R45091N34229K22302J32770P60594L75976J027718J255893J114789
$$ 281798077 282743168 283277397 283499699 283632469 284393063 284769039 285796757 287052650 288167439
1116.8B88167439O87313L15837Q6346m3411l57361o96011k09350n3272J229171J066914
$$ 288167439 288854752 289170589 289256935 289213524 288856163 288160152 287950802 287897530 289126701 290193615
1126.4B90193615Q28819J465531J108799J664142J104870J385861J878662J263923
$$ 290193615 291022434 292487965 293596764 295260906 296365776 297751637 299630299 300894222
1134.1C00894222J435166K205524K538853J473160J598529K163830J457958P00570
$$ 300894222 302329388 304534912 307073765 308546925 310145454 312309284 313767242 314467812
1141.9C14467812Q12931J110229J053181P35283K93407J002388J079731Q6327m24843
$$ 314467812 315280743 316390972 317444153 318179436 318472843 319475231 320554962 320641289 320216446
1150.5C20216446J12305M76684n99098j68419M84467j46408k89383l09468p25250j187668
$$ 320216446 320328751 320805435 320206337 320037918 320522385 320375977 320086594 319777126 319051876 317864208
1160.2C17864208l13015K28939k3842q2511J28440J427060J984748J589661J717911
$$ 317864208 317551193 317780132 317756290 317673779 317802219 319229279 321214027 322803688 324521599
1168.9C24521599K226639K435302K340737K111816K461701K453765K236824K686883
$$ 324521599 326748238 329183540 331524277 333636093 336097794 338551559 340788383 343475266
1176.6C43475266K659454K758713K344741J158867J219368K167321J470603Q59719
$$ 343475266 346134720 348893433 351238174 352397041 353616409 355783730 357254333 358114052
1184.3C58114052J427994J279335Q89663Q79135Q09975j37367m37546n94940r37462
$$ 358114052 359542046 360821381 361711044 362590179 363400154 363262787 362825241 362230301 361292839
1193C61292839o61621m02298K8877n02777r95064j101341j195907j533394j975441
$$ 361292839 360631218 360228920 360257797 359755020 358759956 357658615 356462708 354929314 352953873
1201.6C52953873r60808q72002j265526n73501p33376q58650k19688j83525o65741
$$ 352953873 351993065 351121063 349855537 349282036 348548660 347690010 347470322 347286797 346621056
1210.3C46621056n31617o50863r84917p13348m41590K40708K67181k51198k42614m00925
$$ 346621056 346089439 345438576 344453659 343740311 343298721 343539429 343806610 343555412 343312798 342911873
1220C42911873o45867p92579m33960n35660p78923l22342n45273p26776n74913n29327
$$ 342911873 342266006 341473427 341039467 340503807 339724884 339402542 338857269 338130493 337555580 337026253
1229.6C37026253n57480q15926r52224r14612n74341j24092K3842m45519l60832j98784
$$ 337026253 336468773 335652847 334700623 333786011 333211670 333087578 333111420 332665901 332305069 332106285
1239.3C32106285p30209l93219j41678k66686m12559l90930j94321m73022l93143k00844
$$ 332106285 331376076 330982857 330841179 330574493 330161934 329771004 329576683 329103661 328710518 328509674
1248.9C28509674k87170n55954m24271j85013n7564K13852R4834K40745N8861j09215
$$ 328509674 328222504 327666550 327242279 327057266 326999702 327213554 327308388 327549133 327607994 327498779
1258.5C27498779k33307l21273j9150k31972j39542O7482O53077R16748O31332Q20236
$$ 327498779 327265472 326944199 326925049 326693077 326553535 326621017 327274094 328190842 328822174 329642410
1268.2C29642410J088715J028252K67219K49519M20609O18172J113052J346703J392059
$$ 329642410 330731125 331759377 332026596 332276115 332696724 333314896 334427948 335774651 337166710
1276.9C37166710J016159J441193J473045Q63724O40411P04117J169090J570931J718406
$$ 337166710 338182869 339624062 341097107 341960831 342601242 343305359 344474449 346045380 347763786
1285.5C47763786J625595J757203J751213J443100R48906O94847N58929Q47359J095390
$$ 347763786 349389381 351146584 352897797 354340897 355289803 355984650 356543579 357390938 358486328
1294.2C58486328O97861J077423J248474J214752Q37174J31302J50756M16604N63049
$$ 358486328 359184189 360261612 361510086 362724838 363562012 363693314 363844070 364260674 364823723
1302.9C64823723m0436j99432R6512M89997N33715l27263m67644j29433k00882n77850
$$ 364823723 364783287 364583855 364680367 365170364 365704079 365376816 364909172 364779739 364578857 364001007
1312.5C64001007o30951o18019n57060k05231L33405Q67500R13048R22165N95512L53622
$$ 364001007 363370056 362752037 362194977 361989746 362323151 363190651 364103699 365025864 365621376 365974998
1322.2C65974998N04036N98107N48210K59438L50189M33540L10516j18522m0398l65829
$$ 365974998 366479034 367077141 367625351 367884789 368234978 368668518 368979034 368860512 368820114 368454285
1331.8C68454285q20809k03514k65655j16310k81601m9820O84509q965l72619P7858
$$ 368454285 367633476 367429962 367164307 367047997 366766396 366716576 367401085 367392120 367019501 367097359
1341.5C67097359J008262P05643K68517Q06312Q55484O95152R2316M03252p9003o04362
$$ 367097359 368105621 368811264 369079781 369886093 370741577 371436729 371529045 371932297 371853294 371248932
1351.1C71248932l33481l86734L4637m9781j27793o5498j0757n92194l91998l64800
$$ 371248932 370915451 370528717 370563354 370513573 370385780 370320282 370309525 369717331 369325333 368960533
1360.8C68960533r49859p3777q84895j69716J53618j60408K09427n61714p87430p54929
$$ 368960533 368010674 367936897 367052002 366882286 367035904 366875496 367084923 366523209 365735779 364980850
1370.4C64980850m37813m63981l16315n2528j64681L76854k71683L46680L45574m66805
$$ 364980850 364543037 364079056 363762741 363710213 363545532 363922386 363650703 363997383 364342957 363876152
1380.1C63876152q71391j191788j098404j464195p12700p54204j064682j579780j097565
$$ 363876152 363004761 361812973 360714569 359250374 358537674 357783470 356718788 355139008 354041443
1388.7C54041443l75672j432533j624756j661186j089554j608810k804375j168136
$$ 354041443 353665771 352233238 350608482 348947296 347857742 346248932 343444557 342276421
1396.4C42276421j397057j800537k455597j211586j088676k125092j718864j335259
$$ 342276421 340879364 339078827 336623230 335411644 334322968 332197876 330479012 329143753
1404.2C29143753j770592j987686r69467j077118j657448j364097j184445p32116j367226
$$ 329143753 327373161 325385475 324416008 323338890 321681442 320317345 319132900 318400784 317033558
1412.8C17033558j056633m21848q52280o19373o03867O21433r44004j120796R72424
$$ 317033558 315976925 315555077 314702797 314083424 313479557 314100990 313156986 312036190 313008614
1421.5C13008614N53398O75125o7120O78540R16309M65755Q44231K88448P66106J005135
$$ 313008614 313562012 314237137 314170017 314848557 315764866 316230621 317074852 317363300 318129406 319134541
1431.2C19134541J580104J228295R79995J718255J696853J560173L11623J927566J410828
$$ 319134541 320714645 321942940 322922935 324641190 326338043 327898216 328209839 330137405 331548233
1439.8C31548233J117134J098137N29900J517906J142044J464844J300430J430740
$$ 331548233 332665367 333763504 334293404 335811310 336953354 338418198 339718628 341149368
1447.6C41149368O08444J72921J236686P87392R34868K96822J549339J716308P32270
$$ 341149368 341757812 341930733 343167419 343954811 344889679 345186501 346735840 348452148 349184418
1456.2C49184418J517715j25465K978630J357002J613884J027184J252555K253266
$$ 349184418 350702133 350576668 353555298 354912300 356526184 357553368 358805923 361059189
1464C61059189O86340K499275J917649K336960K221832K250404K885056K212982L222275
$$ 361059189 361745529 364244804 366162453 368499413 370721245 372971649 375856705 378069687 381291962
1472.6C81291962J556091K827263L004150K677536K474518K287560K303009J912078
$$ 381291962 382848053 385675316 388679466 391357002 393831520 396119080 398422089 400334167
1480.3D00334167J863060J213341J501580J648864J284066J548767R98916O74935J393470
$$ 400334167 402197227 403410568 404912148 406561012 407845078 409393845 410392761 411067696 412461166
1489D12461166J54229n61104k73934j93138m12102r04541n35240l348350p43866j110420
$$ 412461166 412615395 412054291 411780357 411587219 411175117 410270576 409735336 406386986 405643120 404532700
1498.7D04532700k506218m93851j663742j589241q37898J42746m25759n109520k633247
$$ 404532700 402026482 401532631 399868889 398279648 397441750 397584496 397158737 392049217 389415970
1507.3C89415970J690216J209450o40145L85819p78389j537361j94550m82864P858
$$ 389415970 391106186 392315636 391675491 392061310 391282921 389745560 389551010 389068146 389076004
1516C89076004j229286k455712J68915Q51212j970215j789513J871415N40123J318206
$$ 389076004 387846718 385391006 385559921 386411133 384440918 382651405 384522820 385062943 386381149
1524.7C86381149J0033Q10776J343689k67L49502O63185P51496Q92677J081314j239967
$$ 386381149 386391182 387201958 388545647 388545380 388894882 389558067 390309563 391202240 392283554 391043587
1534.3C91043587J156120J425858N47256J222878k507973l664589K993927J811790
$$ 391043587 392199707 393625565 394172821 395395699 392887726 389223137 392217064 394028854
1542.1C94028854M7417J543732J526451o87142J406632R31892Q68683N10864n13992
$$ 394028854 394076271 395620003 397146454 396459312 397865944 398797836 399666519 400177383 399663391
1550.7C99663391K91824k3155O69670p38983N05524R92813O16493k576370n579681
$$ 399663391 399955215 399932060 400601730 399862747 400368271 401361084 401977577 399401207 393821526
1559.4C93821526J847686j36604N59654j048660o93932j900520k477760r37004j623078
$$ 393821526 395669212 395532608 396092262 395043602 394349670 392449150 389971390 389034386 387411308
1568.1C87411308p28683p086182j852112j652984l191147k332802k283783p33261j0939293
$$ 387411308 386682625 379596443 377744331 376091347 372900200 370567398 368283615 367550354 356611061
1576.8C56611061k044220k538223l342095l258438n007362l501816m796181k832222
$$ 356611061 354566841 352028618 348686523 345428085 340420723 336918907 332122726 329290504
1584.5C29290504m493713l726807l977184m762173k970600n202007k551327m736747
$$ 329290504 324796791 321069984 317092800 312330627 309360027 304158020 301606693 296869946
1592.2B96869946l086606l370838m103069k432938m680843k005634m151631k156830
$$ 296869946 293783340 290412502 286309433 283876495 279195652 277190018 273038387 270881557
1599.9B70881557l046417k783699j617088l683510q97732k930965p34863k326909j313724
$$ 270881557 267835140 265051441 263434353 259750843 258853111 255922146 255187283 252860374 251546650
1608.6B51546650j291199k733898J44768k017479N23681j402664M89445O31657m419461
$$ 251546650 250255451 247521553 247666321 245648842 246172523 244769859 245259304 245890961 241471500
1617.3B41471500J174889j224823J102428j184482R51519N59921j471920J126080k58885
$$ 241471500 242646389 241421566 242523994 241339512 242291031 242850952 241379032 242505112 242246227
1626B42246227K278996o48175Q35591L10573R09005J304779k861K316494K92320J263599
$$ 242246227 244525223 243877048 244712639 245023212 245932217 247236996 247234135 249550629 249842949 251106548
1635.6B51106548q24356K847615J626071Q22888J860542J29624K135086K75440K160835
$$ 251106548 250282192 253129807 254755878 255578766 257439308 257568932 259704018 259979458 262140293
1644.3B62140293J724262k35977K216091j209240K857361Q35438K491684J634235J907063
$$ 262140293 263864555 263628578 265844669 264635429 267492790 268328228 270819912 272454147 274361210
1653B74361210j199017k404251L348961R08375J660004N15842J303673J222763Q35724
$$ 274361210 273162193 270757942 274106903 275015278 276675282 277191124 278494797 279717560 280553284
1661.6B80553284K376842m0340L047161J547184K453422K782765K416649K715454J138630
$$ 280553284 282930126 282889786 285936947 287484131 289937553 292720318 295136967 297852421 298991051
1670.3B98991051M468288J306954L358364L133487K612591L308106K822761M520073
$$ 298991051 303459339 304766293 308124657 311258144 313870735 317178841 320001602 324521675
1678C24521675K785187M051933K707291L987236N011978K290230N162506J608009N766449
$$ 324521675 327306862 331358795 334066086 338053322 343065300 345355530 350518036 352126045 357892494
1686.7C57892494M047508M018898N103150M236717M518013M199791N147171M507103
$$ 357892494 361940002 365958900 371062050 375298767 379816780 384016571 389163742 393670845
1694.4C93670845M825249L336410N542412O065216N329704N072518l548O397209M963608
$$ 393670845 398496094 401832504 407374916 413440132 418769836 423842354 423838806 430236015 435199623
1703.1D35199623M396668L693122L384858L395996L120804M064941K721596K317772
$$ 435199623 439596291 443289413 446674271 450070267 453191071 457256012 459977608 462295380
1710.8D62295380K883720L139610K922592M35601J553726M133530L733139k294808
$$ 462295380 465179100 468318710 471241302 471676903 473230629 477364159 481097298 478802490
1718.5D78802490J545525L001785K198525J948623J323319J197777J914405K000428
$$ 478802490 480348015 483349800 485548325 487496948 488820267 490018044 491932449 493932877
1726.3D93932877J391487J496200K184677O08292L90129L192291L651390j89323k720299
$$ 493932877 495324364 496820564 499005241 499613533 500003662 503195953 506847343 506658020 503937721
1734.9E03937721L687668L671227K089653K756843R03816p22847L842087L012238J413727
$$ 503937721 507625389 511296616 513386269 516143112 517046928 516324081 520166168 523178406 524592133
1743.6E24592133K372093L659134L584480L111954L148651J817207M412842K774277
$$ 524592133 526964226 530623360 534207840 537319794 540468445 542285652 546698494 549472771
1751.3E49472771J220665M285469L138962L176918L174018J242981K554779L201561
$$ 549472771 550693436 554978905 558117867 561294785 564468803 565711784 568266563 571468124
1759E71468124K623978L525696N87387J25961L291054K025375J731224K199517K389869
$$ 571468124 574092102 577617798 578205185 578331146 581622200 583647575 585378799 587578316 589968185
1767.7E89968185n18608J695519L622970L26195m49333m36668L819770K597618k59857
$$ 589968185 589449577 591145096 594768066 595094261 594644928 594208260 598028030 600625648 600365791
1776.4F00365791K208367J240654J775360R34715o93970R08928J711579J705627J08376
$$ 600365791 602574158 603814812 605590172 606524887 605830917 606739845 608451424 610157051 610265427
1785.1F10265427O50100J350708J242371Q95119J648903J110458N47028m79088n81932
$$ 610265427 610915527 612266235 613508606 614403725 616052628 617163086 617710114 617231026 616649094
1793.8F16649094L037109J046448k58484J347961K041741J236229r37767J392593O7825
$$ 616649094 619686203 620732651 620474167 621822128 623863869 625100098 624162331 625554924 625622749
1802.4F25622749O83594J559258Q53157J455383N85213M69551P28759J367493k43301
$$ 625622749 626306343 627865601 628718758 630174141 630759354 631228905 631957664 633325157 633081856
1811.1F33081856K12555J061935N62248J609421N52178N57098l7231O88896J223030
$$ 633081856 633294411 634356346 634918594 636528015 637080193 637637291 637600060 638288956 639511986
1819.8F39511986J5297O38580k75879J024323J488113j093368K52456J899491J508712
$$ 639511986 639527283 640165863 639889984 640914307 642402420 641309052 641561508 643460999 644969711
1828.5F44969711l56598j986694M74167J875000L40500P01370Q94089N96161Q13522
$$ 644969711 644613113 642626419 643100586 644975586 645316086 646017456 646911545 647507706 648321228
1837.2F48321228m77066P15408J44806M88663N94635J121979J575622l828277J400299
$$ 648321228 647844162 648559570 648704376 649193039 649787674 650909653 652485275 648656998 650057297
1845.8F50057297K106247K72751l27759L07617R89227k04391M02145J20697N80521
$$ 650057297 652163544 652436295 652108536 652416153 653405380 653200989 653603134 653723831 654304352
1854.5F54304352M34341J58844N44968j25351N42755J12991M32358j23672J44195N08881
$$ 654304352 654738693 654897537 655442505 655317154 655859909 655972900 656405258 656281586 656425781 656934662
1864.2F56934662J24435J011277j26877N62286q76541j369324J120606J147766P24640
$$ 656934662 657059097 658070374 657943497 658505783 657629242 656259918 657380524 658528290 659252930
1872.8F59252930k97776L73993J21155N38406O21644O6452J11847l72696M90036K441
$$ 659252930 658955154 659329147 659450302 659988708 660610352 660676804 660788651 660415955 660905991 660908432
1882.5F60908432L22037L24630J51368N55191p7439L19596o21338q23212P03964J043625
$$ 660908432 661230469 661555099 661706467 662261658 662184219 662503815 661882477 661059265 661763229 662806854
1892.1F62806854M6082J94855M07714o34689O49643K96631J8539k59781r7580L45765
$$ 662806854 662852936 663047791 663455505 662820816 663470459 663767090 663785629 663525848 663428268 663774033
1901.8F63774033l9826P59277q9874K73285K77481q4762K54974q0872j88598o27442
$$ 663774033 663734207 664493484 664403610 664676895 664954376 664869614 665124588 665043716 664855118 664227676
1911.4F64227676O93512K31858Q6670k8229J8616J441650r81674o12488M63104J49384
$$ 664227676 664921188 665153046 665239716 665211487 665230103 666671753 665690079 665077591 665540695 665690079
1921.1F65690079K98309j98593r5596J84860R46426J76163N2261j80206m88739k16904
$$ 665690079 665988388 665789795 665694199 665879059 666825485 667001648 667053909 666873703 666384964 666168060
1930.7F66168060m43191J32446R6893P84455L63464L128j58691n21317O0196l77121
$$ 666168060 665724869 665857315 665954208 666738663 667102127 667105255 666946564 666425247 666485443 666108322
1940.3F66108322M73480m37240j099549P22428P67898K72293K7161N74265l68882o14166
$$ 666108322 666581802 666144562 665045013 665767441 666535339 666807632 666834793 667409058 667040176 666426010
1950F66426010n80978k32163K70539M4174L02429m56848K63367L18145J70594J3046
$$ 666426010 665845032 665612869 665883408 665927582 666230011 665773163 666036530 666354675 666525269 666538315
1959.6F66538315o47736p4157l30048K72751k79083O8435Q18405l91616j37940p3929
$$ 666538315 665890579 665816422 665486374 665759125 665480042 665548477 666366882 665975266 665837326 665763397
1969.3F65763397Q8501j90124K4490R92k61459K21710J13678J63116j05820K08054
$$ 665763397 665851898 665661774 665686264 665687256 665425797 665647507 665761185 665924301 665818481 666026535
1978.9F66026535k38800k85187k01568j69144L04413n50614j5792j21079k2125O6910
$$ 666026535 665787735 665502548 665300980 665131836 665436249 664885635 664869843 664748764 664726639 664793549
1988.6F64793549j54114N32837k35062m84009n06897K17743N9586j01319L69339k46048
$$ 664793549 664639435 665172272 664937210 664453201 663946304 664164047 664223633 664122314 664491653 664245605
1998.2F64245605l4179n03159J76926N9814l76205J42517k77557n6076r8114L48739
$$ 664245605 664211426 663708267 663885193 663945007 663568802 663711319 663433762 663377686 663279572 663628311
2007.8F63628311l26309k99454J62430j88980L1738m46701J37024j20468q4457n45578
$$ 663628311 663302002 663002548 663164978 662975998 663007736 662561035 662698059 662577591 662493134 661947556
2017.5F61947556q64716L43018K822J19324m00314p2174K24151j65710m0817m21982
$$ 661947556 661082840 661425858 661428680 661548004 661147690 661075516 661299667 661133957 661093140 660671158
2027.1F60671158Q468k76107l2959j88141k94571L7460m6921J57700m44183j94474
$$ 660671158 660679626 660403519 660370560 660182419 659887848 659925308 659878387 660036087 659591904 659397430
2036.8F59397430l57971k2049k29187n72738J26190j65711M41361m6768n9281r7580
$$ 659397430 659039459 659017410 658788223 658215485 658341675 658175964 658617325 658570557 658511276 658413696
2046.4F58413696k22244J96533o50863k85416j70975L31803O8206l24478k4261k23618
$$ 658413696 658191452 658387985 657737122 657451706 657280731 657612534 657680740 657356262 657332001 657108383
2056.1F57108383J42746m57992p0725j8082o3552j27030k60086K37274n42526J40610
$$ 657108383 657251129 656793137 656722412 656704330 656640778 656513748 656253662 656490936 655948410 656089020
2065.7F56089020K05841J79062J99280m12140k75650m16031K61459j14670j85318p6217
$$ 656089020 656294861 656473923 656673203 656261063 655985413 655569382 655830841 655716171 655530853 655454636
2075.4F55454636j8540K96860j75095j71356k88162N73654J39465l90625j76849j57471
$$ 655454636 655436096 655732956 655557861 655386505 655098343 655671997 655811462 655420837 655243988 655086517
2085F55086517K4796p96890L0441k6398k25982P8582j27258J67847k78931k16522n95322
$$ 655086517 655111313 654314423 654344864 654318466 654092484 654171066 654043808 654211655 653932724 653716202 653120880
2095.6F53120880l5324l81k99225L3951m45481J62049K1972J07956l91540o58570n4931
$$ 653120880 653085556 653085175 652785950 652819901 652374420 652536469 652558441 652666397 652274857 651616287 651561356
2106.2F51561356q4000J66168l65448J45645k72064n60226J7395j5412K35672k79617
$$ 651561356 651477356 651643524 651278076 651423721 651151657 650591431 650608826 650593414 650829086 650549469
2115.9F50549469Q4152n6915j75552k85645k49557l1052l06015M87976k4338M8065
$$ 650549469 650633621 650576706 650401154 650115509 649865952 649834900 649528885 650016861 649992523 650040588
2125.5F50040588k1133l50571l03116m76455L51410j46866p172j32599L8147M87900
$$ 650040588 650019455 649668884 649365768 648889313 649240723 649093857 649086685 648954086 648992233 649480133
2135.1F49480133j86615j93558l61938J28555k94113J25961L43094J9837N45120j92871
$$ 649480133 649293518 649099960 648738022 648866577 648572464 648698425 649041519 649061356 649606476 649413605
2144.8F49413605J78680j75781k44293j29166p9346K82441n31998j28555j36109N49469
$$ 649413605 649592285 649416504 649172211 649043045 648963699 649246140 648714142 648585587 648449478 648998947
2154.4F48998947N16358k4338j8997n00107K04315l32565j37329Q1253Q0719M23126
$$ 648998947 649515305 649490967 649471970 648971863 649176178 648843613 648706284 648787537 648868256 649291382
2164.1F49291382R1858K56042k78091n9357m83246l71704J73874J02081M20838j84250
$$ 649291382 649383240 649639282 649361191 649301834 648818588 648446884 648620758 648722839 649143677 648959427
2173.7F48959427K92206K16751M4327O8588j62659j37024k94571L01514L4485O4468
$$ 648959427 649251633 649468384 649512711 649581299 649418640 649281616 648987045 649288559 649323044 649387512
2183.4F49387512k89612j10092N32150L67508L75977o10046k88620j56174J65176N46112
$$ 649387512 649097900 648987808 649519958 649887466 650263443 649653397 649364777 649208603 649373779 649919891
2193F49919891j31912R5062l4256M3793k25906O4621P9269j60751K4261j54419L90778
$$ 649919891 649787979 649883041 649848785 649892578 649666672 649731293 649810562 649649811 649674072 649519653 649910431
2203.6F49910431P1030J69982j52130j3122K71759l00293J73874j28021M44412J10855
$$ 649910431 649981461 650151443 649999313 649986191 650257950 649957657 650131531 650003510 650447922 650558777
2213.3F50558777j95084J49842j74408K45742k43148k0447l40042j57318K28347L82
$$ 650558777 650363693 650513535 650339127 650584869 650341721 650321274 649981232 649823914 650052261 650052643
2222.9F50052643M62494n4627J05286m81033j30234M90875k40631l80936m91714J86157
$$ 650052643 650515137 650460510 650565796 650084763 649954529 650445404 650204773 649823837 649332123 649518280
2232.5F49518280K86179O90612J99814k71835K18887m04892k38876l29361j10931k3041
$$ 649518280 649804459 650495071 650694885 650423050 650641937 650237045 649998169 649668808 649557877 649534836
2242.2F49534836q3618J36413J54038K82516K29J29547l70407k99530l87802j89285
$$ 649534836 649451218 649587631 649741669 650024185 650024414 650153961 649783554 649484024 649096222 648906937
2251.8F48906937J58538j79214P41959K36816J82037P859l96805P63n01557k32391
$$ 648906937 649065475 648886261 649628220 649865036 650047073 650054932 649658127 649658890 649157333 648924942
2261.5F48924942k79541N1117R079L87573N63812k64968j50147n30777J16043K3499
$$ 648924942 648645401 648696518 648705597 649093170 649656982 649392014 649241867 648711090 648827133 648850632
2271.1F48850632m6387L7689l30124J32218l07083J51367n1880j22299O3476j20010
$$ 648850632 648804245 648841934 648511810 648644028 648336945 648488312 648436432 648314133 648377609 648257599
2280.8F48257599M1580n23834k4948q9035q9417L9444J46713N7297l60718J17798m01153
$$ 648257599 648299179 647775345 647750397 647661362 647571945 647611389 647758102 647815399 647454681 647572479 647171326
2291.4F47171326P0724j99127m88892K19422p1335j2360l62167M0131l91007l14636
$$ 647171326 647242050 647042923 646554031 646773453 646702118 646689758 646327591 646367722 645976715 645662079
2301F45662079N2414m33579P6447j76621J28632j65024j9760n9509n56107l5477m37011
$$ 645662079 645714493 645280914 645357361 645180740 645309372 645144348 645124588 645065079 644508972 644473495 644036484
2311.6F44036484J11694j52969p5302m4251l3646K34681q68378m09241m80041O9122
$$ 644036484 644148178 643995209 643919907 643875656 643842010 644076691 643208313 642799072 642319031 642388153
2321.3F42388153j96152m37011L36609k36435L08456k70844o0806o93664j017762L84140
$$ 642388153 642192001 641754990 642091599 641855164 642163620 641892776 641831970 641138306 640120544 640504684
2330.9F40504684P6905m92249n29823O34193J65711k92511o25801J90735K41928p14608
$$ 640504684 640581589 640089340 639559517 640193710 640359421 640066910 639441109 639631844 639873772 639159164
2340.6F39159164O37742l74108l36189o28471J39808P17507m16985M09889J15853j80741
$$ 639159164 639796906 639422798 639086609 638458138 638597946 639315453 638898468 639308357 639424210 639243469
2350.2F39243469j279945n43747P16171q85238o69709n73120Q82416N39589q02384
$$ 639243469 637963524 637419777 638135948 637250710 636581001 636007881 636890297 637429886 636627502
2358.9F36627502j088218n17311r5559p51800q8730m81682J175080P91435N50232N7983
$$ 636627502 635539284 635021973 634926414 634174614 634085884 633604202 634779282 635570717 636120949 636178932
2368.5F36178932p11059L9024j400642m04091J9264L78189J26152n27878J49956k55852
$$ 636178932 635467873 635506897 634106255 633702164 633721428 634099617 634225769 633697891 633847847 633591995
2378.2F33591995J52779k94800L1357K68936m84428m09546o02570k44827k59018J02653
$$ 633591995 633744774 633449974 633481331 633750267 633265839 632856293 632253723 632008896 631749878 631852531
2387.8F31852531r3231n80749q3924l3340M5166m46625j51977o0807o85043n26085
$$ 631852531 631759300 631178551 631094627 631061287 631106453 630659828 630507851 630447044 629762001 629235916
2397.4F29235916j13067j21995n02319n1193k63710k44522r1706l28826j77765m54026
$$ 629235916 629122849 629000854 628498535 628447342 628183632 627939110 627847404 627518578 627340813 626886787
2407.1F26886787l59726n65986m30870k59781j02921J831l49731j72462k35444k39830
$$ 626886787 626527061 625961075 625530205 625270424 625167503 625169334 624819603 624647141 624411697 624171867
2416.7F24171867p02629k87780j29166p16629l47214k48222Q9340n34897l19214K19078
$$ 624171867 623469238 623181458 623052292 622335663 621988449 621740227 621829567 621294670 620975456 621194534
2426.4F21194534k75497m64974q56628l96194n26658l65028q0719j44768l05404m56009
$$ 621194534 620919037 620454063 619597435 619201241 618674583 618309555 618228836 618084068 617778664 617322655
2436F17322655L37372k59934m81529q76045p68471l1281n01632o2218m77181j98097
$$ 617322655 617660027 617400093 616918564 616042519 615274048 615242767 614741135 614678917 614201736 614003639
2445.7F14003639K46773j35231l47061r05342o57921o38962k04048k46086o64139p23953
$$ 614003639 614250412 614115181 613768120 612862778 612204857 611565895 611361847 611115761 610451622 609727669
2455.3F09727669k41051M35486k73667l29208n70145o14204m42238m66232l66364o50825
$$ 609727669 609486618 609922104 609648437 609319229 608749084 608134880 607692642 607226410 606860046 606209221
2465F06209221J36566j39503n51682l11890k37465m01725q04405j05820l87268p35131
$$ 606209221 606345787 606206284 605654602 605342712 605105247 604703522 603899117 603793297 603406029 602670898
2474.6F02670898n06134l10249k91023n72281l49236o05049n83114o14930l10401k35062
$$ 602670898 602164764 601854515 601563492 600991211 600641975 600036926 599453812 598838882 598528481 598293419
2484.2E98293419o25000k34451m94690n59311l56140k75040n36079m88282k62375n44548
$$ 598293419 597668419 597433968 596939278 596379967 596023827 595748787 595212708 594724426 594462051 593917503
2493.9E93917503j61705l82118m98619m28162n66940m93469o00891n62973o76956l05939
$$ 593917503 593755798 593373680 592875061 592446899 591879959 591386490 590785599 590222626 589545670 589239731
2503.5E89239731j60637k00768k05803k64587n53932j211777r54361p00531j73149
$$ 589239731 589079094 588878326 588672523 588407936 587854004 586642227 585687866 584987335 584814186
2512.2E84814186J72501o0311k95181m93927l85246o31752m78592o47278q53882o33392
$$ 584814186 584986687 584926376 584631195 584137268 583752022 583120270 582641678 581994400 581140518 580507126
2521.9E80507126j35918n9929p41844j70631p0954j92909m81567q26683m70047q48885
$$ 580507126 580371208 580311279 579569435 579398804 579327850 579134941 578653374 577826691 577356644 576507759
2531.5E76507759m89693j81579J8501p0076m15344j75209l23410l31383p47948q81576
$$ 576507759 576018066 575836487 575854988 575784912 575369568 575194359 574870949 574539566 573791618 572910042
2541.1E72910042q05130o04553n68886n66254J11466J03721J02158n49317o29844l71476
$$ 572910042 572104912 571500359 570931473 570365219 570476685 570580406 570682564 570133247 569503403 569131927
2550.8E69131927o79550m52156o24962l55682o40488k14271K79617m48227m16717o09894
$$ 569131927 568452377 568000221 567375259 567019577 566379089 566164818 566444435 565996208 565579491 564969597
2560.4E64969597m85649o66352o76422k09617k7619k82020q00743l66822n21278k82097
$$ 564969597 564483948 563817596 563141174 562931557 562903938 562621918 561821175 561454353 560933075 560650978
2570.1E60650978l15666p82242j12610k80266p93800n41687J93825p0801n02129n13610
$$ 560650978 560335312 559553070 559440460 559160194 558366394 557824707 558018532 557947731 557445602 556931992
2579.7E56931992n38636k61001m82521l42980m89959m70582j91307m91600o03752m85649
$$ 556931992 556393356 556132355 555649834 555306854 554816895 554346313 554155006 553663406 553059654 552574005
2589.4E52574005k22511m15764l52860m80728m80804m61273n07050n9090o73141n15671
$$ 552574005 552351494 551935730 551582870 551102142 550621338 550160065 549653015 549593925 548920784 548405113
2599E48405113k52075n72433o08979p31659j59988j3962k44713n83305o31752n81398
$$ 548405113 548153038 547580605 546971626 546239967 546079979 546066017 545821304 545237999 544606247 544024849
2608.6E44024849m84276l74832q12149o74019o98280o40869m95072l5095P0000p62444
$$ 544024849 543540573 543165741 542353592 541679573 540981293 540340424 539845352 539810257 539880257 539117813
2618.3E39117813p28264p04880l78074o10657p69234O6567n8289m33159p50389n46379
$$ 539117813 538389549 537684669 537306595 536695938 535926704 535993271 535934982 535501823 534751434 534205055
2627.9E34205055m10194n67970p51534p75299l54996l42979m88854q60405l53317j81236
$$ 534205055 533794861 533226891 532475357 531700058 531345062 531002083 530513229 529652824 529299507 529118271
2637.6E29118271p25670m67720m07181n57022q61969n42641k34909l61900n55267k86713
$$ 529118271 528392601 527924881 527517700 526960678 526098709 525556068 525321159 524959259 524403992 524117279
2647.2E24117279j42937j077881n98449l41492m65622l54080p55615j75247l06130
$$ 524117279 523974342 522896461 522298012 521956520 521490898 521136818 520381203 520205956 519899826
2655.9E19899826o61621m89616j87684J6938k01264l53241m39377n40504q68988j91879
$$ 519899826 519238205 518748589 518560905 518577843 518376579 518023338 517583961 517043457 516174469 515982590
2665.5E15982590k51770p42646m44831o13175k06871k98309j57547R5634m13017n25856
$$ 515982590 515730820 514988174 514543343 513930168 513723297 513424988 513267441 513363075 512950058 512424202
2675.2E12424202n40085m21944m55360k19955l89023n34897k62642k86713k00729m50134
$$ 512424202 511884117 511462173 511006813 510786858 510397835 509862938 509600296 509313583 509112854 508662720
2684.8E08662720n25780l60489j78528m37393l28827j20277n63278l48435l67775l50571
$$ 508662720 508136940 507776451 507597923 507160530 506831703 506711426 506148148 505799713 505431938 505081367
2694.5E05081367n62210m82750N4665k80571m63066o12183l06282j60446m66652n20973
$$ 505081367 504519157 504036407 504091072 503810501 503347435 502735252 502428970 502268524 501801872 501280899
2704.1E01280899j95618o8512n52139k43149j31683k91100n89943n57746j41678j46599
$$ 501280899 501085281 501016769 500464630 500221481 500089798 499798698 499208755 498651009 498509331 498362732
2713.8D98362732K0180n14603j45874K03285j62048j99585o93626n76172n80216l54271
$$ 498362732 498382912 497868309 497722435 497925720 497763672 497564087 496870461 496294289 495714073 495359802
2723.4D95359802j41334k42768l66172k87247L02315l05405p16362n44205j85661l12080
$$ 495359802 495218468 494975700 494609528 494322281 494624596 494319191 493602829 493058624 492872963 492560883
2733D92560883m20876J57890m70581l74260K11716K97775k32544o79855r8457l16353
$$ 492560883 492140007 492297897 491827316 491453056 491664772 491962547 491730003 491050148 490951691 490635338
2742.7D90635338o19393o01883k1247K27203j5411q1406k37656O6376n78804p47604
$$ 490635338 490015945 489414062 489392815 489620018 489604607 489523201 489285545 489351921 488773117 488025513
2752.3D88025513k96135o8627l1089m63562k01531k67448r2888j15547n12772m14162
$$ 488025513 487729378 487660751 487629662 487166100 486964569 486697121 486604233 486488686 485975914 485561752
2762D85561752k81868r6283m24308l52173l63808k80456n1842k36588l10478m01115
$$ 485561752 485279884 485183601 484759293 484407120 484043312 483762856 483711014 483474426 483163948 482762833
2771.6D82762833l5477l72505o91071n18265m19387m86565p50427k22016k56271l31192
$$ 482762833 482727356 482354851 481663780 481145515 480726128 480239563 479489136 479267120 479010849 478679657
2781.3D78679657j42403k51808k74048l46412l18604o85234o32057o00319n52483k31704
$$ 478679657 478537254 478285446 478011398 477664986 477346382 476661148 476029091 475428772 474876289 474644585
2790.9D74644585m35143p57255j001931m66461M9324j74827p23839q04062n35202o06842
$$ 474644585 474209442 473452187 472450256 471983795 472033119 471858292 471134453 470330391 469795189 469188347
2800.5D69188347n41306n37109n81589p82013n19180m43878p98798o93321o15082l59268
$$ 469188347 468647041 468109932 467528343 466746330 466227150 465783272 464984474 464291153 463676071 463316803
2810.2D63316803o08902p82433r33189q81424n21164p67555n48058o61239o30722o84700
$$ 463316803 462707901 461925468 460992279 460110855 459589691 458822136 458274078 457612839 456982117 456297417
2819.8D56297417r59359q14209q52584l02658m32282q96912r28268o13861n31273j119728
$$ 456297417 455338058 454523849 453671265 453368607 452936325 452039413 451111145 450497284 449966011 448846283
2829.5D48846283r78890o16722o25496j273651j206550q23670p99369p64847j235199
$$ 448846283 447867393 447250671 446625175 445351524 444144974 443321304 442521935 441757088 440521889
2838.2D40521889r07975j471633j754723j056938j287575j524544j938057j615181
$$ 440521889 439613914 438142281 436387558 435330620 434043045 432518501 430580444 428965263
2845.9D28965263j401672j705627k094002k107582j485710j215134n41573q25195j040688
$$ 428965263 427563591 425857964 423763962 421656380 420170670 418955536 418413963 417588768 416548080
2854.6D16548080l75022j14136l7918j30120L1815m34380n49392m19617n60493k84539
$$ 416548080 416173058 416058922 416021004 415890884 415922699 415488319 414938927 414519310 413958817 413674278
2864.2D13674278m31175o46439o57997q23402j223335r36127o73027l81661j00288
$$ 413674278 413243103 412596664 411938667 411115265 409891930 408955803 408282776 407901115 407800827
2872.9D07800827o84242r23538j167183n17350l38058q17604p23152j208344p33070
$$ 407800827 407116585 406193047 405025864 404508514 404170456 403352852 402629700 401421356 400688286
2881.6D00688286p32956q14858j99585n23643p76367r20220q41217p77893p25975q74100
$$ 400688286 399955330 399140472 398940887 398417244 397640877 396720657 395879440 395101547 394375572 393501472
2891.2C93501472r91172r64241q94547j75247l84102r46197r75075o78597n10597n60265
$$ 393501472 392510300 391546059 390651512 390476265 390092163 389145966 388170891 387492294 386981697 386421432
2900.8C86421432m97512j018372p13501o60057j133079p51305o58684n04074m31404
$$ 386421432 385923920 384905548 384192047 383531990 382398911 381647606 380988922 380484848 380053444
2909.5C80053444o85463r24263r81865j180611j392517j200180j448326j611519j122970
$$ 380053444 379367981 378443718 377461853 376281242 374888725 373688545 372240219 370628700 369505730
2918.2C69505730o94313q76580j120529j046524p60460n81779o34880j67313P25r5406
$$ 369505730 368811417 367934837 366814308 365767784 365007324 364425545 363790665 363623352 363624077 363528671
2927.8C63528671m921j90696k65847n2032P1182p3585J39656L61747L94974O04134
$$ 363528671 363523750 363333054 363067207 363015175 363086357 363012772 363152428 363514175 363909149 364513283
2937.5C64513283Q69713N31387K28233P57904P21741P60536N80025K01759O43540Q54034
$$ 364513283 365382996 365914383 366142616 366900520 367622261 368382797 368962822 369164581 369808121 370662155
2947.1C70662155P34673K39525N40733Q78982O67725L82538m08707L6583O99387O87484
$$ 370662155 371396828 371636353 372177086 373056068 373723793 374106331 373697624 373734207 374433594 375121078
2956.8C75121078N77622M68368K34490L74107R38454L99208N65910R21517O58073O30951
$$ 375121078 375698700 376167068 376401558 376775665 377714119 378113327 378679237 379600754 380258827 380889778
2966.4C80889778L34740M56886M94270N16091M99687N45807N64766P81250J166611
$$ 380889778 381224518 381681404 382175674 382691765 383191452 383737259 384302025 385083275 386249886
2975.1C86249886O63299N86815L45993J76239K19307l3951K93274P5379K2888M84352
$$ 386249886 386913185 387500000 387845993 388022232 388241539 388207588 388500862 388576241 388599129 389083481
2984.7C89083481N92842Q8959K8381N30777J48087j28060j92451j05820p1411P591
$$ 389083481 389676323 389765282 389793663 390324440 390472527 390344467 390152016 390046196 389974785 389982376
2994.4C89982376J12267l10250q926r6092o92673m28810m27857o44416l53432m90456
$$ 389982376 390094643 389784393 389775467 389679375 388986702 388557892 388130035 387485619 387132187 386641731
3004C86641731n02662j14212l42102m70543m77448l14903o04706q52165n63584p06291
$$ 386641731 386139069 386024857 385682755 385212212 384734764 384419861 383815155 382962990 382399406 381693115
3013.7C81693115l80211n26504l82385m54064r33571j74942o14891j012497o61697
$$ 381693115 381312904 380786400 380404015 379949951 379016380 378841438 378226547 377214050 376552353
3022.4C76552353m62685m84810q46023o57768p93229o48841n69687n94940n58358p65037
$$ 376552353 376089668 375604858 374758835 374101067 373307838 372658997 372089310 371494370 370936012 370170975
3032C70170975m44870o63529q47320q54836q38928p75833o57196l83682q76999r29566
$$ 370170975 369726105 369062576 368215256 367360420 366521492 365745659 365088463 364704781 363827782 362898216
3041.6C62898216p58171r12361p41806p20749j050873r09500k31476l85132j026649
$$ 362898216 362140045 361227684 360485878 359765129 358714256 357804756 357573280 357188148 356161499
3050.3C56161499j260719o44150o5422m65241j029663r85794m82445o96640j015434
$$ 356161499 354900780 354256630 354191208 353725967 352696304 351710510 351228065 350531425 349515991
3059C49515991j091881p04269n68390r60541k42157r1858n76133r06868j105118o37627
$$ 349515991 348424110 347719841 347151451 346190910 345948753 345856895 345280762 344373894 343268776 342631149
3068.6C42631149m53720m71153p02362o38809n11399p73162q52166m21142j07842n89905
$$ 342631149 342177429 341706276 341003914 340365105 339853706 339080544 338228378 337807236 337699394 337109489
3078.3C37109489n78613o05697q82721q56743n91202l16925n51376o28167p36847l17916
$$ 337109489 336530876 335925179 335042458 334185715 333594513 333277588 332726212 332098045 331361198 331043282
3087.9C31043282l87688r44100n80635n46379m60434p48901j114082p33834j79519
$$ 331043282 330655594 329711494 329130859 328584480 328124046 327375145 326261063 325527229 325347710
3096.6C25347710m8981n35317m53491n89332j030922j010971p54547m08249j70060
$$ 325347710 325298729 324763412 324309921 323720589 322689667 321678696 320924149 320515900 320345840
3105.3C20345840l09753r47819q00495m21409m13895n75199q22163j042557j146526
$$ 320345840 320036087 319088268 318287773 317866364 317452469 316877270 316055107 315012550 313866024
3114C13866024k89326r4833l83282l30925o47774q54110q57926o16912j061287j182118
$$ 313866024 313576698 313481865 313098583 312767658 312119884 311265774 310407848 309790936 308729649 307547531
3123.6C07547531n23987k57320m27303p40147l04127l93886p96929o72607p60193r61361
$$ 307547531 307023544 306766224 306338921 305598774 305294647 304900761 304103832 303431225 302671032 301709671
3133.3C01709671p43351l28617n22442p26318j006508o16799l83529j230870r70935
$$ 301709671 300966320 300637703 300115261 299388943 298382435 297765636 297382107 296151237 295180302
3141.9B95180302m35372j21498l40710q11786o19888n05620k37922p70893j039505
$$ 295180302 294744930 294623432 294282722 293470936 292851048 292345428 292107506 291336613 290297108
3150.6B90297108l84865n11932q01545q24318p41882q37345j122551o95877L4847k71892
$$ 290297108 289912243 289400311 288598766 287774448 287032566 286195221 285072670 284376793 284411640 284139748
3160.3B84139748q02594p88002p00454o38581q79383p51953m35219m65297n62535p38201
$$ 284139748 283337154 282549152 281848698 281210117 280330734 279578781 279143562 278678265 278115730 277377529
3169.9B77377529o70051n45655o88362p37247l23429l94993p05834n44166p21874q21190
$$ 277377529 276707478 276161823 275473461 274736214 274412785 274017792 273311958 272767792 272045918 271224728
3179.5B71224728o80542n59655o14833p47815n08079j77136o19907j082993l28998
$$ 271224728 270544186 269984531 269369698 268621883 268113804 267936668 267316761 266233768 265904770
3188.2B65904770l08609p36790m93145m86030o35682p20386k49882m10175p83329o35338
$$ 265904770 265596161 264859371 264366226 263880196 263244514 262524128 262274246 261864071 261080742 260445404
3197.9B60445404m06189j81007q89740o17771q9684m74510m71401o06385o41803o77033
$$ 260445404 260039215 259858208 258968468 258350697 258261013 257786503 257315102 256708717 256066914 255389881
3207.5B55389881l59402k37217m59041o14739r55028k44675j91459r26533n53055o6147
$$ 255389881 255030479 254793262 254334221 253719482 252764454 252519779 252328320 251401787 250848732 250782585
3217.2B50782585k7885l44467p61872q13255m36630o88591q36583k48203j20983j40972
$$ 250782585 250754700 250410233 249648361 248835106 248398476 247709885 246873302 246625099 246504116 246363144
3226.8B46363144m18644m03538l28045r12361p46307k69203k74735l75252j97925n2147
$$ 246363144 245944500 245540962 245212917 244300556 243554249 243285046 243010311 242635059 242437134 242384987
3236.4B42384987l64075m90894l74966l99837p55291r82266n11722J58443L04566l48301
$$ 242384987 242020912 241530018 241155052 240755215 239999924 239017658 238505936 238664379 238968945 238620644
3246.1B38620644p19967o61450o33926k30217k84443n69344k72922j19839l68862n93262
$$ 238620644 237900677 237239227 236605301 236375084 236090641 235521297 235248375 235128536 234759674 234166412
3255.7B34166412l60183m96140l39146K96021m71783p25383q526k17095o70128n38387
$$ 234166412 233806229 233310089 232970943 233266964 232795181 232069798 232061272 231844177 231174049 230635662
3265.4B30635662N169r8286l62014m29326m70314l33461o78482l58143J01566j58176
$$ 230635662 230640831 230542545 230180531 229751205 229280891 228947430 228268948 227910805 228012371 227854195
3275B27854195k3842k52304m40636j51577k12460n17044k80380P2308o69422n33486
$$ 227854195 227830353 227578049 227137413 226985836 226773376 226256332 225975952 226048260 225378838 224845352
3284.7B24845352q087o36024j14022M04339J1253j43508k60563j67809n45978o52543
$$ 224845352 224837265 224201241 224087219 224491558 224502811 224359303 224098740 223930931 223384953 222732410
3294.3B22732410k60868o4315L7345l84731m24595k35519k11506j05171k76261j14879
$$ 222732410 222471542 222407227 222444572 222059841 221635246 221399727 221188221 221083050 220806789 220691910
3303.9B20691910J92032j85109n78327k38285l67317o13022k68020p8106K31933l11947
$$ 220691910 220883942 220698833 220120506 219882221 219514904 218901882 218633862 218555756 218787689 218475742
3313.6B18475742o75735j8997j02997n82123p27940j34506J09291k31552j96609o83689
$$ 218475742 217800007 217781010 217678013 217095890 216367950 216233444 216342735 216111183 215914574 215230885
3323.2B15230885q77896j41525P9842m10977m80156j82800j99700l61118p62043o12736
$$ 215230885 214352989 214211464 214291306 213880329 213400173 213217373 213017673 212656555 211894512 211281776
3332.9B11281776j7795l38707l93887j78299p52468m87938J63117j54209o12908n80101
$$ 211281776 211263981 210925274 210531387 210353088 209600620 209112682 209275799 209121590 208508682 207928581
3342.5B07928581m84447o06499N1861K69394l95298k64149j58825j7738L3626m26197
$$ 207928581 207444134 206837635 206889496 207158890 206763592 206499443 206340618 206322880 206356506 205930309
3352.2B05930309r89685n42164P93171R2144m64992J84669k27127m02145j61743P1544
$$ 205930309 204940624 204398460 205191631 205283775 204818783 205003452 204776325 204374180 204212437 204283981
3361.8B04283981r1076m96006l71265n8460j63937k88143o5842j93081K5673j60007
$$ 204283981 204192905 203696899 203325634 203267174 203103237 202815094 202749252 202556171 202581844 202421837
3371.4B02421837l05519J89476j61667J01757K31686k32201n19524n62706L31841L49750
$$ 202421837 202116318 202305794 202144127 202245884 202477570 202245369 201725845 201163139 201494980 201844730
3381.1B01844730Q4591J35918l30010k90279r5Q1291O103j63059j71814K29893K81811
$$ 201844730 201929321 202065239 201735229 201444950 201444855 201526146 201532249 201369190 201197376 201427269 201709080
3391.7B01709080l73669m75998J72463K25162l33347l9635K03362N1422J08623n4817
$$ 201709080 201335411 200859413 201031876 201257038 200923691 200884056 201087418 201138840 201247463 201192646
3401.3B01192646K08111o30j74255L03268J74218P4043j20106k29912L08915M43916
$$ 201192646 201400757 201400127 201225872 201529140 201703358 201777401 201657295 201427383 201736298 202180214
3411B02180214o9847l81565L4961M85573K65789J13373J51901l6525n0927j57775K93006
$$ 202180214 202110367 201728802 201763763 202249336 202515125 202628498 202780399 202743874 202692947 202535172 202828178
3421.6B02828178R03016L67450J08967p248j38855N60379N71747L21693M65756k35558
$$ 202828178 203731194 204098644 204207611 204200363 204061508 204621887 205193634 205515327 205981083 205745525
3431.2B05745525j64947L73421J21784N03120L81203k9736N2796M19769P11002j04026
$$ 205745525 205580578 205953999 206075783 206578903 206960106 206930370 206983166 207402935 208113937 208009911
3440.9B08009911J91631O65684J91402K41051M39052O15082l08113k2411N76992K39601
$$ 208009911 208201542 208867226 209058628 209299679 209738731 210353813 210045700 210023289 210600281 210839882
3450.5B10839882R11808J103592N77564J85776M97818M90875K73457O20956L18966
$$ 210839882 211751690 212855282 213432846 213618622 214116440 214607315 214880772 215501728 215820694
3459.2B15820694N85785P69882N74360L73306L57914P90768N47829N19390N79700P29199
$$ 215820694 216406479 217176361 217750721 218124027 218481941 219272709 219820538 220339928 220919628 221648827
3468.8B21648827L91769l4637M46376O29025P18498M85497O18076K56157J26095J083736
$$ 221648827 222040596 222005959 222452335 223081360 223799858 224285355 224903431 225159588 225285683 226369419
3478.5B26369419J016846J056995Q71563L61824P5932O78215J170749J41678M95644
$$ 226369419 227386265 228443260 229314823 229676647 229752579 230430794 231601543 231743221 232238865
3487.2B32238865J052513P19719K97794J93882J044617Q48160O90155J301632Q82416
$$ 232238865 233291378 234011097 234308891 234502773 235547390 236395550 237085705 238387337 239269753
3495.8B39269753K42443O47773P55577Q15106J345711J307144O90937j76983O37054
$$ 239269753 239512196 240159969 240915546 241730652 243076363 244383507 245074444 244897461 245534515
3504.5B45534515J048031O00643P43103O89965J061706O19355P64179J363010R25656
$$ 245534515 246582546 247183189 247926292 248616257 249677963 250297318 251061497 252424507 253350163
3513.2B53350163P17220L61194N60093J059552J341037J201706P60918L24955L81794
$$ 253350163 254067383 254428577 254988670 256048222 257389259 258590965 259351883 259676838 260058632
3521.9B60058632J107464Q45928J057739J170006Q76217J258468Q94032N66731J044197
$$ 260058632 261166096 262012024 263069763 264239769 265115986 266374454 267268486 267835217 268879414
3530.6B68879414J194210Q99925J125355P63473J157780J630325N65453R02443J189041
$$ 268879414 270073624 270973549 272098904 272862377 274020157 275650482 276215935 277118378 278307419
3539.2B78307419J580276J298065O73180P34577P44324J551914J474648J406879N48935
$$ 278307419 279887695 281185760 281858940 282593517 283337841 284889755 286364403 287771282 288320217
3547.9B88320217J032181J828918J426926J850452M38862Q02555J313649J572742J817780
$$ 288320217 289352398 291181316 292608242 294458694 294897556 295700111 297013760 298586502 300404282
3556.6C00404282M89864J384258J702385J733532R71604J349906J695118R23787L570728
$$ 300404282 300894146 302278404 303980789 305714321 306685925 308035831 309730949 310654736 314225464
3565.3C14225464J528969o00987M83647P25097L102703J891270J661644J512222J571198
$$ 314225464 315754433 315153446 315637093 316362190 319464893 321356163 323017807 324530029 326101227
3574C26101227J733475J488571K073173Q28705J879654J739655J374321K010498J449928
$$ 326101227 327834702 329323273 331396446 332225151 334104805 335844460 337218781 339229279 340679207
3582.6C40679207J815185J362687L350715K706757k5521J783944k28081K040710L055191
$$ 340679207 342494392 343857079 347207794 349914551 349889030 351672974 351444893 353485603 356540794
3591.3C56540794K664223J492691R40933L142853O26412J767273L218345J633530K599335
$$ 356540794 359205017 360697708 361638641 364781494 365407906 367175179 370393524 372027054 374626389
3600C74626389R91478J356849K750702J948013K374306L103333L071785P49549K881356
$$ 374626389 375617867 376974716 379725418 381673431 384047737 387151070 390222855 390972404 393853760
3608.7C93853760M91333n47257O209946K654610p25251L827591M47007L211402L861580
$$ 393853760 394345093 393797836 400007782 402662392 401937141 405764732 406211739 409423141 413284721
3617.4D13284721R47953K847404J532517J334877K971611L303222K481804K567597
$$ 413284721 414232674 417080078 418612595 419947472 422919083 426222305 428704109 431271706
3625.1D31271706K390556K464943O802788L036575p759399L384742M726487N283508
$$ 431271706 433662262 436127205 442929993 445966568 438207169 441591911 446318398 451601906
3632.8D51601906K620888l51487K964707L867874L139076J423035J790924L194885
$$ 451601906 454222794 453871307 456836014 460703888 463842964 465265999 467056923 470251808
3640.5D70251808L099594K052460J672440L081970L874283N728836J413269k029572
$$ 470251808 473351402 475403862 477076302 480158272 484032555 489761391 491174660 489145088
3648.2D89145088N461807K415314k00195p05986M790230M939155L433380N554200n377999
$$ 489145088 494606895 497022209 496822014 496116028 500906258 505845413 509278793 514832993 509454994
3656.9E09454994J047554O180306K846946K649231P35169K233085K038384J669998
$$ 509454994 510502548 516682854 519529800 522179031 522914200 525147285 527185669 528855667
3664.6E28855667J981926Q45337M841537L832932J057930R74159o457748K390747Q040657
$$ 528855667 530837593 531682930 536524467 540357399 541415329 542389488 535931740 538322487 546363144
3673.3E46363144Q757744J887665j4345398K45132O713371N260811n15404N94635K399369
$$ 546363144 555120888 557008553 542663155 542908287 549621658 554882469 554367065 554961700 557361069
3682E57361069J824188J536217J074447O40869L043023O049461p092896l470993Q919754
$$ 557361069 559185257 560721474 561795921 562436790 565479813 571529274 564436378 560965385 569885139
3690.6E69885139k461280j320420M038048R05190J600074M80309K92053J856346M54369
$$ 569885139 567423859 566103439 570141487 571046677 572646751 573127060 573419113 575275459 575729828
3699.3E75729828K426338L291245l817292k381820L445663J455841O84700J040993
$$ 575729828 578156166 581447411 577630119 575248299 578693962 580149803 580834503 581875496
3707E81875496J931038L124237n853424L300667N920486j2099190L295212M878349
$$ 581875496 583806534 586930771 581077347 584378014 590298500 578199310 581494522 586372871
3714.8E86372871q6288O73790K399597J562653k785454J8883M402923j548843l298378
$$ 586372871 586286583 586960373 589359970 590922623 588137169 588156052 592558975 591010132 587711754
3723.4E87711754M092407J460495n54848k131309j84250L653946J153755M947472j545067
$$ 587711754 591804161 593264656 592709808 590578499 590394249 594048195 595201950 600149422 598604355
3732.1E98604355q754234Q404312L529434r100990m00391K170792L25813J547546L438340
$$ 598604355 589850121 598254433 601783867 592682877 592282486 594453278 594779091 596326637 599764977
3740.8E99764977k712098J290665J0185356p267647j5907440Q483086N939026P073097
$$ 599764977 597052879 598343544 608528900 601261253 585353813 593836899 599775925 606849022
3748.5F06849022j445046j1087684R798736l701057p549820N093269L843880L075790
$$ 606849022 605403976 594316292 604115028 600413971 592864151 597957420 601801300 604877090
3756.2F04877090l989601K604027N457420p466964k274056L305054J286964L89519
$$ 604877090 600887489 603491516 608948936 601481972 599207916 602512970 603799934 604189453
3763.9F04189453L575745j927262m678115L508377N038604Q88634q265533O04515K511062
$$ 604189453 607765198 605837936 601159821 604668198 609706802 610595436 602329903 602934418 605445480
3772.6F05445480L39814J324958j23329J117859J88828K291336O85730o998291K388572
$$ 605445480 605785294 607110252 606986923 608104782 608293610 610584946 611270676 604272385 606660957
3781.3F06660957K036934J89820J351394k514877l85399J255226O21681P52449k22473
$$ 606660957 608697891 608887711 610239105 607724228 607338829 608594055 609215736 609968185 609745712
3790F09745712k68707q621N81970j00060R48487L370323k962418m879226J816024M280777
$$ 609745712 609477005 609468384 610050354 609950294 610898781 614269104 611306686 606427460 608243484 612524261
3799.6F12524261O848069m278412j2075043L225365K800407M157868O539383p881508
$$ 612524261 619372330 615093918 603018875 606244240 609044647 613202515 619741898 611860390
3807.3F11860390o792984M531440L001137R5177m8256o81763O93741N302658Q04138
$$ 611860390 605067406 609598846 612599983 612695160 612646904 611965141 612658882 617961540 618765678
3816F18765678j2499847K168159M977341M949455L353577j5436745j99928M609680
$$ 618765678 606265831 608433990 613411331 618360786 621714363 606277618 606077690 610687370
3823.7F10687370J127930J755333M61311k996559K37122J880684K870025K650986o767082
$$ 610687370 611815300 613570633 614031944 611035385 611272507 613153191 616023216 618674202 611907120
3832.4F11907120R18007P444152n060577k943764P794762n017242m839859O442222
$$ 611907120 612825127 620269279 615208702 612264938 620059700 615042458 610202599 616644821
3840.1F16644821m921226j515999N777397k061691l028260K511216J159629N2224J480865
$$ 616644821 611723595 610207596 615984993 613923302 610895042 613406258 614565887 614618111 616098976
3848.8F16098976p19490J156502N191879m574013L1739j1398888o84357R613991n684
$$ 616098976 615379486 616535988 621727867 617153854 617185593 605786705 605102348 614716339 614710655
3857.5F14710655k179260J870079J953735K327233m659272p08389N650025m335366
$$ 614710655 612531395 614401474 616355209 618682442 614023170 613314781 618964806 614629440
3865.2F14629440m905433L154564M153976O243706m202538r964332K171287N237656
$$ 614629440 609724007 612878571 617032547 623276253 619073715 609109383 611280670 616518326
3872.9F16518326M243507q974762j317291L821220J07918J876450M242096k809296
$$ 616518326 620761833 611787071 610469780 614291000 614398918 616275368 620517464 617708168
3880.6F17708168o738319M291191J542282N30395N267945j0878830j335488L772889
$$ 617708168 610969849 615261040 616803322 617333717 622601662 611722832 610387344 614160233
3888.3F14160233J037712L774604O42548o764641p11746K709656j048241R82590J265678
$$ 614160233 615197945 618972549 619615097 612850456 612138710 614848366 613800125 614782715 616048393
3897F16048393J228791K345924p674751L633499K360534n331687L901329k964821k124176
$$ 616048393 617277184 619623108 611948357 615581856 617942390 612610703 616512032 613547211 611423035
3905.7F11423035L83758N42488K386742L47710j30501k38648L93944J20506l79104
$$ 611423035 611806793 612349281 614736023 615083733 614953232 614714584 615108528 615229034 614849930
3914.4F14849930J146278K925568k231713m880180L476715P80869l846627J280938
$$ 614849930 615996208 618921776 616690063 611809883 615286598 616067467 612220840 613501778
3922.1F13501778K020607J742172j431847l428955M08173J439361J108094p26433l75672
$$ 613501778 615522385 617264557 615832710 612403755 612811928 614251289 615359383 614632950 614257278
3930.8F14257278J723595k469749j523819K066650l07083n837N52140q06389o07262
$$ 614257278 615980873 613511124 611987305 614053955 613746872 613741035 614293175 613486786 612879524
3939.5F12879524J11656K118874J180267l267402j112480Q05053O85616J106224r96590
$$ 612879524 612991180 615110054 616290321 613022919 611910439 612715492 613401108 614507332 613510742
3948.1F13510742K39792J58653j900024J566391P26662q09861M38614L41912l6660
$$ 613510742 613750534 613909187 612009163 613575554 614302216 613492355 613930969 614272881 614236221
3956.8F14236221j159515l20969j6479O22062M80233j653023R689R46389K14805K8877
$$ 614236221 613076706 612755737 612739258 613361320 613841553 612188530 612198219 613144608 613359413 613388290
3966.5F13388290N60685O70967q49839j083412K13280R17282m88815j218682O3744
$$ 613388290 613948975 614619942 613770103 612686691 612899971 613817253 613328438 612109756 612173500
3975.1F12173500J97754k75688J52778Q5907J02158P84683K59361l26461k27051K01874
$$ 612173500 612371254 612095566 612248344 612334251 612436409 613221092 613480453 613153992 612926941 613128815
3984.8F13128815L16772o790K251j99356K69165J60484n29060m89197p706P06444K44369
$$ 613128815 613445587 613438797 613441048 613241692 613510857 613671341 613142281 612653084 612645378 613351822 613596191
3995.4F13596191p54509o68869N34897O33049N5504
$$ 613596191 612841682 612172813 612707710 613340759 613396263
4000.2F13396263
$$ 613396263
##END=$$ End of the data block
