##TITLE=$$ Begin of the data block
##JCAMP-DX=5.00 $$ ACD/SpecManager v 10.08
##SPECTROMETER/DATA SYSTEM=Varian
##DATE=15 Jan 2013 10:39:10
##DATA TYPE=INFRARED SPECTRUM
##DATA CLASS=XYDATA
##ORIGIN=
##OWNER=
##NPOINTS=3735
##FIRSTX=399.26403809
##LASTX=4000.35498047
##MAXX=4000.35498047
##MINX=399.26403809
##MAXY=66.86299896
##MINY=20.12411499
##XFACTOR=1.0000000000
##YFACTOR=0.000000100000000
##FIRSTY=38.49431610
##DELTAX=0.96440572
##XUNITS=1/CM
##YUNITS=TRANSMITTANCE
##XYDATA=(X++(Y..Y))
399.3C84943161j7522469o838302J432037M366951O654396k58064l787994n245858
407C63743858J581841O523361L472443j490326n550156k031975R04961J134605o08520
415.7C67680092J866493Q51898r770126Q207741M902649p027092k581177K709236k385483
424.3C64454231J944618M189568l242187J235008Q28819k483520K28080j173591N63812
433C66544838K320900j029205j508065J869126K30102k67296J960068L22228q60329
441.7C69582367n39780k400436l456345K38037K487526M363060K734757l757286k381478
450.4C66870422K112885J537132k37923j359252o6910J388435j258049r982300q76007
459.1C58128433N218201J855888m029999j928253L016892q56934o57234J416779k792130
$$ y = [384943161, 367420692, 360582390, 362014427, 366381378, 373035774, 372777710, 368989716, 363743858, 365325699, 371849060, 375321503, 373831177, 368281021, 366249046, 367154007, 368288612, 367680092, 369546585, 370398483, 360628357, 368836098, 373738747, 366711655, 364130478, 366839714, 364454231, 366398849, 370588417, 367346230, 368581238, 369410057, 366926537, 367154617, 365981026, 366544838, 368865738, 367836533, 366328468, 368197594, 368427696, 368160400, 370120468, 370442696, 369582367, 369042587, 366642151, 363185806, 363423843, 365911369, 370274429, 373009186, 369251900, 366870422, 368983307, 370520439, 370282516, 368923264, 368856354, 370244789, 368986740, 359004440, 358128433, 363346634, 365202522, 361172523, 359244270, 362261162, 361404228, 360746994, 362163773, 359371643]
467.7C59371643Q59680L202057k62260j71089n565339l997459L343925Q86345J505700
476.4C59173203J101531l443603l644333l089447n12772p7667n4474K722054K822342
485.1C54996834N82886j380234o09703J202354j8577l811455j670532J686172j63727
493.8C50814018K75460p17659m47388O18286O22902k80724j351013J60408j273842
502.5C48420448Q7548K527847J768761o62880j598511J262665j405602l044205j302795
511.1C46053276j251602J37253M01992J802140J512031k465973k709350l29209J77842
519.8C43328400p66335j467361j248017J31836J699715M20761j885910r47075m42657
528.5C38823357O03599K62871r07555M46053Q00705N48591l61175j516953j643600
$$ y = [359371643, 360231323, 363433380, 363171120, 363000031, 357434692, 353437233, 356781158, 357667503, 359173203, 360274734, 356831131, 353186798, 350097351, 349584579, 349506912, 349452438, 352174492, 354996834, 355579720, 354199486, 353589783, 354792137, 354773560, 350962105, 349291573, 350977745, 350814018, 351089478, 350371819, 349924431, 350542717, 351165619, 350884895, 349533882, 349694290, 348420448, 348507996, 351035843, 352804604, 352141724, 350543213, 351805878, 350400276, 347356071, 346053276, 344801674, 344938927, 345340919, 347143059, 348655090, 346189117, 343479767, 343150558, 343328400, 342562065, 341094704, 339846687, 339978523, 341678238, 342098999, 340213089, 339266014, 338823357, 339426956, 339689827, 338782272, 339228325, 340029030, 340577621, 340216446, 338699493, 337055893]
537.2C37055893n24979R22699L68080q468o13518j121025n20783P87659J91345p57866
546.8C35779037K74277k035866j271934P26395l81165N53818L1204n06516m57801q09365
556.5C31902084j838951j639633L43552L58658K78778L24707Q83178m45060J25427
565.1C30292740J540260j672401j284027m3526M50478J124534M7226N96657n73807
573.8C30478134j640320k24571n49049j189995K52609O44493l35960k87438P48368
582.5C27896271J723785P53822J09330m00734j354409r81025m09699O3172l8224J023827
592.1C28386116K006264J072502L59344M84505j28899m07333P36008m70963j620369
600.8C30417175o1187J324615R94072K09198M16069o73408j480752j151313o39839
$$ y = [337055893, 336530914, 337453613, 337821693, 337813225, 337199707, 336078682, 335557899, 336345558, 336536903, 335779037, 336053314, 334017448, 332745514, 333471909, 333090744, 333644562, 333675766, 333169250, 332711449, 331902084, 330063133, 328423500, 328767052, 329125710, 329404488, 329729195, 330612373, 330167313, 330292740, 331833000, 330160599, 328876572, 328833046, 329283524, 330408058, 330455284, 331051941, 330478134, 328837814, 328613243, 328064194, 326874199, 327126808, 327771301, 327435341, 327147903, 327896271, 329620056, 330373878, 330483208, 330082474, 328728065, 327747040, 327337341, 327400513, 327362289, 328386116, 330392380, 331464882, 331824226, 332308731, 332179832, 331772499, 332508507, 332037544, 330417175, 330355988, 331680603, 332674675, 332883873, 333299942, 332626534, 331145782, 329994469, 329354630]
609.5C29354630j99166J69220K32392j99013M11606j147728j732445l49159J0948J256141
619.2C27807426N65224m43382o67305J136589J929054k47345j57966l73345M71001
627.8C30019951J999473K202340J616592M27971J483040Q76617J54953J675186J405068
636.5C41861191J076240J275597J454697J370582O68602J128845J319886Q34961J013908
645.2C52004509O55479L4638J44844R87434J697884J658440O56929j1368J275253J014252
654.8C60118294j122208j973457q45413K32696K2736Q11310R76791J38321N51147j06468
664.5C58803749p85103l52592j318283k726593K389602J904564J811753J686325M16679
673.2C61830101J12495J034050O25115J60942Q75130P54699M93927J509896J279831
$$ y = [329354630, 329155464, 329324684, 329557076, 329358063, 329769669, 328621941, 326889496, 326540337, 326551285, 327807426, 328372650, 327929268, 327261963, 328398552, 330327606, 330080261, 329922295, 329548950, 330019951, 332019424, 334221764, 335838356, 336266327, 337749367, 338625984, 338780937, 340456123, 341861191, 342937431, 344213028, 345667725, 347038307, 347706909, 348835754, 350155640, 350990601, 352004509, 352659988, 352694626, 352839470, 353826904, 355524788, 357183228, 357840157, 357828789, 359104042, 360118294, 358996086, 357022629, 356177216, 356409912, 356432648, 357243958, 358220749, 358359070, 358910217, 358803749, 358018646, 357666054, 356347771, 353621178, 356010780, 357915344, 359727097, 361413422, 361830101, 361942596, 362976646, 363601761, 363762703, 364637833, 365392532, 365886459, 367396355, 368676186]
681.8C68676186J243057J435242K10533Q44917J596832L14484q16155M98085K351113
690.5C76354294J515236Q46176N37338M4556N26619N49125K86408K29L77502R27811
700.2C81965294R45740Q42552L70674M93774Q81348J034813P47070M23546J121788
708.8C88826599J410332K43683l44391O97594M71916k41013K38571P76863J080552
717.5C93160706J122169J482239R18083Q60138K81296q38623L21045J08184L72162
726.2C97787399Q01850J344871K492523Q64220J003494J188202R3193k85530l94287
734.9D04895935J01967l42560o790R06563K164535J710091n0430l27874l94744M61769
744.5D09118462N38406L00026n51186J69792K231293J348534J253815L14674p58438
$$ y = [368676186, 369919243, 371354485, 371565018, 372409935, 374006767, 374321251, 373505096, 374003181, 376354294, 377869530, 378715706, 379253044, 379297600, 379824219, 380373344, 380659752, 380659981, 381037483, 381965294, 382911034, 383753586, 384124260, 384618034, 385499382, 386534195, 387281265, 387704811, 388826599, 390236931, 390480614, 390136223, 390833817, 391305733, 391064720, 391303291, 392080154, 393160706, 394282875, 395765114, 396683197, 397543335, 397824631, 396986008, 397307053, 397415237, 397787399, 398589249, 399934120, 402426643, 403290863, 404294357, 405482559, 405575752, 405290222, 404895935, 404997902, 404655342, 404648552, 405555115, 407719650, 409429741, 409379311, 409051437, 408656693, 409118462, 409656868, 409956894, 409405708, 409575500, 411806793, 413155327, 414409142, 414723816, 413965378]
753.2D13965378K5406P61413J034851Q27103J430054J050110J573982K103538J646576
761.9D24418411J413689M13589K17743l03535M33769Q08220K14615P86857P51076M99687
771.5D29654121K33040K39411p63131m42543N86701L3455L92647M66919O64100N42069
781.2D31606789q1520j80703j48124r2278N22652J082802M17327M85001M10729L99665
790.8D34422340o14967j176376M71382J24702J27831M5204j84021k19231j005287p16019
800.5D31275558j351623j842079j076126m34647j371040j164971J82610o39038j720772
809.1D21857872j988678j270103j761055j934433j406975j627541l56636K68936j71890
817.8D11609497o97479j86577N59578R4681J23672Q50792K240563J791572R05419J543388
$$ y = [413965378, 413990784, 414752197, 415787048, 416614151, 418044205, 419094315, 420668297, 422771835, 424418411, 425832100, 426245689, 426463432, 426159897, 426593666, 427401886, 427616501, 428403358, 429154434, 429654121, 429887161, 430126572, 429363441, 428920898, 429507599, 429541054, 429933701, 430400620, 431064720, 431606789, 431525269, 431344566, 431196442, 431104164, 431626816, 432709618, 433126945, 433611946, 434022675, 434422340, 433807373, 432630997, 433102379, 433227081, 433354912, 433400116, 433216095, 432996864, 431991577, 431275558, 429923935, 428081856, 427005730, 426571083, 425200043, 424035072, 424217682, 423578644, 421857872, 419869194, 418599091, 416838036, 414903603, 413496628, 411869087, 411512451, 411781387, 411609497, 410912018, 410725441, 411285019, 411379700, 411503372, 412354164, 414594727, 416386299, 417291718, 418835106]
827.5D18835106K775001M573441M114571K561721R66759O58379K322578K763252J898308
836.1D41469116J786614K821426L290749K682495Q34007N34554J384658J166344Q18367
844.8D56788330N09338J125145J633721J620445J132813J994628J571885M73175J201477
853.5D68050957J11923J661606K455940J537666J799584J025772J169700Q27866J374397
862.2D80015411O40602m89730l26767M84390J007309q32291n46684q64677j023331
870.9D78064232j148644j576347m21982m57840l71017j347695q23822n64918j129036
879.5D70222931j417770j988526j084900j681709l67394L08533j37329J37100r8686
888.2D63892250K97775j487503j296959n39360l9711J239891J147232R87664Q26034
$$ y = [418835106, 421610107, 426183548, 430298119, 432859840, 433826599, 434484978, 436807556, 439570808, 441469116, 443255730, 446077156, 449367905, 452050400, 452884407, 453418961, 454803619, 455969963, 456788330, 457297668, 458422813, 460056534, 461676979, 462809792, 464804420, 466376305, 466849480, 468050957, 468162880, 469824486, 472280426, 473818092, 475617676, 476643448, 477813148, 478641014, 480015411, 480656013, 480166283, 479839516, 480323906, 481331215, 480498924, 479952240, 479087563, 478064232, 476915588, 475339241, 474917259, 474459419, 474088402, 472740707, 471916885, 471351967, 470222931, 468805161, 466816635, 465731735, 464050026, 463682632, 463991165, 463853836, 463990936, 463892250, 464190025, 462702522, 461405563, 460866203, 460826492, 462066383, 463213615, 464201279, 465027313]
896.9D65027313J857262O27022q86650r04046q67576n62515j80664J480407J947556
905.6D67538109K710914K905007L011665K054672k85377k39754j193085q60404q72612
914.3D74769135o10810k01683j316643j037292k195091k464714l263016m108925l990746
922.9D55580215l962173k894020k291718k051429l310357l015632k268067k663879
930.7D33122940k937851l016014k202034k299004m53758N62973j85318K4452p21092
939.3D21895294p66945j314659j569900j007271j123238j250381m85306K68745l34396
948D14311943K8572L91960p8125j038398j499253q36334p95174j192932j712494j360511
957.7D06219254j344223j770440k748985k876587j628837k069207j697998j376571
$$ y = [465027313, 466884575, 467511597, 466624947, 465720901, 464853325, 464290810, 464110146, 465590553, 467538109, 470249023, 473154030, 476165695, 478220367, 477934990, 477695236, 476502151, 475641747, 474769135, 474158325, 473956642, 472639999, 471602707, 469407616, 466942902, 463679886, 459570961, 455580215, 451618042, 448724022, 446432304, 444380875, 441070518, 438054886, 435786819, 433122940, 430185089, 427169075, 424967041, 422668037, 422214279, 422777252, 422591934, 422616386, 421895294, 421128349, 419813690, 418243790, 417236519, 416113281, 414862900, 414377594, 414646339, 414311943, 414340515, 414732475, 414654350, 413615952, 412116699, 411280365, 410485191, 409292259, 407579765, 406219254, 404875031, 403104591, 400355606, 397479019, 395850182, 393780975, 392082977, 390706406]
965.4C90706406j583290j384163j771050j530151j713982k591057l130111k411614
973.1C74590988k615051l621903l143043k362518k640229m581833n250701m704819
980.8C45670891m490776m126816m439087m422798l798828l622475l237686l304958
988.5C14227467m196663m509182l739338k783661k995796l228054l173771k305641
996.2B87295361j492310k207375l189907l680610k452088k444820k452698j622734
1004B67752819j745605p82929r88960j479168j626434j012707j047459k132015j573219
1012.6B55364323j703492j511097j577358j670360j894532j998386j240044j832351
1020.3B41936703j930638k100410j721459j730136r70765o50596j532002j02558q33931
$$ y = [390706406, 389123116, 387738953, 385967903, 384437752, 382723770, 380132713, 377002602, 374590988, 371975937, 368354034, 365210991, 362848473, 360208244, 355626411, 350375710, 345670891, 341180115, 337053299, 332614212, 328191414, 324392586, 320770111, 317532425, 314227467, 310030804, 305521622, 301782284, 298998623, 296002827, 292774773, 289601002, 287295361, 285803051, 283595676, 280405769, 276725159, 274273071, 271828251, 269375553, 267752819, 266007214, 265224285, 264235325, 262756157, 261129723, 260117016, 259069557, 256937542, 255364323, 253660831, 252149734, 250572376, 248902016, 247007484, 245009098, 243769054, 241936703, 240006065, 237905655, 236184196, 234454060, 233483295, 232832699, 231300697, 231198139, 230364208]
1029B30364208j120395j468850j433372m71058n38292P51953k79083J65386J022892
1037.7B26993389Q20637J074924J122685J614265L61023K60506J10187M05846K52819
1046.4B33016281r92679l30563J05801q3256j381111j659813j542206n77793q09250
1055.1B25745411j740971k20699j69678J295052J249809J303063J386241K15283J846352
1063.7B30909863J810379J472225J143074J697426J101684N89295J472473M10385J024189
1072.4B41630993L60432L16543M46873o5727J174011J179008P06501j46961L33729
1081.1B45935402M56047R65576J037808K78663J192723J594314K112789J265984J701126
1089.8B56540432J542511Q24146J379032O68736J161995J157627K382870K598877R38816
$$ y = [230364208, 229243813, 227774963, 226341591, 225870533, 225332241, 226084194, 225805111, 225970497, 226993389, 227814026, 228888950, 230011635, 231625900, 231986923, 232247429, 232357616, 232763462, 233016281, 232023602, 231693039, 231798840, 231715584, 230334473, 228674660, 227132454, 226554661, 225745411, 224004440, 223783741, 223614063, 224909115, 226158924, 227461987, 228848228, 229063511, 230909863, 232720242, 234192467, 235335541, 237032967, 238134651, 238723946, 240196419, 240606804, 241630993, 241991425, 242307968, 242754841, 242689114, 243863125, 245042133, 245748634, 245601673, 245935402, 246391449, 247357025, 248394833, 248673496, 249866219, 251460533, 253573322, 254839306, 256540432, 258082943, 258907089, 260286121, 260954857, 262116852, 263274479, 265657349, 268256226, 269195042]
1098.5B69195042N03101J027431J949425R37481R42021J201591J606903J183701J028900
1107.1B79575596K462673J403122O52599m34951r3251O99005L06549J241360R10969
1115.8B86723671J096134O32286J74179O00605N00889m74777j626339j69735N29137
1124.5B87986050R53235R54380Q77400J982822J372700R61494J310845J673012J490879
1133.2B99562817J418171J362419J757984K307777J818810K371082K235718J643219
1140.9C14477997J085357K50378M40464Q70705J131325P29446M85592N36823M53720
1149.6C20461807K95067K56195R422n81932k16331k46277l64551k88315j79825J3447
1159.2C19158707p42550m48952k56653n35240q9645R36908J586037J227722J940308
$$ y = [269195042, 269698143, 270725574, 272674999, 273612480, 274554501, 275756092, 277362995, 278546696, 279575596, 282038269, 283441391, 284093990, 283659039, 283565788, 284264793, 284571342, 285812702, 286723671, 287819805, 288452091, 288626270, 289226875, 289727764, 289252987, 287626648, 287456913, 287986050, 288939285, 289893665, 290771065, 292753887, 294126587, 295088081, 296398926, 298071938, 299562817, 300980988, 302343407, 304101391, 306409168, 308227978, 310599060, 312834778, 314477997, 315563354, 315813732, 316254196, 317124901, 318256226, 318985672, 319471264, 320008087, 320461807, 320756874, 321013069, 321022491, 320440559, 320224228, 319977951, 319613400, 319325085, 319145260, 319158707, 318416157, 317967205, 317710552, 317175312, 317085667, 318022575, 319608612, 320836334, 322776642]
1167.9C22776642K148399K144356K303658J937408K187271K365074K449227K679901
1175.6C40991936K564583K369346K473374K214698J783867J522331J606141J527214
1183.3C57053490J127052J146584J147804J064682J105461P71027O7367m21867p61948
1192C62299652q01697p50999j52435k94648j120720p35740r00765q27751j175957k139740
1201.6C53399200j532898r57870o73141o35148q64791o56243l90968m45862n62782
1210.3C46679497m18587o46286o83250m00086n46875n07469k18887r6245k72598m13819
1220C42475395l55568l29017n01213q78144o16264j47972j09673l73916j018296q67805
1229.6C37277527m74892q27980j145019r40705l00827k89535l57514k53486l68004
$$ y = [322776642, 324925041, 327069397, 329373055, 331310463, 333497734, 335862808, 338312035, 340991936, 343556519, 345925865, 348399239, 350613937, 352397804, 353920135, 355526276, 357053490, 358180542, 359327126, 360474930, 361539612, 362645073, 363416100, 363483467, 363061600, 362299652, 361497955, 360746956, 360594521, 360299873, 359179153, 358443413, 357542648, 356714897, 355538940, 353399200, 351866302, 350908432, 350235291, 349600143, 348735352, 348079109, 347688141, 347242279, 346679497, 346260910, 345614624, 344931374, 344531288, 343984413, 343476944, 343258057, 343161812, 342889214, 342475395, 342119827, 341790810, 341289597, 340411453, 339795189, 339647217, 339537544, 339163628, 338145332, 337277527, 336802635, 335974655, 334829636, 333888931, 333588104, 333298569, 332941055, 332687569, 332319565]
1238.3C32319565k91825n49201n99366l21769k30103m34303m61083j38778J45645k0561
1247.9C29418221o87981l30696k38266q63724m52080L39127L35502k09426M0855J57700
1257.6C27509232K02789R8648m99420m74091k94876L5286J08757N85747J153107J065597
1267.2C29490776R40361O64177N36995L16582N80825O86379P59354J048317R06372
1275.9C35930138J291351J622734J359329O34651N63355J001358J047401J255951J533509
1284.6C46239777J587944J608619J956101J660194J028290J038513J159363Q21571
1292.3C57100372P64733Q05282P76024J197052J148758J200676J040497N77621K33383
1301C64844398j96800j97906O1569L24402J08757K86560L84788M7226j35498n29365
$$ y = [332319565, 332027740, 331478539, 330879173, 330557404, 330327301, 329892998, 329431915, 329293137, 329438782, 329418221, 328730240, 328399544, 328161278, 327297554, 326845474, 327184601, 327520103, 327310677, 327351532, 327509232, 327712021, 327810669, 327311249, 326837158, 326542282, 326577568, 326686325, 327272072, 328425179, 329490776, 330431137, 331095314, 331632309, 331948891, 332529716, 333216095, 333975449, 335023766, 335930138, 337221489, 338844223, 340203552, 340838203, 341401558, 342402916, 343450317, 344706268, 346239777, 347827721, 349436340, 351392441, 353052635, 354080925, 355119438, 356278801, 357100372, 357865105, 358670387, 359446411, 360643463, 361792221, 362992897, 364033394, 364611015, 364844398, 364647598, 364449692, 364511261, 364835663, 364944420, 365230980, 365615768, 365662994, 365527496, 364998131]
1310.6C64998131p26090p49588m34036l00407j0758M7226L7575N98411P22847Q72956
1320.3C65056267O55823O18286N20553L82958P71599O37626M21257q0299L3340p4310
1329.9C68943100k84767q8082l20892k73666l88108Q9226k55470l60107M25987k7733
1339.6C67459488J74408L62816P82127L73879J10931J042366Q49419N22232R9754R7160
1349.2C71874580l4790R0256j24931q43773m48761R8038O37893Q087k57568m31671
1358.8C70567360o40831p89871j120491p5913p22770j49575K50130k89192j22376p01942
1368.5C66204529n57213o61469q13522k85454L80249J43128n10254L07541R4986L00483
1378.1C64603004j95465o17599m84963r52987j186486j502647r54285o57577n52063
$$ y = [364998131, 364272041, 363522453, 363088417, 362788010, 362777252, 362824478, 362862053, 363460464, 364183311, 365056267, 365712090, 366330376, 366850929, 367233887, 368005486, 368643112, 369064369, 368984070, 369017410, 368943100, 368658333, 368570251, 368249359, 367975693, 367587585, 367676811, 367421341, 367061234, 367487221, 367459488, 367633896, 367996712, 368778839, 369152718, 369263649, 370306015, 371155434, 371677666, 371777420, 371874580, 371839790, 371930046, 371805115, 370961342, 370512581, 370610619, 371248512, 371256599, 370999031, 370567360, 369926529, 369136658, 368016167, 367940254, 367217484, 367067909, 367318039, 367028847, 366906471, 366204529, 365647316, 364985847, 364172325, 363886871, 364267120, 364410248, 363899994, 364207535, 364302521, 364603004, 364407539, 363789940, 363304977, 362351990, 361165504, 359662857, 358708572, 358050995, 357498932]
1386.8C57498932j379776j145744n41230j494026j514816j469956j431694k734565
1394.5C45787125k655487r08318j433182j142235k092742j994095j402130j854897
1402.2C32304039j640701j505051j950760j949539q87184r68094j517525j490669j299095
1410.9C19095421q10356j135331n88722m64534j076661o53934q04157o9390j006870
1419.6C12485466M9458J320476L73440N13859N2204M45366O49357K96573R82475R87473
1429.2C18156147J015835P00645J438675J111756J093750J888809J539802Q22640N33180
1437.9C28301239K193718J310501P91054J174393J008453J527557R77478J460915J188049
1446.6C39933357Q38509M86412J152687J409073M91600J229133N49317J348114R62334
$$ y = [357498932, 356119156, 354973412, 354432182, 352938156, 351423340, 349953384, 348521690, 345787125, 343131638, 342223320, 340790138, 339647903, 337555161, 335561066, 334158936, 332304039, 330663338, 329158287, 327207527, 325257988, 324370804, 323402710, 321885185, 320394516, 319095421, 318285065, 317149734, 316561012, 316096478, 315019817, 314365883, 313561726, 313492336, 312485466, 312534924, 313855400, 314228840, 314742699, 314794903, 315240269, 315889626, 316186199, 317168674, 318156147, 319171982, 319872627, 321311302, 322423058, 323516808, 325405617, 326945419, 327768059, 328301239, 330494957, 331805458, 332596512, 333770905, 334779358, 336306915, 337284393, 338745308, 339933357, 340771866, 341258278, 342410965, 343820038, 344311638, 345540771, 346090088, 347438202, 348400536]
1455.3C48400536L01933K749557N65300K564164O94732J688156J255608R37004K060204
1464C61217194O70089K775765K405052K435722K179680K319031K656250J552505L028794
1472.6C81240082J956253K405510K641029K721405K731972K448234K359467J854286
1480.3D00358238J913567J581650J613464J509323J279984J492309J403313M57878
1488.1D11609726O07033O61888l67737l31421k44369p68433r39789q12378l291893
1496.7D06122627l19481j139068k627945j14289o56852j521034j489373k17743o78749
1505.4C97358093k351570n42374j737480n92880l60870Q16002j030922j483536O5918
1514.1C90140381k96326m2534j850815k257614N09034P22503j397629j091728Q95462
$$ y = [348400536, 348702469, 351452026, 352017326, 354581490, 355276222, 356964378, 358219986, 359156990, 361217194, 361887283, 364663048, 367068100, 369503822, 371683502, 374002533, 376658783, 378211288, 381240082, 383196335, 385601845, 388242874, 390964279, 393696251, 396144485, 398503952, 400358238, 402271805, 403853455, 405466919, 406976242, 408256226, 409748535, 411151848, 411609726, 412216759, 412878647, 412510910, 412179489, 411935120, 411166687, 410226898, 409414520, 406122627, 405803146, 404664078, 402036133, 401921844, 401264992, 399743958, 398254585, 398036842, 397358093, 395006523, 394464149, 392726669, 392133789, 391772919, 392588921, 391557999, 390074463, 390140381, 389844055, 389801521, 387950706, 385693092, 386202126, 386924629, 385527000, 384435272, 385330734]
1522.8C85330734Q73795J927795j53465j68762N89065M34265J011391P59010L09143
1531.5C90912971J37063Q46710r57489J272354J557655P83501J509056r15718k907410
1540.1C92238693R35021J642990P45849J469880J038131q16078J401863O13709R24072
1548.8D00194130j30425r95140J093712K72560J045876q74138K02904J366958J051255
1557.5D03227692J9683m736595j316948j020279O42357o66656q64563k326317k438774
1566.2C90519600o35147j643181o82716o272469k313004j926574l442040k636909k442742
1574.9C68524818q91532j0829621j782532k089500l337212l521919m873695l375130
1582.6C37823677n270424l353386m367981l862457l931923m188900k684097n172310
$$ y = [385330734, 386204529, 388132324, 387978859, 387810097, 388399162, 388833427, 389844818, 390603828, 390912971, 391050034, 391896744, 390939255, 392211609, 393769264, 394552765, 396061821, 395146103, 392238693, 393173714, 394816704, 395562553, 397032433, 398070564, 397254486, 398656349, 399270058, 400194130, 400063705, 399068565, 400162277, 400434837, 401480713, 400606575, 400809479, 402176437, 403227692, 403247375, 398510780, 397193832, 396173553, 396815910, 396149254, 395284691, 392958374, 390519600, 389884453, 388241272, 387558556, 381286087, 378973083, 377046509, 373604469, 370967560, 368524818, 367633286, 356803665, 355021133, 352931633, 349594421, 346072502, 341198807, 337823677, 332553253, 329199867, 324831886, 320969429, 317037506, 312848606, 310164509, 304992199]
1590.3C04992199k944260m850444k974091l538189m330502k386055m229602j977063
1598B77761993m395198k354527k856255k372283j740513l756237r71661k820835o53381
1606.7B55841103k578659j242886j114101k376996K37828k298641J43737j820793L66154
1615.4B45156746M58240m653682J303825j003570J287403j078968J086196J83335j619835
1624B41119690J539421q3790K053337q27350J160965K72255Q11100J132316m4002K364692
1633.7B49498634M86527L256092j426411K108097J071453O17981K252617J11523J906433
1642.4B59882946K72179J904144J252632r1019L193608o45485K525272K13185K151317
1651B70658779Q83866m211960K138977J320190L537331M56180J969185O22502J120567
$$ y = [304992199, 302047939, 297197495, 294223404, 290685215, 286354713, 283968658, 279739056, 277761993, 273366795, 271012268, 268156013, 265783730, 264043217, 260286980, 259315319, 256494484, 255841103, 253262444, 252019558, 250905457, 248528461, 248766289, 246467648, 246611385, 244790592, 245156746, 245614986, 240961304, 242265129, 241261559, 242548962, 241469994, 242556190, 242739525, 241119690, 242659111, 242575321, 244628658, 243801308, 244962273, 245234528, 246045628, 247177944, 247133942, 249498634, 249985161, 253241253, 251814842, 253922939, 254994392, 255612373, 257864990, 257976513, 259882946, 260155125, 262059269, 263311901, 263220882, 266414490, 265769005, 268294277, 268507462, 270658779, 271542645, 267330685, 269469662, 270789852, 274327183, 274783363, 276752548, 277375050, 278495617]
1659.7B78495617J667480J334324K456932n05714L113136J781121K583847K606353
1667.4B93533096K021637L438511P54128L887100J619472L096047K950516K845687
1675.1C14146194L019410K520084M535198K984810M144821L119126M461021N246506
1682.9C44177170K009773M760094J377830N623665M449463M392281M735794M112854
1690.6C75638924M843902M169693M962654M501877M497185L274612N758858O280785
1698.3D13928490N925102M803886j147918P008056N283890M235573L636551L683014
1706D47356644L310356L326530M405518K841263K118148K763596K924576K812347J311188
1714.7D73170166J562042L675537L079834l652649K737732L689309K381515J833344
$$ y = [278495617, 280163097, 281497421, 283954353, 283448639, 286561775, 288342896, 290926743, 293533096, 295554733, 298993244, 299747372, 303634472, 305253944, 308349991, 311300507, 314146194, 317165604, 319685688, 324220886, 327205696, 331350517, 334469643, 338930664, 344177170, 346186943, 350947037, 352324867, 357948532, 362397995, 366790276, 371526070, 375638924, 380482826, 384652519, 389615173, 394117050, 398614235, 401888847, 407647705, 413928490, 419853592, 424657478, 423509560, 430517616, 435801506, 440037079, 443673630, 447356644, 450667000, 453993530, 458399048, 461240311, 463358459, 466122055, 469046631, 471858978, 473170166, 474732208, 478407745, 481487579, 477834930, 480572662, 484261971, 486643486, 488476830]
1722.4D88476830J026420J297341J912231J821861J273041J465340K232513O59218
1730.1E00164795N57556K965775L049354o01501k517968M455033M306564K085343K337608
1738.8E16802559P29027l73345M050980L120804J479606K253991L545379L223648K776108
1747.5E37608757L770523K253532M183655K727623J256905M181175L050957L387108
1755.2E62420235L338241J096649K493325L139724K569619L265190K55241M26216L484040
1763.9E82488480K326507K037506K144852J946831j047020J922493L971901K28004
1771.6E96019554j019668O6337M155579K485847J26000K331047P06138J438485O90078
1780.3F06999397k41089J652565J736641J578904p3204M36744J278229J166229J060600
$$ y = [488476830, 489503250, 490800591, 492712822, 494534683, 495807724, 497273064, 499505577, 500164795, 500722351, 503688126, 506737480, 506135979, 503618011, 508073044, 512379608, 514464951, 516802559, 517531586, 517158241, 521209221, 524330025, 525809631, 528063622, 531609001, 534832649, 537608757, 541379280, 543632812, 547816467, 550544090, 551800995, 555982170, 559033127, 562420235, 565758476, 566855125, 569348450, 572488174, 575057793, 578322983, 578578224, 579004440, 582488480, 584814987, 586852493, 588997345, 590944176, 589897156, 591819649, 595791550, 596019554, 594999886, 595066223, 599221802, 601707649, 601833649, 604164696, 604870834, 606309319, 606999397, 606758308, 608410873, 610147514, 611726418, 611653214, 612089958, 613368187, 614534416, 615595016]
1788.9F15595016J706162Q77876N89562l03345n64957L114472J242637k15263J149979
1797.6F23192139J786346P11022j045800J940041N10902P37839J415405P15752J464157
1806.3F31427803N99213M58946O91070J144066l23410N92766J440697O20842J146698
1815F37798691K12288R94987K94991K91939P86056O2637R77478N7450J100235J027679
1824.6F43604431j576691L58887K003403J934357N79681j969604k19422J868134M02069
1833.3F46985245K39486P00989P66983P52945m02603Q70590J19095K49786L63541J355667
1842.9F52001724J636200l898163J464157J784058L91083L8833J62659Q21610o409
1851.6F54395752R12628K29645J83105L47138L32336N65796r9945N00565j43738J21384
$$ y = [615595016, 617301178, 618179054, 618768616, 618465271, 617900314, 621014786, 622257423, 622042160, 623192139, 624978485, 625689507, 624643707, 626583748, 627094650, 627832489, 629247894, 629963646, 631427803, 632027016, 632485962, 633177032, 634321098, 633997688, 634590454, 636031151, 636651993, 637798691, 638010979, 639005966, 639300957, 639592896, 640378952, 640441589, 641419067, 641476517, 642576752, 643604431, 642027740, 642386627, 644390030, 646324387, 646904068, 644934464, 644715042, 646583176, 646985245, 647224731, 647925720, 648692703, 649445648, 649043045, 649913635, 650032730, 650282516, 650646057, 652001724, 653637924, 649739761, 651203918, 652987976, 653379059, 653417892, 653580551, 654402161, 654395752, 655308380, 655538025, 655721130, 656068268, 656400604, 656966400, 656866455, 657367020, 657223282, 657344666]
1861.3F57344666n6458N07202P06024P2632N81589j2207J119842r15374j092911R79385
1870.9F59234390P77588P45850j06659M30984j87988L22113L92456j6632K47803k68479
1880.6F61571426P66297J55258L76282L63464K55890L69415k75268P97500k08664j174850
1890.2F62996750o1875Q03910L33633K93732M66919o67572N71670J32904J81199P019
1899.8F65058289j37787N36346l7460P05795o3324J72653K55051j83487J99127j79748
1909.5F66325455l15018n77240P86057L28064L85437L57284N9280J280671j194916
1918.2F67435074o52313M71954P2174O8665m45557J50299M07410R30099J18790j5564
1927.8F68541031m34189n98984J51596K3651L57285k19650K39181j16729m1810L21198
$$ y = [657344666, 657288208, 657795410, 658501434, 658574066, 659155655, 659143448, 660263290, 659347916, 658255005, 659234390, 660011978, 660757828, 660651169, 661082153, 660894165, 661216278, 661608734, 661592102, 661839905, 661571426, 662337723, 662492981, 662869263, 663232727, 663488617, 663858032, 663582764, 664380264, 664171600, 662996750, 662934875, 663738785, 664072418, 664366150, 664833069, 664165497, 664737167, 664870071, 665051270, 665058289, 664920502, 665456848, 665419388, 666125183, 666061859, 666234512, 666489563, 666306076, 666505203, 666325455, 666010437, 665433197, 666219254, 666547318, 666932755, 667290039, 667349319, 668629990, 667435074, 666782761, 667254715, 667326889, 667395554, 666949997, 667100296, 667507706, 668437805, 668556595, 668541031, 668106842, 667507858, 667659454, 667683105, 668040390, 667820740, 668059921, 667943192, 667901382, 668222580]
1937.5F68222580j43814K28348n15595M05274k84424q92258P81479N03235J9150n51682
1947.1F67772293L36609L01285j10626o27289m91944L43018J80283K41928l82386K71225
1956.7F67834396K9221q6975J86310m12140Q6975m29459m3335p2021L34625P60956
1966.4F68188553k53143j45569k55890N2872l68500q9722j59912k33994P52716l3416
1976F67453995j28021J38092L59954j57013l51867k98996m41971J61514k76794K289
1985.7F66461182j47858J58081N1727l01437O60019q1329n12619n75943L0670N4931
1995.3F65797424N3864J32828o04554K33841j37634J38016J61209j81427o3095o94809
2005F64835663Q5678j37253j71738o9427J91193J76086m42276j47858l78341J60293
$$ y = [668222580, 668078766, 668307114, 667791519, 668196793, 667912369, 667020111, 667801590, 668304825, 668323975, 667772293, 668108902, 668410187, 668299561, 667672272, 667180328, 667523346, 667703629, 667945557, 667563171, 667834396, 667863617, 667776642, 667962952, 667550812, 667637787, 667208328, 667164993, 667092972, 667427597, 668188553, 667935410, 667789841, 667533951, 667586823, 667218323, 667128601, 666968689, 666734695, 667487411, 667453995, 667325974, 667464066, 667824020, 667667007, 667315140, 667016144, 666574173, 666735687, 666458893, 666461182, 666313324, 666471405, 666523132, 666221695, 666881714, 666800385, 666287766, 665711823, 665742493, 665797424, 665851288, 665984116, 665379562, 665613403, 665475769, 665613785, 665774994, 665593567, 665530472, 664835663, 664921341, 664784088, 664612350, 664542923, 664734116, 664910202, 664467926, 664320068, 663941727, 664102020]
2014.6F64102020j74103r4451k58561p84149J64032L891O3172j14975L55148J34354
2024.2F63396378n06592l33405m82635J00326j69983o0043k18277j31378q1482k30713
2033.9F61282196K70081l51868o4163l15476o2942k20261o46362J40915k05002K13394
2043.5F60040512p8812K37885k3727l79334L46069m58068l51792m39834K34069J97220
2053.2F59324188k16675J59913k61460n3253m33426Q9722n7602k27051j1063o3552
2062.8F58249741L01590o82450j52m425j18561K69699l59879k06146k34070K23542
2072.5F57438889p8660k29263l29284J01547O48956j16196k9754l11127O9275m6921
2082.1F57117462j95541k73514m09622L62472m53033k12174j07345L0441Q0414n13001
$$ y = [664102020, 663927917, 663833466, 663574905, 662790756, 662954788, 662958679, 663021851, 662906876, 663262024, 663396378, 662889786, 662556381, 662073746, 662174072, 662004089, 661944046, 661725769, 661594391, 661512909, 661282196, 661552277, 661200409, 661136246, 660820770, 660757828, 660537567, 659891205, 660032120, 659827118, 660040512, 659961700, 660199585, 660175858, 659796524, 660142593, 659684525, 659332733, 658892899, 659126968, 659324188, 659107513, 659267426, 659005966, 658952713, 658519287, 658609009, 658551407, 658324356, 658313293, 658249741, 658551331, 657868881, 657868729, 657864304, 657745743, 658015442, 657655563, 657449417, 657215347, 657438889, 657360229, 657130966, 656801682, 656903229, 657552185, 657435989, 657406235, 657095108, 657164383, 657117462, 656921921, 656648407, 656238785, 656601257, 656148224, 655936050, 655828705, 655859146, 655939560, 655426559]
2091.7F55426559P2403k31247r0103j23672O1493o7139k47192k8305l70179L15400
2101.4F54718018r3842j61209m37241m33197R4834m77143N6076o0119n875j31225k83051
2112F52786026q5449k7848K06452m30374l5095p0649l65600m82331j4877L41416j80130
2122.6F51641541M60052K6779k04239m70733k52381N7526n48859J63040P6142J32675
2132.3F51081543k26288K93884O54831m39987j35879l41339k41166l69186J24359K38876
2141.9F50639648N265M25262k02255M46243J3275j71890p3776n60455j35270r1018
2151.5F50295029K16140j49688O01654N26962r3079J22910k97928q0871m44718j7776
2161.2F50678635j08185J27258L37982l33786K94419J02844J48773k84347k56730o4392
$$ y = [655426559, 655498962, 655267715, 655177612, 655053940, 655115433, 655048294, 654801102, 654772797, 654402618, 654718018, 654624176, 654462967, 654025726, 653592529, 653687363, 653210220, 653266296, 653206177, 653200302, 653069077, 652786026, 652700577, 652672729, 652879181, 652448807, 652413712, 652343063, 651977463, 651495132, 651480255, 651821671, 651641541, 652101593, 652128372, 651924133, 651453400, 651201019, 651258545, 650709686, 650872726, 650948868, 651081543, 650855255, 651149139, 651803970, 651363983, 651228104, 650886765, 650645599, 650276413, 650400772, 650639648, 650644913, 651070175, 650867920, 651314163, 651327438, 651155548, 651081772, 650521317, 650386047, 650295029, 650511169, 650361481, 650963135, 651490097, 651397018, 651519928, 651222000, 651141129, 650696411, 650678635, 650570450, 650697708, 651035690, 650701904, 650996323, 651099167, 651247940, 650963593, 650706863, 650642471]
2170.8F50642471M959L67432k76108J48773l50799N7831N52520N3864n3406n30548
2180.5F50616989K84195J64719K86102J16119j31530L04412K7237K41852m13055k23541
2190.1F51273499j07422P4386J42136l24402M88434K25220J8997j85013o10J29928
2199.8F51735153m0359m120k81296M57230J40991L7002j87988j43661K76642m58069
2209.4F51531525p4540O2943M96750L91846J22222J85853k50474j26495k27127N9052
2219F52171555m01078j49307P2403J87912N15366k72980M14963j60523n27038J09558
2228.7F51960831J85013j57395r28650L8910L65067N07812L14484J77536J25656m55093
2238.3F52134171l8224o08139l50723l9825K53143L54996l09906K33078J31378M5547
$$ y = [650642471, 650647430, 651014862, 650738754, 650887527, 650536728, 650594559, 651147079, 651200943, 651147537, 650616989, 650901184, 651065903, 651352005, 651468124, 651336594, 651641006, 651668243, 651910095, 651497040, 651273499, 651166077, 651240463, 651382599, 651058197, 651546631, 651771851, 651790848, 651605835, 651605225, 651735153, 651694794, 651690674, 651409378, 651866608, 652007599, 652044601, 651856613, 651712952, 651989594, 651531525, 651456985, 651519928, 652016678, 652408524, 652530746, 652716599, 652466125, 652339630, 652112503, 652171555, 651770477, 651621170, 651693573, 651881485, 652396851, 652123871, 652538834, 652378311, 651851273, 651960831, 652145844, 651988449, 651059799, 651098709, 651463776, 651971588, 652286072, 652463608, 652589264, 652134171, 652095947, 651487808, 651137085, 651097260, 651350403, 651705399, 651395493, 651628571, 651759949, 651805496]
2248F51805496r6435M2343m89197p71408J45493K64663N53208J83868N57327o9656
2257.6F52125702p22809L738m08020l36990l53012L82385L68500K4414J71127J55259
2267.3F51410294L10287o21185k53906m16337j39999K84348k99912K3346j85547L44010
2276.9F50455399p8659r9259J77994j78147j71508r32236k67639J25580J82724j99280
2286.5F49014969j05133L55911k17895N2185n45197M5700J33133m43191K76489K53830
2296.2F48820801L2577p28759k08512k30560l47595j18637k12174M40140k56500L0288
2305.8F47221069l42712o43616m3335j03760M57764j9684k3498o51016q58689j4725
2315.5F44977798M41132L77808n25437r079j71737o80085q66241J33972N22080n24292
$$ y = [651805496, 651709061, 651751404, 651262207, 650490799, 650636292, 650900955, 651454163, 651638031, 652195358, 652125702, 651402893, 651406631, 650998611, 650661621, 650308609, 650690994, 651059494, 651083908, 651255035, 651410294, 651720581, 651099396, 650845490, 650429153, 650289154, 650573502, 650273590, 650296936, 650111389, 650455399, 650376740, 650277481, 650455475, 650277328, 650105820, 649173584, 648905945, 649031525, 649214249, 649014969, 648909836, 649265747, 649047852, 649100037, 648554840, 648600540, 648733673, 648290482, 648566971, 648820801, 648853378, 648124619, 647916107, 647685547, 647337952, 647219315, 647007141, 647447281, 647190781, 647221069, 646878357, 646234741, 646191406, 646087646, 646545410, 646525726, 646502228, 645851212, 644992523, 644977798, 645418930, 645796738, 645271301, 645262222, 645090485, 644410400, 643544159, 643678131, 644200211, 643675919]
2325.1F43675919O2637k92740k42004j46332J78299r38797j042175J056594M6463J62125
2334.8F42519989k34909m55627l59345m06036L7613m39682P29675L11966j96533n71442
2344.4F40935669l19977m2114n70221J28632M69665J95465j489677o77185R67369J65100
2354.1F39762726j153755j569825J740838R31129j100884j522407o37322K88468j25084
2362.7F36613884L33443j243973L9444M81338R92203P39288k32467O5384j081848J27334
2372.4F36834030j35383k04583k39525n38940O0082l95165P1640k84996q0490n1575
2382F35035095l13377n951m30031k92816n79605k44255j1635o6185j88179o20270L8185
2392.6F32320976l0975j15166j59187j83754n22614o55098p0457j33514q0185n99976
$$ y = [643675919, 643738556, 643445816, 643203812, 643057480, 643235779, 642296982, 641254807, 642311401, 642357864, 642519989, 642285080, 641829453, 641470108, 641064072, 641101685, 640662003, 641391678, 641703644, 641507111, 640935669, 640615692, 640573578, 640003357, 640131989, 640601654, 640797119, 639307442, 638630257, 639597626, 639762726, 638608971, 637039146, 638779984, 639711113, 638610229, 637087822, 636450500, 636738968, 636613884, 636947327, 635703354, 635742798, 636224136, 637216339, 637955627, 637723160, 637788544, 636706696, 636834030, 636698647, 636494064, 636254539, 635715599, 635775681, 635380516, 635452156, 635167160, 635086670, 635035095, 634721718, 634715767, 634285736, 633992920, 633413315, 633169060, 633157425, 633091240, 632903061, 632282791, 632320976, 632290001, 632174835, 632015648, 631831894, 631309280, 630654182, 630583725, 630450211, 630370026, 629770050]
2402.3F29770050m3945J16806k27738j05590q86155o46248o00204k18964l62320k10456
2411.9F26585236M51164k45400K4758k07405n01099p23190n15747l70674n63126R1514
2421.6F24026031n15937l10707r9869k49024k88276l17879Q6327o30913o34155p92542
2431.2F20273056k97050J9073m74510R2811J79787J94893q48503j105118n70717m14085
2440.8F17049637j99623n58090q1177j85051k94075k39067k47498j68419m70924n34325
2450.5F14071388p65114m26139n09224k74926k91557m58984J44462j49955j32294o19240
2460.1F10588417p79839n04875j95884n4017n99098k12784m97550m96674l28865l50342
2469.8F06568489l55453n48058j07117n43251m50020m07142m56848m79279p12814m03252
$$ y = [629770050, 629726105, 629842911, 629615173, 629509583, 628623428, 627977180, 627376976, 627158012, 626795692, 626585236, 627036400, 626791000, 626815758, 626608353, 626107254, 625384064, 624868317, 624497643, 623934517, 624026031, 623510094, 623199387, 623099518, 622850494, 622562218, 622244339, 622330666, 621699753, 621065598, 620273056, 619976006, 619995079, 619520569, 619613380, 619793167, 619988060, 619139557, 618034439, 617463722, 617049637, 616850014, 616291924, 616210747, 616025696, 615731621, 615492554, 615245056, 615076637, 614605713, 614071388, 613306274, 612880135, 612370911, 612095985, 611804428, 611345444, 611489906, 611339951, 611207657, 610588417, 609808578, 609303703, 609107819, 609053802, 608454704, 608241920, 607744370, 607247696, 606918831, 606568489, 606213036, 605664978, 605557861, 605014610, 604564590, 604157448, 603700600, 603221321, 602508507, 602105255]
2479.4F02105255o95953k85492l67661n01098l72467n00565l08990m14772k69890q41027
2489.1E97547340n34515l49884m73366q7242m78935q4915n27878r61723o08635m13933
2498.7E93026314m09394m44030j18141m34838k69584l66059m52308l24593k76108m90265
2508.3E89440994j370315q62656n01175k34260k49825l86200j16768l99704k26402
2517E85093689o40526m73862o58874q87947k19422l13186k16446m97055N417J95160
2526.7E81386948l44048o58073q65479m53186q84590p91130l38364J04332R0027l12538
2536.3E76933899k36740n74455m01116p82547q03528n20515n14221m03405o97631P9612
2546E72079353J56975k30026l22456n22767n50460n57557m87937p97425m69971l11508
$$ y = [602105255, 601409302, 601123810, 600756149, 600255051, 599882584, 599382019, 599073029, 598658257, 598388367, 597547340, 597012825, 596662941, 596189575, 596102333, 595623398, 595538483, 595010605, 594048882, 593440247, 593026314, 592616920, 592172890, 592054749, 591619911, 591350327, 590984268, 590531960, 590207367, 589931259, 589440994, 588070679, 587208023, 586706848, 586472588, 586222763, 585836563, 585719795, 585320091, 585093689, 584453163, 583979301, 583320427, 582432480, 582213058, 581899872, 581683426, 581186371, 581191788, 581386948, 581042900, 580384827, 579519348, 579066162, 578181572, 577390442, 577052078, 577156410, 577246437, 576933899, 576697159, 576122704, 575721588, 574939041, 574135513, 573614998, 573100777, 572697372, 571999741, 572079353, 572236328, 572006302, 571683846, 571161079, 570610619, 570053062, 569565125, 568767700, 568297729, 567986221]
2555.6E67986221j40915l11775n32570k47802m70810k37732p49932l51410j49192p29981
2565.2E64064102N8289j98479n12962p57218n39818j88064o08673k75002k60811p03086
2574.9E60078278p10793j48659M8752J22490l48930r12781o95610n84068k09542n20706
2584.5E56118431k91519k59056n94025k51503m99229k32163n66482n70679m13246o21567
2594.2E51818962j50871k80342l88146o28700l57323k59208n21737n84754n37186l08418
2603.8E47802277q93937n43556l38592n17006n41344m99344j41678p29141n95627n05333
2613.5E42496719m90379n10254k70157K17209p75871p82585o62766n95360m42466n46074
2623.1E37638016k59896p31201o18400l17002n6228k91214p66144p04537o80923l34015
$$ y = [567986221, 567845306, 567533531, 567000961, 566753159, 566282349, 566044617, 565294685, 564943275, 564794083, 564064102, 564122391, 563923912, 563410950, 562653732, 562113914, 561925850, 561317177, 561042175, 560781364, 560078278, 559367485, 559218826, 559267578, 559390068, 559041138, 558128357, 557432747, 556848679, 556639137, 556118431, 555826912, 555567856, 554973831, 554722328, 554223099, 553990936, 553424454, 552853775, 552440529, 551818962, 551668091, 551387749, 550999603, 550370903, 550013580, 549754372, 549232635, 548647881, 548110695, 547802277, 546908340, 546364784, 546026192, 545509186, 544967842, 544468498, 544326820, 543597679, 543002052, 542496719, 542006340, 541496086, 541225929, 541443138, 540667267, 539884682, 539221916, 538626556, 538184090, 537638016, 537378120, 536646919, 536028519, 535711517, 535655289, 535364075, 534597931, 533893394, 533212471, 532878456]
2632.8E32878456o42624p34291n87578k90718j79596m84962m09928o70776n58395p22428
2642.4E27597160n97114m08631n25856l39317n39207j97220l08991m77142m94156n62096
2652E23147430p88650j020012k00729l08609l32451l19443n99632l92761k32659Q0032
2661.7E19032516n00526n01709j63345m45595q08449n93452l3951l37792j61285m30679
2671.3E15055733m67720k7314m05006n58777n10254k50740n60837n47370k21673j72157
2681E11333885l51562o68335r8191r6359m31366n85708l89977l13377l96958m6310
2690.6E07955742n43175l62129j28021m40331l95737l34968j99547n18761m02259l36380
2700.3E04294434l89481l99132o37016k85606J83677P0153l16086l47481p12204n35660
$$ y = [532878456, 532235832, 531501541, 530913963, 530623245, 530443649, 529958687, 529548759, 528877983, 528319588, 527597160, 527000046, 526591415, 526065559, 525726242, 525187035, 524989815, 524680824, 524203682, 523709526, 523147430, 522358780, 521338768, 521138039, 520829430, 520496979, 520177536, 519577904, 519185143, 518952484, 519032516, 518531990, 518030281, 517866936, 517421341, 516612892, 516019440, 515985489, 515647697, 515486412, 515055733, 514588013, 514560699, 514155693, 513596916, 513086662, 512835922, 512275085, 511727715, 511506042, 511333885, 510982323, 510313988, 510215797, 510119438, 509688072, 509102364, 508712387, 508399010, 508002052, 507955742, 507412567, 507050438, 506922417, 506482086, 506086349, 505751381, 505551834, 505033073, 504630814, 504294434, 503904953, 503505821, 502868805, 502583199, 502766876, 502837029, 502520943, 502173462, 501461258, 500925598]
2709.9E00925598l98941n72700k53792n00870q9111L2005M540Q0108o35452q28171
2719.5D97763214m40712J37062l45039l88527o4392k49024j31149l94897l51830o82297
2729.2D94852409k30026K12364n72548n34515k13928M6425l07656j72195J75285l43170
2738.8D92912445n29213m86450j77612j40763j10130l05138m93660j20926J4763K24343
2748.5D90787659L0174l82767m75197l35388l70140n19600k32849L1929P6752k36359
2758.1D88374214o00548n21736j32980k96669m64974l35464m11263K2927n5123n12466
2767.8D85065918m84543j51787m7836k58598l20473n17616l85933q31909q00438o3858
2777.4D81202927j29700k74277n77316j24397k01607n83382k23732l62777l07389o34727
$$ y = [500925598, 500526657, 499953957, 499700165, 499199295, 499110184, 499142189, 499146729, 499226837, 498591385, 497763214, 497322502, 497459564, 497114525, 496725998, 496661606, 496412582, 496281433, 495886536, 495534706, 494852409, 494622383, 494834747, 494262199, 493727684, 493513756, 493560181, 493252525, 493080330, 493255615, 492912445, 492383232, 491896782, 491719170, 491578407, 491468277, 491163139, 490669479, 490548553, 490563316, 490787659, 490817833, 490435066, 489959869, 489624481, 489254341, 488734741, 488501892, 488533821, 488610573, 488374214, 487773666, 487251930, 487118950, 486822281, 486357307, 486021843, 485610580, 485633507, 485578384, 485065918, 484581375, 484429588, 484381752, 484123154, 483802681, 483285065, 482899132, 482067223, 481266785, 481202927, 481073227, 480798950, 480221634, 480097237, 479895630, 479312248, 479088516, 478725739, 478418350, 477783623]
2787D77783623p45087n29556l95661k96363n17617m12788n51910n58053n97610n60188
2796.7D72618790l28675o07147q32062o82106l53126n82886q37593p05261k40937j22451
2806.3D67326546o84891j049042r28802k01416m92020q92982n44243p13311r09461
2815D60910378j017533n82504l14369o38581j066627j055031o72035o06194l52363
2823.7D54605141m41017p51915j077919r68934o18133p08580p53708r91859r43413
2832.4D47349663j104393p74193l93333r34983r74540j348382j382408j088028j277198
2841.1D38072205j100350j162224j996879k128792j397705j448364j637650k291145
2848.8D24909096k213822j390876j405297p33299n92613o08902l61824k01950L4332
$$ y = [477783623, 477038536, 476508980, 476113319, 475816956, 475299339, 474886551, 474334641, 473776588, 473178978, 472618790, 472290115, 471682968, 470850906, 470168800, 469815674, 469232788, 468395195, 467689934, 467448997, 467326546, 466641655, 465592613, 464663811, 464462395, 463970375, 463077393, 462533150, 461819839, 460910378, 459892845, 459310341, 458995972, 458357391, 457290764, 456235733, 455563698, 454957504, 454605141, 454164124, 453412209, 452334290, 451365356, 450747223, 450038643, 449284935, 448293076, 447349663, 446245270, 445471077, 445077744, 444142761, 443168221, 441819839, 440437431, 439349403, 438072205, 436971855, 435809631, 433812752, 431683960, 430286255, 428837891, 427200241, 424909096, 422695274, 421304398, 419899101, 419165802, 418573189, 417964287, 417602463, 417400513, 417434845]
2857.4D17434845l49121l73840m96026m22439n32951n54581o2142k65617n78880r07212
2867.1D12892036j003379j131287q33054n55114o76079o18820r39064m81301l65295
2875.8D06288643p89375q37784o44760l56255p06329o23322p52907j028137p41005
2884.4C99808769m17900n44319j135864r17778q18520r73358p74307p40280q33817
2893.1C92652626n31006l89519j040725j054383o97746n47905q40149o94465k10457
2901.8C86646271p82814q29964o70547n72777n42908o46515n68237p66869q80279j285973
2911.4C79099388j025772j077309j653709j417923r08661q05244j712036j249352o04172
2920.1C68645210j016464r51080p86476o74706q79707n4970L11699J99928K55013p10831
$$ y = [417434845, 417085724, 416711884, 416215858, 415793419, 415260468, 414705887, 414643745, 414378128, 413799248, 412892036, 411888657, 410757370, 409924316, 409369202, 408693123, 408074303, 407135239, 406653938, 406288643, 405499268, 404661484, 404016724, 403660469, 402954140, 402330818, 401577911, 400549774, 399808769, 399390869, 398846550, 397710686, 396792908, 395974388, 395001030, 394226723, 393486443, 392652626, 392121620, 391732101, 390691376, 389636993, 388939247, 388391342, 387551193, 386856728, 386646271, 385863457, 385033493, 384362946, 383790169, 383247261, 382600746, 382032509, 381265640, 380385361, 379099388, 378073616, 376996307, 375342598, 373924675, 373016014, 372210770, 370498734, 369249382, 368645210, 367628746, 366677666, 365891190, 365216484, 364336777, 364281807, 364593506, 364793434, 365048447, 364337616]
2929.8C64337616n06706J80435L54080J57929m0017J41983L92914M62075Q1329N95589
2939.4C66157227J039543J084442J046600M43077K00501K48260N55611O44379N67207
2948.1C71986847N75638M98390M98924N71099M23278K74392N93261L90358M20113M45480
2957.7C76677780J95694L86162L62358O78482Q06618P93342L71514J77345Q62732Q23631
2967.4C82135658P29370P16668N90248L35197N56450Q20236N06859N29709K72293P25174
2977C87917862R58519J76430l7995L25356M90227m8409M1008J66702K35329M54102
2986.7C90679131J75247J24244j7738k6703m4861J30883O9923k16179Q4877k9297j49803
2997.3C90779724l23524m67759n05409m27131j23368l74069l90205m43611p47490n00184
$$ y = [364337616, 363830910, 364011345, 364365425, 364523354, 364483337, 364625320, 365018234, 365480309, 365561638, 366157227, 367196770, 368281212, 369327812, 369770889, 369971390, 370219650, 370775261, 371419640, 371986847, 372562485, 373060875, 373559799, 374130898, 374554176, 374828568, 375421829, 375812187, 376232300, 376677780, 376873474, 377259636, 377621994, 378300476, 379107094, 379900436, 380271950, 380449295, 381312027, 382135658, 382865028, 383581696, 384171944, 384507141, 385063591, 385883827, 386390686, 386920395, 387192688, 387917862, 388876381, 389052811, 389014816, 389340172, 389830399, 389781990, 389822998, 389989700, 390225029, 390679131, 390854378, 390978622, 390960884, 390934181, 390889320, 391020203, 391090126, 390873947, 390958824, 390929527, 390779724, 390456200, 389988441, 389483032, 389055901, 388932533, 388558464, 388168259, 387724648, 386977158, 386476974]
3006.9C86476974L4638k00691j015091o95381j81046p14989p16629j99775n32265n68466
3016.6C81687279n22042o57119m47426p43790o49338o91070q39920n19600n98526p99065
3026.2C75219383q57582n33218o41289o45790n38597p21588o87523j074295r02519
3034.9C68616982o45714m68064m37317q42628p93152q93860n08270m32663q17757o68144
3044.5C62109413r54971j161728o94542m47884r23309q74634o89735q34274o28090
3053.2C54900246n73044n06478o82563j030121j029778p17621p67745r64661m10423
3061.9C48217812m32015p37495n05371m38042m90379n62821n91659o89583q89092q73031
3071.5C42008324n28832m06914p55729q42934m13589n92919p34138j21308n57403j035042
$$ y = [386476974, 386511612, 386310921, 385295830, 384600449, 384419403, 383704414, 382987785, 382788010, 382255745, 381687279, 381165237, 380508118, 380060692, 379316902, 378667564, 377976494, 377136574, 376616974, 376018448, 375219383, 374361801, 373828583, 373187294, 372541504, 372002907, 371281319, 370593796, 369519501, 368616982, 367971268, 367503204, 367065887, 366223259, 365430107, 364536247, 364027977, 363595314, 362777557, 362109413, 361154442, 359992714, 359298172, 358850288, 357926979, 357052345, 356362610, 355528336, 354900246, 354327202, 353820724, 353138161, 352108040, 351078262, 350360641, 349592896, 348628235, 348217812, 347785797, 347048302, 346542931, 346104889, 345614510, 345051689, 344460030, 343770447, 342881355, 342008324, 341479492, 341072578, 340316849, 339473915, 339060326, 338467407, 337733269, 337611961, 337054558, 336019516]
3081.2C36019516r01871o38313J6708j50795p07893j009903r85451o95953m08173l27263
3090.8C30210609o39915p08237q08258q12950n04723k53448m44450o09360k08511n32570
3100.5C24688187r41544o47163o23207p33872p16057p68470m48285K6970m79068r09329
3110.1C18448162o75774m57973n10654o70052o37569r39484q19073l59077m43173p13787
3119.8C12221546p55138q07228r10950o64673q40664p76100l89252n71899p34043n03483
3129.4C05268116m47102p71122l18107o11916j049557m59804r13868r94110m28219
3138.1B99274311j71909l87745o78463o69251p53059p48024j004715n64671m98733
3146.8B93797741p79514l65448m99916n94235q58803o76346l46813n37510p46231j128006
$$ y = [336019516, 335117645, 334479332, 334496040, 334345245, 333637352, 332627449, 331641998, 330946045, 330537872, 330210609, 329570694, 328862457, 328054199, 327241249, 326736526, 326483078, 326038628, 325429268, 325220757, 324688187, 323746643, 323099480, 322476273, 321742401, 321026344, 320257874, 319809589, 319836559, 319357491, 318448162, 317772388, 317314415, 316803761, 316133709, 315496140, 314556656, 313737583, 313378506, 312935333, 312221546, 311466408, 310659180, 309748230, 309083557, 308242893, 307466793, 307077541, 306505642, 305771599, 305268116, 304821014, 304049892, 303731785, 303119869, 302070312, 301610508, 300696640, 299702530, 299274311, 299102402, 298714657, 298036194, 297366943, 296613884, 295865860, 294861145, 294296474, 293797741, 293018227, 292652779, 292152863, 291558628, 290699825, 290023479, 289676666, 289139156, 288392925, 287264919]
3156.4B87264919q74557o41785o91509r13124n03788j92852r51481p45735l86811k54936
3166B81108341l53813p16553n23281n70450n71327n46017q94336j074887n93624l73745
3175.7B74890308p54337r59530p84855l40976m14963n83534o23036n35068n01099n83534
3185.3B68809376o65055q67252k29530j30062n84050p33356r91669p50561o41727n08518
3195B62707596l51582m50268p32116n89409l22838n06725k80094o68126p77015o11439
3204.6B57417984n12733o4888o09055n82504k72370k61554l59936n52616k87400o75430
3214.3B53239498p85713m97398l51735k96001n58586p48882o99921k93827k97432l86486
3223.9B48323517k99454l21178m49906n02891l58944m86412m78039m30279j47457j01242
$$ y = [287264919, 286390362, 285748577, 285057068, 284143944, 283640156, 283447304, 282495823, 281750088, 281363277, 281108341, 280754528, 280037975, 279514694, 278944244, 278372917, 277826900, 276932564, 275857677, 275264053, 274890308, 274135971, 273176441, 272391586, 272050610, 271635647, 271052113, 270429077, 269894009, 269392910, 268809376, 268144321, 267277069, 267047539, 266917477, 266333427, 265600071, 264608402, 263857841, 263216114, 262707596, 262356014, 261905746, 261173630, 260584221, 260261383, 259754658, 259474564, 258806438, 258029423, 257417984, 256905251, 256840363, 256231308, 255648804, 255376434, 255114880, 254754944, 254202328, 253914928, 253239498, 252453785, 251956387, 251604652, 251308651, 250750065, 250001183, 249301262, 249007435, 248710003, 248323517, 248024063, 247702885, 247252979, 246750088, 246391144, 245904732, 245426693, 244996414, 244848957, 244747715]
3233.5B44747715l71609n90610r20983n76248n21450n26123l56827m49638n83458l97873
3243.2B39452896K84672j39942n55458m46034l67412k65751n67513n16166n37549p1830
3252.8B36269913J60484l20682n97725q29754n71614l10192O5861o0501l95641k61517
3262.5B33148632l54443m37450n65128m84963l45440J43948j77097o35147k45305o91661
3272.1B29355946j76735K04792m50325p06063o75258q164j29642n19123n08786k42862
3281.8B26143780J5812n7927J34163j26896o51378m90856R5768q5221k49195R16k50015
3292.4B24478951l71018k22168J57242k42748q49114q05454n80025k2182J82171J80416
3302B21906071j71566k95163k14424k48108l4065k72732l55129n99899j42994M43726
$$ y = [244747715, 244376106, 243785496, 242864513, 242288265, 241766815, 241240692, 240883865, 240434227, 239850769, 239452896, 239737568, 239597626, 239042168, 238596134, 238228722, 237962971, 237395458, 236879292, 236341743, 236269913, 236430397, 236109715, 235511990, 234682236, 234110622, 233800430, 233866291, 233805790, 233410149, 233148632, 232794189, 232356739, 231791611, 231306648, 230961208, 231105156, 230928059, 230292912, 230047607, 229355946, 229179211, 229384003, 228933678, 228227615, 227552357, 227544193, 227414551, 226895428, 226386642, 226143780, 226159592, 226101665, 226235828, 226108932, 225457554, 224966698, 225062466, 224977245, 224728050, 224728966, 224478951, 224107933, 223885765, 224043007, 223800259, 222951145, 222145691, 221565666, 221543484, 221725655, 221906071, 221734505, 221439342, 221224918, 220976810, 220942745, 220670013, 220314884, 219714985, 219571991, 220015717]
3311.7B20015717l05329p62729p70855k70806j7299k10514l77846l02468L06187J31893
3321.3B17435951n09662q38795m50535k72007n25093l55473n03063k67753l64800p16934
3330.9B12631836l08037k76432j66244k098m87366o22368m02203o54640l86581l5477
3340.6B09290390l36628p4882O5155m67701n07927j97449m47006l74871j99394j05495
3350.2B06644192K78740l13893l77273P992m39816n41630l46985k83718o5021K98862
3359.9B04861450l76739n97611R6894L3645J354j95732j30367n302o2638k4605k21386
3370.5B03378963p9383j07460k01836j99108J71909R022n40123k9335Q9703M2209m67319
3381.1B02067242n29309K49558j48831j77898J14975J44844j13296j94378K27661q0586
$$ y = [220015717, 219710388, 218947659, 218176804, 217905998, 217888699, 217678185, 217300339, 216997871, 217304058, 217435951, 216926289, 216087494, 215636959, 215364952, 214839859, 214484386, 213981323, 213713570, 213348770, 212631836, 212323799, 212047367, 211881123, 211879025, 211391659, 210769291, 210367088, 209712448, 209325867, 209290390, 208953762, 208878880, 208944035, 208476334, 207968407, 207770958, 207323952, 206949081, 206749687, 206644192, 206922932, 206609039, 206231766, 206239758, 205799942, 205258312, 204911327, 204627609, 204562588, 204861450, 204484711, 203887100, 203983994, 204017639, 204018993, 203823261, 203692894, 203687592, 203624954, 203600349, 203378963, 203299580, 203192120, 202990284, 202791176, 202963085, 202972107, 202431984, 202402649, 202492352, 202534561, 202067242, 201537933, 201787491, 201638660, 201460762, 201575737, 201720581, 201607285, 201412907, 201640568, 201559982]
3390.7B01559982j07174J73817N67989L73383m02088j46618j99528l53317L51562K46945
3400.4B02064953m50897j92795J67427K57015K56920l88145r9011L69206M8866k38381
3410B01795158n54008L07407P14970K96535M80824J7929J10054M92954M1523l17077
3419.7B03386269l37029L22647K93789J88332M09164j6003K21062K67868J26381N04131
3429.3B05366611K30523R0122P00645P38392M1466K50187K46086j87359J77364K60430
3439B07914467N48096O02226K0122m2781N69992O06880K05688Q35476N36099l65658
3448.6B11430607k38152L06416R42345M60605N22461Q24833M41456M21123K78321L98254
3458.2B15788269P30839N92785M53224N70640o3743j93691O36825Q93612P83081M55513
$$ y = [201559982, 201452808, 201626625, 202194614, 202567997, 202165909, 202019291, 201819763, 201466446, 201818008, 202064953, 201614056, 201421261, 201588688, 201845703, 202102623, 201714478, 201615467, 201984673, 202033539, 201795158, 201241150, 201548557, 202263527, 202560062, 203040886, 203058815, 203168869, 203661823, 203703346, 203386269, 203049240, 203371887, 203665676, 203854008, 204263172, 204247169, 204468231, 204736099, 204862480, 205366611, 205597134, 205687256, 206387901, 207126293, 207167759, 207417946, 207664032, 207476673, 207654037, 207914467, 208462563, 209064789, 209084911, 209042130, 209612122, 210219002, 210424690, 211260166, 211796265, 211430607, 211192455, 211498871, 212441216, 212901821, 213424282, 214249115, 214690571, 215111694, 215390015, 215788269, 216519108, 217111893, 217565117, 218135757, 218072014, 217878323, 218515148, 219408760, 220191841, 220647354]
3467.9B20647354R57661Q50277M5547M93756P98091Q17070P49932Q84533P05757K13776
3477.5B27163754L85494O92653Q85601N90287M05330L43781P97729Q03032J86100J002541
3487.2B33256302J091690P57999P51477J97391K55680N09682P90462R68304R40361
3495.8B39519348O65989O32820R01222R28936J101323R98420N84565L48701P17850
3504.5B46399174P52487P10812J146240J201725N11589j01338J039162J480560Q14362
3513.2B53954773M52480L09410R53331J175785J085720J079216N54543N93948J697388
3521.9B61856594J603146J18236Q15048J498776R22699M19159P30934J152477J169033
3530.6B70286102R50718O86550J315365J079521J197892R53693J56078J434708J273670
$$ y = [220647354, 221605015, 222455292, 222500839, 222994595, 223792686, 224609756, 225359688, 226244221, 226949978, 227163754, 227549248, 228241901, 229127502, 229717789, 230123119, 230466900, 231264629, 232067661, 232253761, 233256302, 234347992, 235105991, 235857468, 236054859, 236310539, 236820221, 237610683, 238578987, 239519348, 240185337, 240818157, 241719379, 242648315, 243749638, 244748058, 245332623, 245681324, 246399174, 247151661, 247862473, 249008713, 250210438, 250722027, 250620689, 251659851, 253140411, 253954773, 254407253, 254716663, 255669994, 256845779, 257931499, 259010715, 259565258, 260159206, 261856594, 263459740, 263577976, 264393024, 265891800, 266814499, 267233658, 267964592, 269117069, 270286102, 271236820, 271923370, 273238735, 274318256, 275516148, 276469841, 276625919, 278060627, 279334297]
3539.2B79334297R25713J118088J250114R95827J108226J832009R23252J357155O09875
3547.9B89454556J108837J884479J327591J870480j01433R10587J941452J546269J676292
3556.6C01619110K69680J244164J860428J981468J404457J459389J458854P56932L055686
3565.3C15110168J281167R4928O58112P94067L269673J839981J426239J601753J570778
3574C27646866J222191J225700K382202J436653J762696J812973J822509J652184J718750
3582.6C42682724K029991N23377L041534L069229J82266K473603Q59794J260224K175369
3591.3C58298111K861977J497802N61753K815399J016121K458763L524742J267052
3599C74301720K115516J749840J535454K042389K024040K618141K987099K564583L06396
$$ y = [279334297, 280260010, 281378098, 282628212, 283624039, 284732265, 286564274, 287487526, 288844681, 289454556, 290563393, 292447872, 293775463, 295645943, 295544510, 296455097, 298396549, 299942818, 301619110, 301888790, 303132954, 304993382, 306974850, 308379307, 309838696, 311297550, 312054482, 315110168, 316391335, 316486263, 317144375, 317938442, 321208115, 323048096, 324474335, 326076088, 327646866, 328869057, 330094757, 332476959, 333913612, 335676308, 337489281, 339311790, 340963974, 342682724, 344712715, 345236092, 348277626, 351346855, 351529121, 354002724, 354862518, 356122742, 358298111, 361160088, 362657890, 363219643, 366035042, 367051163, 369509926, 373034668, 374301720, 376417236, 378167076, 379702530, 381744919, 383768959, 386387100, 389374199, 391938782, 392245178]
3607.7C92245178L362885R62143n88494O270180J817703j397552M810142J531487L666000
3616.4D12679672L553810L40233L008881J966667J626740K554626L005791K466049
3624.1D31202469K382126K578468L011284O916809K436333o714287L109054L682709
3631.8D48604965N067444K673035l92800L339310M311714L106499J389999J665383
3639.5D69765549K908554L294334K149887J751480L399773M306412N773315J55678
3647.3D93504982k588081N709648K616272k31476m24690M417572M660453M604989O487312
3655.9E18756981n092049J150856N517273K060890K497979R62677J913757J866150
3663.6E29634514K254715K470321N34096M048081L132362J9417J150169n075989K724228
$$ y = [392245178, 395608063, 396570206, 395981712, 402251892, 404069595, 402672043, 407482185, 409013672, 412679672, 416233482, 416573715, 419582596, 421549263, 423176003, 425730629, 428736420, 431202469, 433584595, 436163063, 439174347, 446091156, 448527489, 441813202, 444922256, 448604965, 453672409, 456345444, 455952644, 459291954, 463603668, 466710167, 468100166, 469765549, 472674103, 475968437, 478118324, 479869804, 483269577, 487575989, 493349304, 493504982, 490916901, 496626549, 499242821, 499011345, 498586655, 503004227, 507664680, 512269669, 518756981, 513664932, 514815788, 520333061, 522393951, 524891930, 525854607, 527768364, 529634514, 531889229, 534359550, 534893646, 538941727, 542074089, 542093506, 543243675, 538167686, 540891914]
3672.3E40891914Q488388Q998261O66733j5033531K096786P281265M708290j567611
3680E56530495N00030L153000J751099J653022J484566L33672L274040O321411o556244
3688.7E68445091l316650Q016090l777542j111793M854889R27200J704826J012459
3696.4E76754570J20316J557922K78511J970367K857438l297272k134667L704605K393799
3705.1E84205589O72722M43077K062264L140182o159477L730011N755310j1965332
3712.8E81884346L251839L748855j45530J498870K958947J364631l691902O73332N116158
3721.5E96659546k718163m261703M288711J672898r1362j211472m89692K962341P07321
3730.2E97518425M142570j551132p209663Q644981K892762r310685K20948K464485
$$ y = [540891914, 549380302, 558378563, 559045296, 544011765, 546108551, 553389816, 558098106, 556530495, 557030525, 560183525, 561934624, 563587646, 565072212, 565405884, 568679924, 575001335, 568445091, 565128441, 573144531, 569366989, 568255196, 573110085, 574037285, 575742111, 576754570, 576874886, 578432808, 578711319, 580681686, 583539124, 580241852, 578107185, 581811790, 584205589, 584878311, 585321388, 587383652, 590523834, 584364357, 588094368, 593849678, 581884346, 585136185, 588885040, 588739510, 590238380, 593197327, 594561958, 590870056, 591543388, 596659546, 593941383, 589679680, 593968391, 595641289, 595549927, 594338455, 593848763, 596811104, 597518425, 601660995, 600109863, 592900200, 601545181, 604437943, 595127258, 595348206, 597812691]
3737.9E97812691L71132J699981L309365l340302J075974J0020408q615799j4726104
3745.6E87607346R518013N570755O245460n73501j0470467R930115l038788p939453
3753.3E96849480N117340L572273L161850m476128J298371N760765o506767k305260
3761F02471924L629455J213303n36652L135224j110268m444046L082199M431496J173820
3769.7F13046455o793861O98586K286300o08902J081009K77710M84848J84708L010902
3778.4F13667755J515465p643547J424713K826157R41238J094818l637771r29337K077408
3787.1F11336899Q23173O53420L48816k49291m86717L15018j65177J046257L296585
3795.8F16918983l163223m588928K305565M156036N841294l306771j0313873K203293
$$ y = [597812691, 598183823, 599883804, 603193169, 599852867, 600928841, 610949249, 602333450, 587607346, 597125359, 602696114, 608941574, 608368073, 597897606, 607827721, 604788933, 596849480, 601966820, 605539093, 608700943, 604224815, 605523186, 611283951, 604777184, 602471924, 606101379, 607314682, 606778030, 609913254, 608802986, 604358940, 607441139, 611872635, 613046455, 606252594, 606951180, 609237480, 608628578, 609709587, 609987297, 610472145, 610656853, 613667755, 615183220, 607539673, 608964386, 611790543, 612731781, 613826599, 610188828, 609259491, 611336899, 612160072, 612813492, 613162308, 612913017, 612426300, 612741318, 612576141, 613622398, 616918983, 613755760, 609166832, 611472397, 615628433, 621469727, 618162956, 607849083, 610052376]
3803.5F10052376K385521M143028N687561p878265n315056M168167K010841k80151
3811.2F14974022K46658K38152J181221N328102O51665j3470345K129593N082016M440651
3819.9F20801735K096481j4916382Q10013M919739J618004K259750P48596l221130
3827.6F15116806k94762J525345K821999K322540p264976Q42933O988487m724807j814614
3836.3F15518951Q667069m534798o859703N553398l659973q24661O522598r43756l806190
3844.9F15632935J337471M44412j05515J665268n31997Q25882M431610l706360J185570
3853.6F21179276j0974503r79157Q700028n25169k148705K010880K493820K721939
3861.3F22478409m936409o38199O213760m598770n503921L389816M408989N639267
$$ y = [610052376, 612437897, 616580925, 622268486, 614390221, 609075165, 613243332, 615254173, 614974022, 615220680, 615458832, 616640053, 621968155, 622619820, 609149475, 611279068, 616361084, 620801735, 622898216, 607981834, 608791847, 613711586, 615329590, 617589340, 618337936, 615116806, 614822044, 616347389, 619169388, 621491928, 614226952, 615069885, 622058372, 617333565, 615518951, 624186020, 619651222, 612791519, 618344917, 614684944, 613860283, 620382881, 619439125, 615632935, 616970406, 617414818, 617309303, 618974571, 618442574, 619268456, 623700066, 619993706, 621179276, 610204773, 609225616, 617925644, 617400475, 615251770, 617262650, 619756470, 622478409, 617542000, 616903801, 623117561, 618518791, 613014870, 616404686, 620813675, 626452942]
3869.1F26452942n647698r705314L084945O028977M270668q890343j141586L446693
3876.8F17899284l89061J708374M536858l380928p193756M344253J508789P22962M423599
3885.4F24180374j0644569L28140M483147Q51364L141212p6103o946068l92608L154411
3894.1F18079300n99442O29120R14231R86366K128792o906548L281784K193184m904251
3902.8F15802536M482460k123375k667580L30086K25907J833534J36680P2365j70784
3911.5F17921829P6905P23419k91100N94750K500343k676468m108925L897782N56297
3920.2F19194832l871727J398430J323623R47762p27081k449875O88286J081962Q07076
3928.8F18393288q99964l23143K101746k323341j504136J802025j08452j37062K49901
$$ y = [626452942, 620805244, 611099930, 614184875, 620213852, 624484520, 615594177, 614452591, 617899284, 617510223, 619218597, 623755455, 620374527, 613180771, 617525024, 619033813, 619756775, 624180374, 613535805, 613863945, 618347092, 619198456, 622339668, 622263565, 615317497, 614924889, 618079300, 617479858, 618108978, 619023209, 620009575, 622138367, 615231819, 618513603, 620706787, 615802536, 620284996, 618161621, 615494041, 615824127, 616050034, 617883568, 618020248, 618092613, 617921829, 617998734, 618722153, 618431053, 619025803, 621526146, 618849678, 614740753, 618638535, 619194832, 615323105, 616721535, 618045158, 618992920, 618265839, 615815964, 616504250, 617586212, 618393288, 617493324, 617170181, 619271927, 616948586, 615444450, 617246475, 617138023, 617000961, 617250862]
3937.5F17250862n49049m60701N13725J843262J304168k818107j438065R32808K03171
3946.2F16782074J050568p70340K9258M36058j835098J060105m16680q57429J077690
3954.9F16556206O15730O57806p79686l80821m22287N61142J229439j489830o15997
3963.6F15931702R1667m00772Q1596Q88138O88553j215401r26781R13277O97403m39301
3973.2F16310081n3291J41640n18570p75528O9580L63236o2981O53763P69310n9548
3982.8F16837692q40454j37367K36702k74201j29661o80390K66076P58247j7166K10495
3992.5F16229973L67737K68211j58653j39733l06472l624j92261m05045
4000.2F15660133
$$ y = [617250862, 616701813, 616241112, 616754837, 618598099, 619902267, 617084160, 615646095, 616578903, 616782074, 617832642, 617062302, 617091560, 617527618, 615692520, 616752625, 616335945, 615478516, 616556206, 617171936, 617829742, 617050056, 616669235, 616246948, 616808090, 618037529, 616547699, 615931702, 616023369, 615622597, 615704193, 616592331, 617280884, 616065483, 615138702, 616051979, 616749382, 616310081, 616256790, 616398430, 615879860, 615104332, 615173912, 615537148, 615474167, 616127930, 616897240, 616837692, 615997238, 615859871, 616096573, 615822372, 615692711, 615012321, 615278397, 616036644, 616019478, 616229973, 616597710, 616865921, 616707268, 616567535, 616261063, 616257439, 616065178, 615660133]
##END=$$ End of the data block
