##TITLE=$$ Begin of the data block
##JCAMP-DX=5.00 $$ ACD/SpecManager v 10.08
##SPECTROMETER/DATA SYSTEM=Varian
##DATE=15 Jan 2013 10:39:04
##DATA TYPE=INFRARED SPECTRUM
##DATA CLASS=XYDATA
##ORIGIN=
##OWNER=
##NPOINTS=3735
##FIRSTX=399.26403809
##LASTX=4000.35498047
##MAXX=4000.35498047
##MINX=399.26403809
##MAXY=67.22856903
##MINY=20.23658943
##XFACTOR=1.0000000000
##YFACTOR=0.000000100000000
##FIRSTY=37.25684738
##DELTAX=0.96440572
##XUNITS=1/CM
##YUNITS=TRANSMITTANCE
##XYDATA=(X++(Y..Y))
399.3C72568474J2273178R895248j5971298j3924446j810112J840286R858361n65834
407C74163857l09067J967773N9586J354561o932908k887077K390480N463448M70390
415.7C75741043m731331l8452M794846Q987159q292045n920181r64623L85704m780426
424.3C65181694l865967J705475M05235N413399J658402o08216L072815L1700o60019
433C72334518j446189j872330n446625J424484P135659L229637J856765m032516m654121
441.7C68529282j792832N46189k41547j150131M231491J459541j302223K736282J863518
450.4C74879570l207550k782822K34337k183533j390533P67441p102127r111328J0154876
459.1C60258331Q37593m881897M261513M979057R79043k554818K015190K967186n240097
$$ y = [372568474, 384841652, 394736900, 378765602, 364841156, 363031044, 364871330, 374729691, 374163857, 373854790, 375822563, 375882149, 377236710, 370303802, 367416725, 369807205, 375270653, 375741043, 371009712, 370971260, 375766106, 384753265, 376461220, 370541039, 369576416, 369962120, 365181694, 361315727, 363021202, 363426437, 368839836, 370498238, 369890022, 372962837, 372994537, 372334518, 370888329, 369015999, 363569374, 364993858, 372129517, 375359154, 377215919, 373183403, 368529282, 366736450, 367282639, 367041092, 365890961, 370122452, 371581993, 370279770, 373016052, 374879570, 371672020, 368889198, 369123535, 366940002, 365549469, 366316910, 359214783, 350103455, 360258331, 361095924, 356214027, 360475540, 365454597, 366433640, 363878822, 365894012, 368861198, 363621101]
467.7C63621101l867721k76604k34985k79236L48434J873780K826652l251571n084343
476.4C55675507M040718K623520l202210m235763j584130k099304Q51784P250671l18146
485.1C59002647k525367m89731r2468N42831k703514k680702m56047Q09822j533890
493.8C49873581q14667L452950J672630l103180m452362O97403L023338j786155k068062
502.5C46495476K337684K929078J453170j405449k147522n59616J393814P41806j818466
511.1C49419975o23283K26593J172027J01777l304253j379852O42662n17273r08356
519.8C44830017j601906k447929J3199K329254J89743m14543L26271N11513k503395
528.5C41232224l804360J343498L110886l97225k717742m88968J96304M90417L18413
$$ y = [363621101, 359753380, 359476776, 359241791, 358962555, 359310989, 361184769, 364011421, 360759850, 355675507, 359716225, 362339745, 359137535, 354901772, 353317642, 351218338, 352070122, 359320793, 359002647, 356477280, 355987549, 355895081, 356437912, 353734398, 351053696, 350597649, 351407471, 349873581, 349058914, 352511864, 354184494, 351081314, 346628952, 347326355, 350349693, 348563538, 346495476, 348833160, 351762238, 353215408, 351809959, 349662437, 349102821, 350496635, 351238441, 349419975, 348796692, 349023285, 350195312, 350297089, 346992836, 345612984, 346255646, 345738373, 344830017, 343228111, 340780182, 340793381, 343122635, 343312378, 342897835, 343224106, 343735619, 341232224, 337427864, 338771362, 341882248, 341485023, 338767281, 338278313, 338474617, 338965034, 339283447]
537.2C39283447k028122L7766N54924m60510n11818J02806J561813N39208p71981j643562
546.8C36663971j335716j637841q59527Q79097R68551Q42820j075707p76405o20728
555.5C33048515j134910p37191j258544p9308L30277O6719L19061J327629R53865L22571
565.1C33158684r5406j883011j137619j275825k87743J606102R04045l40957r74274
573.8C29673996Q18748k31285j594352j75858q45108n32036N62210K77825O82792J621170
583.5C30258102P28569P0382j030960j301919J69526K4910J028442J638985R06295
592.1C32492332Q55217K95983q01430J63002Q49876j068191m28200l59764p23877Q34847
601.8C32109795O29348Q37632N16395n13649j344108j240960m06723o46057m50859
$$ y = [339283447, 337255325, 337293091, 337848015, 337387505, 336875687, 336978493, 338540306, 339079514, 338307533, 336663971, 335328255, 333690414, 332830887, 333709984, 334678535, 335521355, 334445648, 333669243, 333048515, 331913605, 331176414, 329917870, 329838562, 330168839, 330235558, 330554619, 331882248, 332836113, 333158684, 333063278, 331180267, 330042648, 328766823, 328479080, 330085182, 330989227, 330648270, 329673996, 330492744, 330261459, 328667107, 328491249, 327646141, 327114105, 327676315, 327954140, 328636932, 330258102, 330986671, 331057053, 330026093, 328724174, 328893700, 328918610, 329947052, 331586037, 332492332, 333347549, 333643532, 332842102, 333005104, 333854980, 332786789, 332358589, 331998825, 331274948, 332109795, 332739143, 333576775, 334093170, 333579521, 332235413, 330994453, 330587730, 329941673, 329490814]
610.5C29490814l32069k709O42548O83823r46694j163406J69792q21800j209526o14929
620.1C25895844J108284J084785P55310K115593O75888l65982k8076N58243J063385
628.8C32863274J751213K378730J007843J440812J274528o11610O61697K293968J553612
637.5C44614067Q35953J960449K075310J27258L39546J163330J076165J587524J005669
646.2C54785271l43285o53267L51448J407662J654167J784515R40552J17416o36673
654.8C59407806j608238p17392k2011j2321K49939J48926J663780J144218r30099j55373
664.5C59169235J0491p27806k163163j755485L937950P46345K72141J765518J621285
673.2C62876511L84407N24139J133766J054840K97432l02582O78368J956406J981201
$$ y = [329490814, 329158745, 329156036, 329798584, 330482407, 329535713, 328372307, 328542099, 327720299, 326510773, 325895844, 327004128, 328088913, 328844223, 330959816, 331635704, 331269722, 331241646, 331799889, 332863274, 334614487, 336993217, 338001060, 339441872, 340716400, 340104790, 340766487, 343060455, 344614067, 345450020, 347410469, 349485779, 349613037, 349952583, 351115913, 352192078, 353779602, 354785271, 354441986, 353788719, 354140167, 355547829, 357201996, 358986511, 359927063, 360044479, 359407806, 357799568, 357082176, 357060165, 357047844, 357297783, 357446709, 359110489, 360254707, 359324608, 359169235, 359179726, 358451920, 356288757, 354533272, 358471222, 359217567, 359489708, 361255226, 362876511, 363260918, 363785057, 364918823, 365973663, 366271095, 365968513, 366646881, 368603287, 370584488]
681.8C70584488J399765N37529N02014J682968J141625m83895K26250Q69102M30642
690.5C76890488P45277R02481R24606J102982J087875N47715q0567L0709N97610R54132
700.2C83703308L14026k59323R00917J590462K64282K92244J426811J630936J123428
708.8C90987091j46217k31552J12876R44672J510887K36283M07333N60303K74734N27039
718.5C95183449R13696J667290O91948R7313J69105k89230L71094J474228J501388
727.2D01780281J530876J123505j5412Q61359J357079Q25920J58806l14484K78358
735.8D07586288q20388k95220J588249J571732J298676K21366l37944n9890k84844
744.5D10468025l67012N7450K94303J155243J767922R70459Q90770R55887J11541o55021
$$ y = [370584488, 371984253, 372521782, 373023796, 374706764, 375848389, 375364494, 375590744, 376459846, 376890488, 377635765, 378538246, 379462852, 380565834, 381653709, 382201424, 382120857, 382151566, 382749176, 383703308, 384017334, 383758011, 384658928, 386249390, 386513672, 386805916, 388232727, 389863663, 390987091, 390840874, 390609322, 390722198, 391666870, 393177757, 393414040, 393821373, 394381676, 394656410, 395183449, 396097145, 397764435, 398456383, 398553696, 398722801, 398433571, 398804665, 400278893, 401780281, 403311157, 404434662, 404419250, 405280609, 406637688, 407463608, 407622414, 407307930, 407586288, 406765900, 406470680, 408058929, 409630661, 410929337, 411150703, 410812759, 410752869, 410468025, 410101013, 410158463, 410452766, 411608009, 413375931, 414346390, 415237160, 416193047, 416304588, 415649567]
754.2D15649567K93426J088867R09119J459198J580124K293739K285958J276550R85947
762.8D27822495J14631m28924N73082Q83026k47956O65398L75824j37596J501617J006317
772.5D32127914J78643m28543l71590k18239J58882M41399n89447J34430R41505J113739
782.1D33488693r3803j012459l19939M20952J471520Q05893N65834L0784l54118k19688
791.8D34783669q45566J12877M47845K98348p17659q05626K10151k33459k56500o94542
801.4D32299538j164170j402092j355972j532402j264381n48821p91015q18902j220016
810.1D22201767j864281k500534j608352j259118k031402q20656K76566J029357L82653
818.8D13806000q02193l97530Q5335M04663P14798J007500P12471J721420K831955
$$ y = [415649567, 415942993, 417031860, 417940979, 419400177, 420980301, 423274040, 425559998, 426836548, 427822495, 427937126, 427508202, 428081284, 428964310, 428716354, 429381752, 429757576, 429619980, 431121597, 432127914, 432306557, 431878014, 431506424, 431288185, 431447067, 431888466, 431299019, 431433449, 432374954, 433488693, 433394890, 432382431, 432062492, 432483444, 433954964, 434760857, 435326691, 435357475, 435003357, 434783669, 433938103, 434050980, 434498825, 434797173, 434079514, 433273888, 433484039, 433250580, 432994080, 432299538, 431135368, 429733276, 428377304, 426844902, 425580521, 425031700, 424240685, 423421783, 422201767, 420337486, 417836952, 416228600, 414969482, 412938080, 412117424, 412393990, 413423347, 413806000, 413003807, 412606277, 412691612, 413096275, 413811073, 414818573, 415531044, 417252464, 420084419]
827.5D20084419L189163M130478L313256K354202J541481Q92105J912346L009605K122078
836.1D42549133J935273L099174K374878K398415J462822M49600R57603J001206J433639
844.8D57661743J381684J568222J099357J577530J653557J129684J298371L08342R49859
853.5D68628349J341286J457520J360054K007446K076950M95415J151733J116753J404457
862.2D81039963J92070l29247P55615K24915O97670n38292j062431j299668r35287
870.9D78745308k21863j461677j346665o12755j31454j266899j139603o80923j414299
879.5D70469170j286621j151581q65937j243476j01471J5106l73154L014q02079k92091
889.2D64370880l63846m41246r63058j137772P73392J450424N00946Q04215K043571
$$ y = [420084419, 423273582, 427404060, 430717316, 433071518, 434612999, 435505104, 437417450, 440427055, 442549133, 444484406, 447583580, 449958458, 452356873, 453819695, 454269295, 455226898, 456228104, 457661743, 459043427, 460611649, 461711006, 463288536, 464942093, 466071777, 467370148, 467678490, 468628349, 469969635, 471427155, 472787209, 474794655, 476871605, 477367020, 478518753, 479635506, 481039963, 481232033, 480902786, 481658401, 481883316, 482580986, 482042694, 480980263, 479680595, 478745308, 478523445, 477061768, 475715103, 475102348, 474970894, 473703995, 472564392, 471883469, 470469170, 469182549, 468030968, 467165031, 465921555, 465820084, 465835190, 465462036, 465465050, 464662971, 464370880, 464007034, 463565788, 462602730, 461464958, 462238350, 463688774, 464189720, 464993935, 467037506]
897.9D67037506J078301k59705j332932p81326l49159o91223Q27942K048835L944321
906.5D71522560L011704J501426J748772J042328K38876j500740j087074j173935n97267
915.2D74706650n48058j705398p30362k062187k885399l815041l972092l419494l846665
923.9D51721954k909088k577438k085266k520943k545166k029839k808418l137741
931.6D31108055k972374k762832k158051l80478K0218j54762p4883m01687m78859j340142
941.3D20404205j376190j219978j089935r78127n75409m6272m52118k30065n40885
949.9D13895226o81000l23982k48795p65648j128387r98650j534347j469117k078209
958.6D04667091k076263k546730k461777j240501k386513j657906j424179j640091
$$ y = [467037506, 468115807, 467856102, 466523170, 465741844, 465392685, 464701462, 465529404, 467578239, 471522560, 474534264, 476035690, 477784462, 478826790, 479065666, 477564926, 476477852, 475303917, 474706650, 474158592, 472453194, 471722832, 469660645, 466775246, 462960205, 458988113, 455568619, 451721954, 448812866, 446235428, 444150162, 441629219, 439084053, 437054214, 434245796, 431108055, 428135681, 425372849, 423214798, 422834320, 422854538, 422699776, 422624893, 422223206, 421744347, 420404205, 419028015, 417808037, 416718102, 415739975, 415164566, 415118294, 414666176, 414436111, 413895226, 413214226, 412890244, 412641449, 411875801, 410747414, 409748764, 408214417, 406745300, 404667091, 402590828, 400044098, 397582321, 396341820, 393955307, 392297401, 390873222, 389233131]
966.3C89233131j007347k079963k405243k482224k033615k621002k958527k034263
974.1C71610947k394257l022880l922959l961029m097977m294090l806114m327316
981.8C41784325m613572m683494m813385m262695l395729k522736l073654l731442
989.5C10687618m094085m280282k865257k679844l136367l342209k940331k170009
997.2B85179234k798691k724400k563381k242889k542477k684307j526928j228352
1004.9B66867809j263218j476192j374531j611614j349163j451760j289176j225644
1012.6B55826511k477893j205769j039238j473885j864700k442284j534099j542854
1020.3B42245789j591511k171002j608696k006778j764775n22327r57699m68540j664448
$$ y = [389233131, 388225784, 386145821, 383740578, 381258354, 379224739, 376603737, 373645210, 371610947, 369216690, 366193810, 362270851, 358309822, 354211845, 349917755, 346111641, 341784325, 337170753, 332487259, 327673874, 323411179, 320015450, 317492714, 314419060, 310687618, 306593533, 302313251, 299447994, 296768150, 293631783, 290289574, 287349243, 285179234, 282380543, 279656143, 277092762, 274849873, 272307396, 269623089, 268096161, 266867809, 265604591, 264128399, 262753868, 261142254, 259793091, 258341331, 257052155, 255826511, 253348618, 252142849, 251103611, 249629726, 247765026, 245322742, 243788643, 242245789, 240654278, 238483276, 236874580, 234867802, 233103027, 232580700, 231623001, 231154461, 229490013]
1029B29490013j279278j114788q06999j45264j168060K07138J84269N87063R04961
1037.7B26859055J301994J586513J067620J254520P5703O80694J77441m47597n81913
1046.4B31974030n30262k4891q81310o351p36790o71444j107864j937657p42969k96517
1056B25037975N88703m65412L04032P98149R03358J761551J138649J347351J148815
1064.7B32563171J799145J582108J838970R85737K52151J097031O42948J214027q0337
1073.4B41894951K85969Q64162M95663M59423l37162P48005J0547K66648N76019J034088
1083B46298313J626301J070328J881790J099796J499386J637039J806221J555119R10167
1091.7B59384460J511536O76003J015052R91326J690826J713867J313839J669865J208229
$$ y = [229490013, 228210735, 227095947, 226288948, 226143684, 224975624, 225182762, 225367031, 225954094, 226859055, 228161049, 229747562, 230815182, 232069702, 232145405, 232826099, 233003540, 232555943, 231974030, 231443768, 231418877, 230537567, 230531216, 229794426, 229122982, 228015118, 226077461, 225334492, 225037975, 225626678, 225161266, 225465298, 226263447, 227166805, 228928356, 230067005, 231414356, 232563171, 234362316, 235944424, 237783394, 238769131, 239021282, 240118313, 240761261, 241975288, 241894951, 242180920, 243045082, 243540745, 244000168, 243663006, 244411011, 244421558, 244688206, 245264225, 246298313, 247924614, 248994942, 250876732, 251976528, 253475914, 255112953, 256919174, 258474293, 259384460, 260895996, 261571999, 262587051, 263578377, 265269203, 266983070, 268296909, 269966774, 271175003]
1100.4B71175003K184486J058655L48110M93260J406212K534504J362743J439495R08165
1109.1B82910633R09042N26600j14422R15165P82929O84166Q56190J217479R58042
1117.7B89645824M63982m32529j193371l15304L83797O3514p98187M10614R39903P24011
1127.4B89892254K067699K141419J264629J141243J915035J158123J209088K063045
1135.1C02852535J864395K185593J583405J928634K534733J702309J198692O37207
1142.8C16487503L77617R64355R79767L81413K95257K75307J94950L95012P36694J29891
1152.5C21217766p38564j79672J02692r1820k46582k38533k33746o25667m70219o90765
1162.1C17804890m14849L84598O52084J222115J761761K075348J953468J987953K293129
$$ y = [271175003, 273359489, 274418144, 274766254, 275259514, 276665726, 279200230, 280562973, 282002468, 282910633, 283819675, 284346275, 284231853, 285147018, 285929947, 286614113, 287470303, 288687782, 289645824, 290109806, 289677277, 288483906, 288168602, 288552399, 288615913, 287817726, 288228340, 289168243, 289892254, 291959953, 294101372, 295366001, 296507244, 298422279, 299580402, 300789490, 302852535, 304716930, 306902523, 308485928, 310414562, 312949295, 314651604, 315850296, 316487503, 316865120, 317829475, 318809242, 319190655, 319485912, 319761219, 319956169, 320351181, 321087875, 321217766, 320479202, 320299530, 320402222, 320310402, 320063820, 319825287, 319591541, 318965874, 318495655, 317804890, 317390041, 317774639, 318426723, 319648838, 321410599, 323485947, 325439415, 327427368, 329720497]
1170.8C29720497K504349J889152J507378K011147K585105L028145L126221L070602
1178.5C49442596K124482J501312J498718J390877J079788P99751R59626J142883J574707
1187.2C61514740J774635O88553p53860k25678k14348j156578o05240l17649n52292
1195.9C60152283n49317l89023p74307j045570j197624k003670j817436j108399q09402
1204.5C50457535r14536r13086m75273m84047m83780l92379k29340l29475o66886m76684
1214.2C45092049n81932l93639j2093j49154n16663n80940j53275n00946o72683n09606
1223.8C41021118n64194l83224n30052m97971n34248p32842r37538p66487m11835r15870
1233.5C34746857j149140q06007j22490N8594J38130J12457q75130q79783m03214Q5297
$$ y = [329720497, 332224846, 334113998, 335621376, 337632523, 340217628, 343245773, 346371994, 349442596, 351567078, 353068390, 354567108, 355957985, 357037773, 357837524, 358797150, 359940033, 361514740, 363289375, 363977928, 363224068, 362998390, 362784042, 361627464, 361022224, 360704575, 360152283, 359602966, 359213943, 358439636, 357394066, 356196442, 354192772, 352375336, 351266937, 350457535, 349542999, 348629913, 348154640, 347670593, 347186813, 346794434, 346565094, 346235619, 345568733, 345092049, 344510117, 344116478, 344104385, 343955231, 343438568, 342857628, 342704353, 342203407, 341530724, 341021118, 340456924, 340073700, 339543648, 339045677, 338511429, 337778587, 336841049, 336074562, 335662727, 334746857, 333597717, 332791710, 332669220, 332727814, 332865944, 332978401, 332103271, 331223488, 330820274, 330905571]
1243.1C30905571P5951j97716j55907o98852o11496n38178l55873k23617m05999j82533
1252.8C27611351k07252m0207j42327J57471L89366K44980K70157k58103n89332m19274
1262.4C27016830J75782K67830N35392J080323R13925P46422N80940O28471M06914
1271.1C32352829M86107R70230R28879N55267Q39844J551742J437531J313629R61075
1279.8C41397133R25560J090507O46553R25332J548156J724358J836510J874733J622390
1288.4C53591232J402703J029701R03969P93266P84340O37283L95470J161499J419830
1297.1C62119293J267090R94415N86319M50554J64986K6550j16691J0757J14326K14310
1306.8C65831909P363K1896K04277k90718m26865o95114p49550l79066j62926j07727
$$ y = [330905571, 330981522, 330783806, 330627899, 329929047, 329317551, 328779373, 328423500, 328199883, 327793884, 327611351, 327404099, 327363892, 327221565, 327379036, 327768402, 328013382, 328283539, 328025436, 327436104, 327016830, 327192612, 327460442, 327995834, 329076157, 329990082, 330736504, 331317444, 331945915, 332352829, 332838936, 333809166, 334738045, 335293312, 336133156, 337684898, 339122429, 340436058, 341397133, 342322693, 343413200, 344059753, 344985085, 346533241, 348257599, 350094109, 351968842, 353591232, 354993935, 356023636, 356927605, 357720871, 358505211, 359142494, 359537964, 360699463, 362119293, 363386383, 364380798, 364967117, 365417671, 365582657, 365609207, 365492516, 365503273, 365617599, 365831909, 365839272, 365861168, 366065445, 365774727, 365347862, 364652748, 363903198, 363524132, 363361206, 363253479]
1316.4C63253479L86658P93838L32833P19108P53441M67453N28564M55704N73578M83513
1326C68748169O99158L73802J79710J40763k27471m73823p15218o07796m81758K83165
1335.7C67918701J13793l11776K64016J90124K91672K58674N29519L67698M58603P75604
1345.3C70856628M57344O96450M24118M02870M2877l02048n65033m97474N1536l32298
1355C71234970J79520P4310p0953l02887p73926o43807p98950l10516r62105j90277
1364.6C67435379K82097j4877K56691m31252o75049o90536p64847o05316M5089J24512
1374.3C64961891n87539K68974K95906K86140l55682m27284l97759j168098j240120
1382.9C61636429j348915q42781n69039o61659j925392j436615n46150j017189j215630
$$ y = [363253479, 363640137, 364433975, 364766808, 365485916, 366239357, 366706810, 367235374, 367691078, 368264656, 368748169, 369447327, 369821129, 370000839, 370141602, 369914131, 369440308, 368725090, 368117294, 367635536, 367918701, 368032494, 367720718, 367984734, 368174858, 368466530, 368725204, 369254723, 369622421, 370081024, 370856628, 371313972, 372010422, 372434540, 372837410, 372880287, 372578239, 372013206, 371515732, 371567268, 371234970, 371414490, 371488800, 371417847, 371114960, 370341034, 369697227, 368898277, 368587761, 367625656, 367435379, 367717476, 367702599, 367959290, 367528038, 366852989, 366162453, 365397606, 364792290, 364837379, 364961891, 364374352, 364643326, 364939232, 365225372, 364869690, 364442406, 364044647, 362876549, 361636429, 360287514, 359444733, 358875694, 358214035, 356288643, 354852028, 354305878, 353288689, 352073059]
1391.6C52073059j808319j198158k057839k983894j335907j365776o81801k031136
1399.3C38610229k169265j319695j858673j996956j952858j364402j448021j111527
1407.1C25388832j323662j842155j090927j073380r47571j166439q92810l45612p10220
1415.7C15996056l38631k82326K50092j519699o60782J201362M63505L11299l38822
1424.4C15082054O94237Q26454L33710R62219O67343J021748O86779J250076J374321
1433.1C22898941J489792J773300P89032Q18787J062431J996689J436386J124954J287041
1441.8C34677353R97124J353798O93893J389847J233330J103782O33545P18689J301537
1450.5C44102898N26199J254921P61299J442223O86416p43217K140541J022110L142204
$$ y = [352073059, 350264740, 349066582, 347008743, 344024849, 342688942, 341323166, 340641365, 338610229, 336440964, 335121269, 333262596, 331265640, 329312782, 327948380, 326500359, 325388832, 324065170, 322223015, 321132088, 320058708, 319111137, 317944698, 317051888, 316706276, 315996056, 315657425, 315375099, 315625191, 314105492, 313444710, 314646072, 315109577, 315420876, 315082054, 315776291, 316602745, 316936455, 317898674, 318566017, 319587765, 320274544, 321524620, 322898941, 324388733, 326162033, 326951065, 327769852, 328832283, 330828972, 332265358, 333390312, 334677353, 335674477, 337028275, 337722168, 339112015, 340345345, 341449127, 342082672, 342801361, 344102898, 344629097, 345884018, 346645317, 348087540, 348773956, 348030739, 350171280, 351193390, 354335594]
1459.1C54335594J429711J878356J546746J203613J815415N71594K729721K128143
1466.8C67638893K677803K238846J868324K668457J612931K737045J994934K680473
1474.6C86117706L041878L226967K845230K232170K235108J850585J883545J517563
1482.3D04950752J422501J432800J055374J117974Q21952O67382J504936M91447m08363
1491D13056755J22833j66015q11882q22754l55683l856277p58209j201096k425575
1499.6D02782097m76494j453629j002464q98399J4000m16565m008370l17916n75028
1508.3C93647232L11089j024247m43992j144943p67785M80957n08613p90177j469192
1517C88290329j229286J88865P25060j027794j658592R99069O58798J577225k5215
$$ y = [354335594, 355765305, 357643661, 359190407, 360394020, 362209435, 362781029, 365510750, 367638893, 370316696, 372555542, 374423866, 377092323, 378705254, 381442299, 383437233, 386117706, 389159584, 392386551, 395231781, 397463951, 399699059, 401549644, 403433189, 404950752, 406373253, 407806053, 408861427, 409979401, 410801353, 411468735, 412973671, 413465118, 413056755, 413179588, 413013573, 412201691, 411378937, 411023254, 407166977, 406408768, 405207672, 402782097, 402305603, 400851974, 399849510, 398951111, 398965111, 398548546, 394540176, 394222260, 393647232, 393958321, 392934074, 392490082, 391345139, 390577354, 391058311, 390549698, 389759521, 388290329, 387061043, 387249908, 387974968, 386947174, 385288582, 386287651, 386946449, 388523674, 388498459]
1525.7C88498459L78761J081505L21159M36364M08477O50750L81813J38321m01497
1534.3C91894112J732444J659775R24149J574135j174126k527847J577835J021804
1542.1C96682281l75709J021538J403808J82038J661377O21566O96297K66724q52509
1550.7D01307411M23470N0239Q13370j020126N50422J511727J479606j124725q619766
1559.4C95371628K029342L74947Q26683o01997p88002k450981k603646q96225j700363
1568.1C89561386m79202o633072k355003j800156l163185k643013k986145j320305
1575.8C68181305j0193977j326333k279167l601112l457794m854737l386344n234108
1583.5C33847733l076783m285316m135513m084416m304886k784462n476742k887458
$$ y = [388498459, 388877220, 389958725, 390279884, 390716248, 391124725, 391775475, 392157288, 392295609, 391894112, 393626556, 395286331, 396210480, 397784615, 396610489, 394082642, 395660477, 396682281, 396306572, 397328110, 398731918, 398913956, 400575333, 401196899, 401893196, 402159920, 401307411, 401730881, 401781120, 402594490, 401574364, 402124786, 403636513, 405116119, 403991394, 395371628, 397400970, 397775917, 398602600, 398000603, 397212601, 394761620, 392157974, 391261749, 389561386, 389082184, 382449112, 380094109, 378293953, 375130768, 372487755, 369501610, 368181305, 357987328, 356660995, 354381828, 350780716, 347322922, 342468185, 339081841, 333847733, 330770950, 326485634, 322350121, 318265705, 313960819, 311176357, 305699615, 302812157]
1591.2C02812157m565735l073731l547516m267692k218647m253998k175388m170246
1599B74539204k209912l188667k656879j745396l586617o73236l083115j134510k537594
1607.6B53723278j185017j160469k531433K60563k257652J83735j655693P3032K39601
1616.3B45689945m096184J550847o16436J162033j588669O16207j34087j034851J658535
1625B43207340k47783K242679l73745J478977K44656O75907J326313l0155J916561
1633.7B50440750j37691K280883r44786K163468J668033J131268J893654K2430K165089
1642.4B60683098J5488J988315J872234k76908K351226j53961K905464J9608K303753
1651B71708317K127132k101936o75736N85556L403740O07167J793708R54380J779061
$$ y = [302812157, 298246422, 295172691, 291625175, 287357483, 285138836, 280884838, 278709450, 274539204, 272329292, 269140625, 266483746, 264738350, 261151733, 260478497, 257395382, 256260872, 253723278, 252538261, 251377792, 248846359, 249106922, 246849270, 247033005, 245377312, 245450344, 245689945, 241593761, 243144608, 242528172, 243690205, 242101536, 242717743, 242583656, 241548805, 243207340, 242959557, 245202236, 244828491, 246307468, 246552124, 247228031, 248554344, 248524189, 250440750, 250303059, 252583942, 251639156, 253802624, 255470657, 256601925, 258495579, 258518009, 260683098, 260698586, 262686901, 264559135, 264282227, 266633453, 266479492, 269384956, 269404564, 271708317, 273835449, 271733513, 271057777, 271643333, 275047073, 275654240, 277447948, 278402328, 280181389]
1659.7B80181389J343288M93527K422809N31597K978364J301231K506809K909985K333908
1668.4B97002907K748127P67879M473286J813488L063526K751885K297229L309975
1676.1C18228302L210754M509774K561454M217186L054352M020157N012589K255439
1683.8C47070007M548607K053032O051941M352646M090462M170379L882027N301666
1691.5C81520767M554672N029603M286117N218163L598518M538536O132736N708885
1699.3D20587997O714936j42327N474892M836731M074402L486137L921700L652534
1707D52607002L134995M356575K903824J918945K569771L022156L105621J244964J724778
1715.6D76588631L539657K622986k386055K535744L321991K155113J858444J229286
$$ y = [280181389, 281524677, 282018204, 284441013, 284972610, 287950974, 289252205, 291759014, 294668999, 297002907, 299751034, 300518913, 304992199, 306805687, 309869213, 312621098, 314918327, 318228302, 321439056, 325948830, 328510284, 332727470, 335781822, 339801979, 344814568, 347070007, 351618614, 353671646, 359723587, 364076233, 368166695, 372337074, 376219101, 381520767, 386075439, 391105042, 395391159, 400609322, 404207840, 408746376, 414879112, 420587997, 427302933, 427160606, 432635498, 437472229, 441546631, 445032768, 448954468, 452607002, 455741997, 460098572, 463002396, 464921341, 467491112, 470513268, 473618889, 474863853, 476588631, 480128288, 482751274, 480365219, 482900963, 486222954, 488378067, 490236511, 491465797]
1723.4D91465797J225548K119637J976318J391258J709290K280426K91557J75057L167610
1732E05802498K829437j041794k129326L935814M295922K412681K448845J124611N3673
1740.7E19732361L854179K944489J200256K137871L784599L232193L016052L922387
1748.4E43824387J766853M174919K652550J159782M341889L096847L212738L456421
1756.2E67686386J607514K476997L133812K449455L277664P88613M04815L235283J996308
1764.8E87056847J926269K300072K283974o55404J735001L812141K88086p79647k79885
1773.5E97687454L855705K533761K16217K487144O80389J094971P54814j17454J284828
1782.2F10477829J716537J939660K04238N62439J328164J337165J068306J336747R44137
$$ y = [491465797, 492691345, 494810982, 496787300, 498178558, 499887848, 502168274, 502459831, 502634888, 505802498, 508631935, 507590141, 505460815, 509396629, 513692551, 516105232, 518554077, 519678688, 519732361, 523586540, 526531029, 527731285, 529869156, 533653755, 536885948, 539902000, 543824387, 545591240, 549766159, 552418709, 553578491, 557920380, 561017227, 564229965, 567686386, 569293900, 571770897, 574904709, 577354164, 580631828, 581420441, 581825256, 585060539, 587056847, 588983116, 591283188, 593567162, 592911758, 594646759, 598458900, 598746986, 597967339, 597687454, 601543159, 604076920, 604293137, 606780281, 607460670, 608555641, 609310455, 609193001, 610477829, 612194366, 614134026, 614338264, 614900703, 616228867, 617566032, 618634338, 619971085, 620915222]
1790.9F20915222J057358n33180q76198L021278J465073L92761J281243J723327O55365
1799.5F29102249j358948J974030O28242N43595J375122N58433J217537P51839P38144
1808.2F35530243R41772J312447n87120M09813J344032O38657J431961L05862R25980
1816.9F42253647J13296L15857J176071J68610Q57773j04752J125870J405563j608200
1825.6F45703735N4169J896362J718216K16904j936569j23368J774216O37665N73273
1834.3F50514603Q27713O51931N67017l97797Q77381L45917O25839M30221Q59299R10416
1843.9F56212540l899155J769333K149200P02057J27945J32981P54470n569N45349
1852.6F58489151N8517M88205M31214K48565N68924j92566J22529k4949O99616r2850
$$ y = [620915222, 621972580, 621439400, 620563202, 623584480, 625049553, 625442314, 626723557, 628446884, 629102249, 627743301, 629717331, 630345573, 630889168, 632264290, 632822723, 634040260, 634792099, 635530243, 636472015, 637784462, 637197342, 637607155, 638951187, 639589844, 641021805, 641327667, 642253647, 642366943, 642682800, 643858871, 644027481, 644885254, 644780502, 645906372, 647311935, 645703735, 645757904, 647654266, 649372482, 649589386, 647652817, 647529449, 649303665, 649941330, 650514603, 651342316, 651994247, 652561264, 652163467, 653040848, 653386765, 654012604, 654442825, 655302124, 656212540, 652313385, 654082718, 656231918, 656933975, 657061920, 657194901, 657949371, 657943802, 658489151, 658547668, 659035873, 659467087, 659715652, 660284576, 660092010, 660214539, 660189590, 660889206, 660796356]
1862.2F60796356J03989N93719L77732J107177k8381P16705n48858j139374N47867
1870.9F62526932R97391J046295k31858N7679j20316O24695N48401K46658J72882o73828
1880.6F65194931L52554m501M70123K30866J74103N24673k40478O88323j32446q38470
1890.2F66419678L3340O05393L16772M20990J30768q20160Q62198L85055K48490k42920
1899.8F68359604m05045P88040M20609N95779q8119M15802K93960j62658l7384m54636
1909.5F69725952k81143k87018Q09326J53656N71900M35180q0261J072006j431732
1918.2F70687866o92367M27704J65557N51911r1934k88315K34298Q41446o4315N9661
1927.8F71831512l47671l68729K58484P6370K83814m55475L92304J67694J09863K06299
$$ y = [660796356, 660900345, 661494064, 661871796, 662978973, 662950592, 663667297, 663118439, 661979065, 662526932, 663524323, 664570618, 664338760, 664396439, 664276123, 664900818, 665449219, 665695877, 665868759, 665194931, 665547485, 665542984, 666013107, 666243973, 666418076, 666942749, 666702271, 667390594, 667258148, 666419678, 666453018, 667058411, 667375183, 667796173, 667926941, 667106781, 667968979, 668354034, 668602524, 668359604, 667954559, 668742599, 669163208, 669758987, 669670868, 670086670, 670380630, 670217972, 670180588, 669725952, 669444809, 669157791, 669967117, 670120773, 670692673, 671127853, 671047592, 672119598, 670687866, 669995499, 670423203, 670588760, 671140671, 671048737, 670760422, 670994720, 671836166, 671771851, 671831512, 671483841, 671115112, 671373596, 671449966, 671733780, 671278305, 671670609, 671838303, 671948166, 672154465]
1937.5F72154465l21579J08032n01785O30874j46484j151199L97720L85361P4997N0048
1947.1F71680450O05240m50439j75018Q316l73841j72195J3504O26144k78549K91061
1956.7F71774673K7543k14692L6545l18756R384o79016K70615L5095J19095N94101
1966.4F71654587m98505j89056M6081L12729n25513j19247M0054k5711N55039l82462
1976F70867996p0419k7847K80914N3253j31912l16239o66427K83661j49231J96991
1985.7F70320740j7548J30692K03705k84195O05468l37677p74383n32608k1057n3940
1995.3F69239197m6082K53601k79083M25491j39083l3494j46560l99323J14823k89154
2005F68700333J74636q8500J27182k71073l05939K84806r9335L3112j97068l4408m13437
$$ y = [672154465, 671832886, 671940918, 671439133, 672070007, 671923523, 670772324, 671170044, 671555405, 671630402, 671680450, 672285690, 671835251, 671660233, 671668549, 671294708, 671122513, 671136017, 671762161, 671483612, 671774673, 671802216, 671587524, 671624069, 671305313, 671314697, 670635681, 670906296, 670941391, 671060486, 671654587, 671156082, 670967026, 671013107, 671325836, 670800323, 670681076, 670721130, 670695419, 671250458, 670867996, 670797577, 670769730, 671050644, 671103897, 670971985, 670655746, 669989319, 670272980, 670123749, 670320740, 670303192, 670433884, 670637589, 670353394, 670958862, 670621185, 669846802, 669314194, 669293137, 669239197, 669193115, 669446716, 669167633, 669593124, 669454041, 669420547, 669273987, 668874664, 668989487, 668700333, 668874969, 668786469, 668913651, 668642578, 668336639, 668621445, 668522110, 668555222, 668358154, 668323746, 667910309]
2015.6F67910309r9640n21774n75638M08096k34985M6310k78702Q088o0502k22702
2025.2F66378860O2180m09393L00979k16674q1177j90659m00696K4109N1651K59705
2034.9F65778885o75888l11051l74832q0108l9978o00281J55945j25275J11160j31225
2044.5F63707352K06222l2196l83224K15530l53851p7515l36380L15018K22244m02832
2054.1F63080368r5215k42996K23694l59726j2360j0757k02561j90048m9362P05109
2063.8F62846146m49067l53775k38037j754K98996r3155m1428l32108J56022n16663
2073.4F61275177m17633q4610K29111O19659k24838m349l26996J67160K9450k90299
2083.1F60971832J02539j97067k40784q22372j9760j74332m9972L01208l07236K69699
$$ y = [667910309, 667810669, 667288895, 666713257, 667121353, 666886368, 666932678, 666653976, 666662064, 666601562, 666378860, 666441040, 666031647, 666332626, 666115952, 666034775, 665844116, 665443420, 665467529, 665519180, 665778885, 665102997, 664791946, 664417114, 664337006, 664297028, 663696747, 663852692, 663727417, 663838577, 663707352, 663913574, 663881378, 663498154, 663713684, 663359833, 663282318, 662945938, 663260956, 663483200, 663080368, 662985153, 662742157, 662965851, 662606125, 662593765, 662583008, 662380447, 662190399, 662141037, 662846146, 662397079, 662043304, 661805267, 661803513, 662102509, 662009354, 661967926, 661635818, 661791840, 661275177, 660857544, 660772934, 661002045, 661621704, 661396866, 661392517, 661065521, 661232681, 661262131, 660971832, 661074371, 660877304, 660636520, 659814148, 659794388, 659620056, 659570084, 659871292, 659564056, 659833755]
2092.7F59833755r6893N4779k46277l73916l69797k92282L51181k26898m3717k23465
2102.4F58366470j01013j37405r2621m8599p83005q2245J9989j88217l83148K57263
2112F56827469J89514m21753L5095n61676K9908K19192k40250l80020J08490L28522
2121.6F56134491m32892J42899j10703k1362j16730o027N9509n85785K93808k01492
2131.3F55155716q9111J51291K23159K91443n07278k35291k66647J93252k43148k74201
2140.9F54399185K67639L87879L54385l97339M62647N4550l49274l39126k82135M85687
2150.6F55044098j01395j15204j38626O04325M45861k93426j10016l32565j18637m12903
2160.2F54471512K88925L02124p6981m5700k20184K25143o2332P9880j20239K45132
$$ y = [659833755, 659736862, 659791641, 659545364, 659171448, 658801651, 658509369, 658860550, 658633652, 658589935, 658366470, 658265457, 658128052, 658035431, 657986832, 657203827, 657121582, 657141571, 656953354, 656570206, 656827469, 657016983, 656595230, 656630325, 656068649, 656098557, 656317749, 656077499, 655697479, 655805969, 656134491, 655701599, 655844498, 655733795, 655712433, 655595703, 655589676, 655649185, 655063400, 655357208, 655155716, 655066605, 655217896, 655441055, 655732498, 655225220, 654989929, 654723282, 654916534, 654673386, 654399185, 654666824, 655054703, 655409088, 655011749, 655474396, 655528946, 655179672, 654840546, 654558411, 655044098, 654942703, 654827499, 654688873, 655293198, 655739059, 655445633, 655335617, 655003052, 654884415, 654471512, 654760437, 655062561, 654985580, 654939880, 654719696, 654944839, 654882507, 654962387, 654842148, 655087280]
2169.9F55087280M0894l14255L08228j65558j42670k39334N93109M87824k09427j88980
2179.5F55257111m44718L70102M9744J93023K32163J24512p859k70614N11932l93066
2189.1F55622330l83759J4725K3575J65176K34757N41381L6240K518l61328O3781j35803
2199.8F55823593l74985J92948k289O05392J24588j50680m00696P5302P07016j34353
2209.4F56465836j93253m42505K41242L93905L31497n4321l87726K74735l77121l6316
2219F56215973k63443j62430Q4839L6392O57807P1411J58081k73209p9040r0104k49099
2229.7F56107178J80053k99377P7286j46942L74450M21372J25274k1591n38864o4850
2239.3F56213989o39724j67466k5634N8822J32981j38474P13959n8518j73874O1875
$$ y = [655087280, 655128174, 654813919, 655122147, 654956589, 654813919, 654574585, 655167694, 655655518, 655446091, 655257111, 654812393, 655182495, 655232239, 655425262, 655657425, 655781937, 655774078, 655503464, 656015396, 655622330, 655238571, 655253296, 655276871, 655442047, 655676804, 656218185, 656254425, 656256943, 655895615, 655959396, 655823593, 655448608, 655641556, 655639267, 656244659, 656369247, 656218567, 655817871, 655893173, 656600189, 656465836, 656272583, 655830078, 656071320, 656465225, 656796722, 656742401, 656354675, 656629410, 656252289, 656215973, 655952530, 655790100, 655874939, 655911331, 656569138, 656640549, 656798630, 656525421, 656446381, 656356277, 656107178, 656287231, 655987854, 656065140, 655918198, 656292648, 656714020, 656839294, 656817703, 656278839, 656213989, 655574265, 655406799, 655381165, 655439987, 655572968, 655434494, 656148453, 656089935, 655916061, 655977936]
2248.9F55977936J9455o32248n41229O13098k3194N494L4027M30984J06583l74146
2258.6F55616760N7221k38037r5597m86602j374L0823K47574M51965k35367j1902m31137
2269.2F54904327J65940l00370n64193k6627j0452N62210n6076K91824J7929m75158
2278.8F54509354k11106J42288J07346q42132k11411O104K12402l4180l07846j01547
2288.5F53269272n8975L98712n33219N6229O6834l83759j33972j93634N92575l64533
2298.1F52715530m47464n41915l07007L25775l12119J11618j73263k13852l78342P3853
2307.8F50852814J61056n34286P5989L3874o9733o94122R232p9041q52585j67923p4920
2318.4F48660355K73437n61981l41721j87606L2501M85306J97753K10877o70776j3886
$$ y = [655977936, 655997391, 655365143, 654823914, 655437012, 655413818, 655419312, 655453339, 655884323, 655990906, 655616760, 655673981, 655435944, 655340347, 654853745, 654852371, 654883194, 655130768, 655582733, 655347366, 655335464, 654904327, 655070267, 654769897, 654205704, 654179077, 654168625, 654730835, 654674759, 654966583, 654984512, 654509354, 654298248, 654440536, 654547882, 653705750, 653494339, 653500443, 653712845, 653678665, 653370819, 653269272, 653210297, 653609009, 653075790, 653132019, 653198853, 652815094, 652681122, 652487488, 653080063, 652715530, 652268066, 651726151, 651419144, 651744919, 651432800, 651544418, 651371155, 651157303, 650778961, 650852814, 651013870, 650479584, 650555573, 650589447, 650519714, 649825592, 649834824, 649755783, 648903198, 648735275, 648660355, 648933792, 648371811, 648030090, 647842484, 647874985, 648360291, 648558044, 648768921, 648098145, 648084259]
2328F48084259q14438l39584j2512q48465j48468m22516J180725p6599j264725n96924
2337.7F44740753J32675J99890l85131Q02230n56030k72522o23321l6164N25055o46972
2347.3F43880463O40487M16794K69623q73947j155167Q9417k26212n82504j329270
2356F41129684J184159O99081n33676j274109r15680P7439j371499M77105j0529J137543
2365.6F40599518P53860R1477Q09555o53076l73764j219788n11665j65024M15687M50592
2375.3F40197372q31527j42594J48087K80113k92511J4038M1008n53131k93579l61176
2384.9F38206100r0942n86548j86348K46544j24626j98288n43747k05879l74298k09618
2394.6F35932350j15166k78549m77981n62554J56365j93138m04931j69296K57416k09618
$$ y = [648084259, 647269821, 646930237, 646917725, 646069260, 645920792, 645498276, 646679001, 646602402, 645337677, 644740753, 644873428, 645073318, 644688187, 645490417, 644934387, 644661865, 644038544, 644002380, 644527435, 643880463, 644520950, 644937744, 645207367, 644333420, 643178253, 643267670, 643041458, 642458954, 641129684, 642313843, 643012924, 642479248, 641205139, 640289459, 640366898, 638995399, 639472504, 639461975, 640599518, 641353378, 641444855, 642254410, 641601334, 641227570, 640007782, 639496117, 639331093, 639746780, 640197372, 639365845, 639223251, 639371338, 639651451, 639358940, 639372978, 639413986, 638860855, 638567276, 638206100, 638115158, 637528610, 637342262, 637588806, 637464180, 637265892, 636722145, 636516266, 636141968, 635932350, 635817184, 635538635, 635060654, 634498100, 634654465, 634461327, 634056396, 633887100, 634144516, 633934898]
2404.2F33934898o24618j30730m97360m59061o43692l07235r1744j59950M6615l61824
2413.8F30705299n63583o48041K33574k25983n38063j05476o75087k29568k27356j93329
2423.5F27532387m82598l58467j8730n33867n75905q57811k35786l09563n73692j48201
2433.1F23437767p7248L9063r8496K10762l54576q18939o68526n00831n81780n26161
2442.8F20061035K67258k31056l80364m9667p9689o14472r33990n81780p27539k90870
2452.4F16438866k99721k6512l56331o00586K74391j81999l61099q23212m79965j21460
2462.1F13462372o22139o06499p32536O1416k85453o16188p7668j12915m25567p75032
2471.7F09269791l59841m43306l93982k55317l49121n96161o67153m51545o36864k74239
$$ y = [633934898, 633310280, 633179550, 632682190, 632223129, 631579437, 631272202, 631180458, 631020508, 631067123, 630705299, 630141716, 629493675, 629727249, 629501266, 628963203, 628857727, 628182640, 627953072, 627725716, 627532387, 627049789, 626691322, 626672592, 626138725, 625562820, 624705009, 624469223, 624159660, 623585968, 623437767, 623360519, 623399582, 623301086, 623511848, 623157272, 622338333, 621669807, 621168976, 620587196, 620061035, 620328293, 620097237, 619716873, 619667206, 619587517, 618973045, 618039055, 617457275, 616729736, 616438866, 616139145, 616112633, 615756302, 615155716, 615430107, 615248108, 614887009, 614063797, 613583832, 613462372, 612840233, 612233734, 611501198, 611562614, 611277161, 610660973, 610583305, 610470390, 610044823, 609269791, 608909950, 608466644, 608072662, 607817345, 607468224, 606872063, 606204910, 605753365, 605116501, 604842262]
2481.3F04842262l86162k99263n35049o02379J3771o20384p44247n92766l50991m67529
2491F00257263n27801k39296m79927l27988m16222k10189l60795n16586n30548p01637
2500.6E95946274o67534q40721p3700j3466j71356n32646q51975l86848q61245p30285
2510.3E90816498m55742l06969l95012k30064O2714m35105l13072n31082l81813l11852
2519.9E87518501o32362p11823o70089l89176m00657O5193j45722l16276o14853p84264
2529.6E82918472n09834q70819l29475l80440j27449n5390m05883k7276k95410n59425
2539.2E79357071j192436n13993j25236n46532k12631m01726m28238n46684M4136j18980
2548.9E75314751p89185q68530p51572j75171m82826l72696n13916m19311j65902k68783
$$ y = [604842262, 604456100, 604156837, 603621788, 603019409, 603033180, 602412796, 601668549, 601075783, 600724792, 600257263, 599729462, 599490166, 599010239, 598682251, 598266029, 598055840, 597695045, 597178459, 596647911, 595946274, 595278740, 594438019, 594364319, 594350853, 594179497, 593646851, 592794876, 592408028, 591546783, 590816498, 590360756, 590053787, 589658775, 589428711, 589491425, 589056320, 588743248, 588212166, 587830353, 587518501, 586886139, 586174316, 585504227, 585115051, 584714394, 584779587, 584633865, 584317589, 583702736, 582918472, 582408638, 581537819, 581208344, 580827904, 580700455, 580645065, 580239182, 580211906, 579916496, 579357071, 578164635, 577650642, 577525406, 576978874, 576766243, 576364517, 575936279, 575389595, 575433731, 575314751, 574525566, 573657036, 572905464, 572730293, 572247467, 571874771, 571360855, 570941544, 570775642, 570506859]
2558.5E70506859M8675l66974m26635r35745o91109l7880k65389k62756n30815l31841
2568.1E66706390m13398m59481p76863p71217k72484k82173j39313o96487m48952r5100
2577.8E62350922J4419q5907o80351m64134m93164n04952p58934l90358k33612m07066
2587.4E58346863j13487n79491l28140m65279n82771n58739m94614j26037m11644j69907
2597.1E54516754o26755p65800m61693l79372l25965o50597n29938n05829k4566l07808
2606.7E49938431n94559o52771r04045l16811o29463n41839m37279l80058j31798n19371
2616.4E44830437m14124n06821p01637o89697l72429q52356q80775R1819k23808o38122
2626E39642487n21851q1024m08135q60824p47910p37762p06482q28743m21028l27950
$$ y = [570506859, 570555534, 570188560, 569761925, 568826180, 568135071, 568097191, 567831802, 567569046, 567038231, 566706390, 566292992, 565833511, 565056648, 564285431, 564012947, 563730774, 563591461, 562894974, 562446022, 562350922, 562365341, 562279434, 561599083, 561134949, 560641785, 560136833, 559377899, 558987541, 558753929, 558346863, 558233376, 557653885, 557325745, 556860466, 556277695, 555718956, 555224342, 555098305, 554686661, 554516754, 553889999, 553124199, 552662506, 552283134, 551957169, 551306572, 550776634, 550270805, 550246239, 549938431, 549343872, 548691101, 547787056, 547470245, 546840782, 546298943, 545861664, 545481606, 545349808, 544830437, 544416313, 543909492, 543207855, 542518158, 542145729, 541293373, 540412598, 540504417, 540280609, 539642487, 539120636, 539039612, 538631477, 537770653, 537022743, 536284981, 535578499, 534749756, 534328728, 534000778]
2635.6E34000778j335j50833o56548m76036p78732o12450q02688n86739r6969m00925
2645.3E29437523o25038n80597k18353n84298m70810k49862l61824p20787q63762k38037
2654.9E24524155o38543m62455k65122l69262l37105m38080J8387l59688o18591p57218
2664.6E20296478n00641n6877j95694m71954p35893j04027l21350m66042k12517l08227
2674.2E16923256j61133n02281m30565m31747l81623l07350m20036m63677j36604K47269
2683.9E13935509p27730r14002k39295j13678o77987o78863Q4114k86331l71285k28424
2693.5E09782028k31170k82364k86599l16886p56913n38826m02755j89515j66320k72103
2703.1E06338577k84958j72538J17187n36079o33927m98962l73802l92914m57153j68877
$$ y = [534000778, 533999443, 533848610, 533192062, 532716026, 531937294, 531324844, 530522156, 529935417, 529838448, 529437523, 528812485, 528231888, 528013535, 527429237, 526958427, 526708565, 526346741, 525625954, 524762192, 524524155, 523885612, 523423157, 523158035, 522788773, 522451668, 522013588, 522031975, 521672287, 521053696, 520296478, 519795837, 519738960, 519543266, 519071312, 518335419, 518231392, 517910042, 517444000, 517231483, 516923256, 516762123, 516259842, 515829277, 515397530, 515015907, 514708557, 514288521, 513824844, 513688240, 513935509, 513207779, 512293777, 512054482, 511940804, 511262817, 510583954, 510668068, 510381737, 510010452, 509782028, 509550858, 509268494, 508981895, 508665009, 507908096, 507369270, 506966515, 506777000, 506610680, 506338577, 506053619, 505881081, 505998268, 505462189, 504828262, 504329300, 503955498, 503562584, 503105431, 502936554]
2712.8E02936554m67720j31149k21024l32375j39770k5177j59340j064186m77715n1460
2722.4D99866638q9569r0561l45459k46887m99039j47171l6163j94969n06783p43484
2732.1D96966553l96614j45378P1754k87018j46141L2005m2114k80342n73387q6517
2741.7D95112801k14119l77274m58031m54521k8839K39792M4861j75324P973m20952
2751.4D93276367n35354n41649j99166J01433n34859n59349m28924Q8768j3733n32112
2761D90121422m79088l82195j78375n54657k93350j14021m00811k45170J3504k9602
2770.7D87457657k55737j52131o36100m29535m97589r23729l25318m06418m96749m49410
2780.3D82884941J03150J08985o62956o29883n88760k97661l60489l69415k84615n98602
$$ y = [502936554, 502468834, 502337685, 502116661, 501784286, 501644516, 501619339, 501459999, 500395813, 499918098, 499866638, 499777069, 499686508, 499341049, 499094162, 498595123, 498447952, 498411789, 498216820, 497710037, 496966553, 496569939, 496424561, 496496315, 496209297, 496063156, 496095161, 496053047, 495772705, 495199318, 495112801, 494898682, 494521408, 494063377, 493608856, 493580017, 493819809, 493864670, 493689346, 493697319, 493276367, 492741013, 492199364, 492000198, 492101631, 491566772, 491007423, 490578499, 490667267, 490653534, 490121422, 489642334, 489260139, 489081764, 488527107, 488233757, 488119736, 487718925, 487473755, 487487259, 487457657, 487201920, 487049789, 486413689, 485984154, 485486565, 484562836, 484237518, 483831100, 483334351, 482884941, 482988091, 483097076, 482434120, 481804237, 481215477, 480917816, 480557327, 480187912, 479903297, 479304695]
2789.9D79304695m42009m49066o90537o43768n70869o98433m40521l94249o05507n22957
2799.6D73846779m79698n64652o54411m30832n04036n01518q50067j056519q37288
2808.3D67967758p81326n3101m71039p92884p26776q49305n14412j036644p32536n88035
2817.9D61421700o90003n79796r60350o23741n16434m02450n71022r37996r17854q20961
2827.6D54401093r58558j247482q59680o69556m12140p59658j295128q84896q89091
2836.2D46424904j040497j073189j229171j527520j230468j119614j502991j742592
2843.9D35958862j908531j627388j751747j244965j198082j956138k140694k143173
2851.7D21988144r01680m31328n70526k69775l43666k57645k88391l91846m64973k5864
$$ y = [479304695, 478862686, 478413620, 477723083, 477079315, 476508446, 475810013, 475369492, 474975243, 474369736, 473846779, 473367081, 472802429, 472148018, 471717186, 471213150, 470711632, 469861565, 468805046, 467967758, 467186432, 467133331, 466662292, 465869408, 465142632, 464293327, 463778915, 462742271, 462009735, 461421700, 460731697, 460151901, 459191551, 458567810, 458051376, 457648926, 457077904, 456139908, 455222054, 454401093, 453442535, 452195053, 451335373, 450665817, 450253677, 449494019, 448198891, 447313995, 446424904, 445384407, 444311218, 443082047, 441554527, 440324059, 439204445, 437701454, 435958862, 434050331, 432422943, 430671196, 429426231, 428228149, 426272011, 424131317, 421988144, 421086464, 420655136, 420084610, 419814835, 419471169, 419213524, 418925133, 418533287, 418068314, 418042450]
2861.3D18042450j66550l71437k72903p38716o41938n51643o32477r97810j035729
2870D12633247q52584p78962l51867n75104p04918r44672r68704n01556k49329m07104
2879.6D06298447r73587p63092q44689r69696m89159o10198j085701j040917o36215
2888.3C98885193p28798r85146j079177n48172m24424p75833p26318r04885q71734
2897C91840706r59435o43158m65316n23491m01459q05550q19320p92771k38151m63753
2906.6C85728302j134987o85615q49152r26437j123658j223487j222992j323548j106872
2915.3C76131554j152001q97331j319542j376266o33278q08525j203995j067352o66390
2924C67006874l00140Q3351o8512j29471j41106r7541Q6059l24135k36396K41622M69666
$$ y = [418042450, 417875900, 417504463, 417231560, 416492844, 415850906, 415299263, 414666786, 413668976, 412633247, 411780663, 411001701, 410649834, 410074730, 409369812, 408425140, 407456436, 406954880, 406705551, 406298447, 405324860, 404561768, 403717079, 402747383, 402258224, 401648026, 400562325, 399521408, 398885193, 398156395, 397171249, 396092072, 395543900, 395119476, 394343643, 393617325, 392712440, 391840706, 390881271, 390238113, 389772797, 389249306, 388847847, 388042297, 387222977, 386430206, 386192055, 385728302, 384593315, 383907700, 383058548, 382132111, 381008453, 379784966, 378561974, 377238426, 376131554, 374979553, 374082222, 372762680, 371386414, 370753136, 369944611, 368740616, 367673264, 367006874, 366706734, 366790085, 366721573, 366592102, 366450996, 366353455, 366439514, 366115379, 365878983, 366120605, 366590271]
2934.6C66590271K43797M74320Q17833M54902N70221O46248M15001M80614J019134
2943.3C71712341M92134q6898N34324N89562Q53996O73523N65872J012001O02493J71090
2952.9C77120438m4594L547K41433Q12339R60846N61715J76277O17256J306572L90167
2962.6C82145996K0409N69420J042251N09377K56843R31053K47040M94881O16913K24075
2972.2C87058258P99179J043320R19418L36228K19345J47133M62570M56466L48854
2980.9C91790771O79513k79503p8583M98924L43514J74942K70118O06652j45645j18943
2990.5C93741760J45378M9057j46865m42544l4370n2566m6311q9378l63083o32477
3000.2C92128601p37076m82673k43531j21650m41933m34952l04680k17781k37961o14852
$$ y = [366590271, 366834068, 367308388, 368126221, 368581123, 369151344, 369797592, 370212593, 370693207, 371712341, 372204475, 372117577, 372651901, 373241463, 374095459, 374768982, 375334854, 376346855, 376949348, 377120438, 377075844, 377079391, 377320824, 378133163, 379094009, 379655724, 379832001, 380449257, 381755829, 382145996, 382166405, 382735825, 383778076, 384287453, 384544296, 385475349, 385722389, 386217270, 386834183, 387058258, 387857437, 388900757, 389820175, 390156403, 390375748, 390522881, 390985451, 391441917, 391790771, 392470284, 392190781, 392112198, 392611122, 392954636, 393129578, 393399696, 394006348, 393860703, 393741760, 393887138, 393936195, 393789330, 393346786, 393312416, 393259850, 393213539, 393124161, 392761078, 392128601, 391391525, 390908852, 390665321, 390543671, 390101738, 389666786, 389362106, 389144325, 388906364, 388291512]
3009.8C88291512p88727m72412l35007r93347o46210j76506m45557n36079n93796n87997
3019.5C82715874q45452q04786p77359l03955j26152q15850j285095j339035k44751
3028.1C76173439k98233o41747l81393p79953o22749r33304r83772p04308o89354p93838
3037.8C69344788q56553m95681o59142q71963j048699m66232k30293q24395p26928
3046.5C63164902q09784q70209j073914q62236p06253p08923k40326n04417n83458
3055.1C56805382r16901j110611n61027p44782j211166j021958n54924o34956o10237
3063.8C49438820n91660l74336k34718o77452o87905q87527p59888m61311o65703o58112
3073.5C43440208p35206l88489r3384q29086r26170m35868q55522p93915l61023m88472
$$ y = [388291512, 387502785, 387030373, 386695366, 385702019, 385055809, 384879303, 384433746, 383897667, 383303871, 382715874, 381870422, 381065636, 380288277, 379984322, 379858170, 379042320, 377757225, 376418190, 376173439, 375875206, 375233459, 374852066, 374072113, 373449364, 372516060, 371532288, 370827980, 370138626, 369344788, 368488235, 367992554, 367333412, 366461449, 365412750, 364946518, 364716225, 363891830, 363164902, 362355118, 361484909, 360410995, 359548759, 358842506, 358133583, 357893257, 357388840, 356805382, 355888481, 354777870, 354216843, 353472061, 352260895, 351238937, 350684013, 350049057, 349438820, 348847160, 348472824, 348238106, 347560654, 346872749, 345985222, 345225334, 344764023, 344098320, 343440208, 342705002, 342316513, 342223129, 341394043, 340467873, 340032005, 339176483, 338382568, 338021545, 337533073]
3083.1C37533073n79300n58013o00510p86476n72739n89752n93147n99823q42209l63388
3092.7C31447716p11098j016388l34396m15840p89528l53737j7510n88493j041832
3101.4C26178894r42001l30811m33998o47240m62417o78330k51198p01103q64944m06571
3111.1C20460281p09266n66025p22580n21927p00474q90903l59535o16150q67291r85317
3120.7C13520813n67951m29096o90709o76059q84037n54810m93984o58817m38748m14753
3130.4C07711849n84354p36065q65097q12378q68511r57604l84941l14102m50268m04320
3140C01334209o28547p92351j033783p65762o62651l58315l2997o58302j131611j210213
3149.6B94059677n03921J08738l76034j175766j216049p33471n31864p57924j265659
$$ y = [337533073, 336953773, 336395760, 335795250, 335008774, 334436035, 333846283, 333253136, 332653313, 331811104, 331447716, 330736618, 329720230, 329385834, 328969994, 328180466, 327826729, 327809219, 327220726, 326178894, 325236893, 324906082, 324472084, 323824844, 323362427, 322684097, 322432899, 321731796, 320866852, 320460281, 319751015, 319184990, 318462410, 317940483, 317240009, 316349106, 315989571, 315373421, 314506130, 313520813, 312952862, 312523766, 311833057, 311156998, 310272961, 309718151, 309224167, 308565350, 308126602, 307711849, 307127495, 306391430, 305526333, 304713955, 303845444, 302887840, 302502899, 302188797, 301738529, 301334209, 300705662, 299913311, 298879528, 298113766, 297451115, 297092800, 297059803, 296401501, 295269890, 294059677, 293555756, 293664494, 293288460, 292112694, 290896645, 290163174, 289631310, 288873386, 287607727]
3158.3B87607727o44302j69602m45461n43880j004792o35547O4773l18203j111240
3167B82799473j041374p34024l64571J50223o36006j049022n28431n19276j077614
3175.7B76999378p70206R5749n31311r55105q49591m79774r1267p86018r70840q29506
3185.3B70831509p73697n37186o13213o17904m01554m10710o11152q04901n94349o9447
3195B65397396m20055o28281n82294n81494k65484p51800q29373n38387m91600n63354
3204.6B59745274n52674n5790l37658o94084o37417l89480l54443m08783k27413p18842
3214.3B55368690m64363k87704p14798n40676n70069m33483k76203n60703q55675m90913
3223.9B50174103j09329k91653m86088m83684j57338n10540o09951l03554n91374l00445
$$ y = [287607727, 286963425, 286793823, 286348362, 285804482, 284799690, 284164143, 284228916, 283910713, 282799473, 281758099, 281024075, 280659504, 280809727, 280173721, 279124699, 278596268, 278076992, 276999378, 276229172, 276324921, 275793610, 274838505, 273988914, 273509140, 273417873, 272631855, 271661015, 270831509, 270057812, 269520626, 268907413, 268289509, 267887955, 267477245, 266866093, 266061192, 265466843, 265397396, 264977341, 264349060, 263766766, 263185272, 262919788, 262167988, 261338615, 260800228, 260308628, 259745274, 259192600, 259136810, 258799152, 258105068, 257467651, 257078171, 256723728, 256314945, 256087532, 255368690, 254904327, 254616623, 253901825, 253361149, 252791080, 252357597, 252081394, 251520691, 250665016, 250174103, 250064774, 249773121, 249287033, 248803349, 248646011, 248135471, 247525520, 247221966, 246630592, 246330147]
3233.5B46330147k39620o51093n91679m86583m98562l02258l18603n74551l79963k20489
3243.2B42066746q5182q1730n40486r37557q79459j79825J81961k14634n82275m13609
3252.8B38333950k92606o07033o07224l55987k58465j75953j32179o34289j022472
3261.5B34247742m49505K5654k44122l28159m4041k21157p7667J84326l61938p67708
3271.2B31963425o46096l0269K7389n15079k98424k29168m49104m40769l32222q5736
3280.8B28963947j6384j27334n36843o66942l52860l49388k17648k69565k00119K50893
3290.4B26477757j51959m14715k97661k77366j21689k23904k27775l45745k71130j95389
3300.1B23950424j84212J13030j40648m5204Q011k78912j19552j78433m31709o32611
$$ y = [246330147, 246090527, 245439434, 244847755, 244361172, 243862610, 243560352, 243241749, 242667198, 242287235, 242066746, 241981564, 241899834, 241359348, 240421791, 239542332, 239362507, 239544468, 239329834, 238747559, 238333950, 238041344, 237434311, 236827087, 236471100, 236212635, 236036682, 235904503, 235270214, 234247742, 233798237, 233823891, 233579769, 233251610, 233207569, 232986412, 232908745, 233093071, 232731133, 231963425, 231317329, 231287060, 231314449, 230799370, 230500946, 230271778, 229822674, 229381905, 229049683, 228963947, 228947563, 228820229, 228283386, 227616444, 227263584, 226914196, 226696548, 226426983, 226226864, 226477757, 226325798, 225911083, 225613422, 225336056, 225214367, 224990463, 224762688, 224416943, 224145813, 223950424, 223766212, 223879242, 223738594, 223693390, 223701401, 223422489, 223302937, 223124504, 222692795, 222060184]
3309.7B22060184m14638m28791l84483M9686k61955m45423j53790k7504l77216m09241
3319.4B19206829l9120m25224q86364n64327K91023P7820n10922m60243p57255n93701
3329B15338516n75237o36158L5477M82959p4405j150437q80947n8021K98996j04866
3338.7B12675877p70531o74610o93131k10209j04179m16946j09425m59557k26306J53427
3348.3B09164410j53828m48570o66676j95236k62833k86541N04647K83851n90076o52905
3357.9B06696243p8163P000j57986j77421m37603l34664Q7224J16519j84001l52097
3367.6B05185051m40865k70156K48661J32217j80283j34468k48928L1472J74865j48620
3377.2B04348946k5902J06029j64318m58584j49269K08893J21174o9542o24504m72279
$$ y = [222060184, 221645546, 221216755, 220832272, 220881958, 220620003, 220174580, 220020790, 219993286, 219616070, 219206829, 219167709, 218742485, 217856121, 217291794, 217582817, 217660637, 217149715, 216689472, 215932217, 215338516, 214763279, 214127121, 214162598, 214645557, 214571152, 213420715, 212539768, 212481747, 212780743, 212675877, 211905346, 211230736, 210537605, 210327396, 210223217, 209806271, 209696846, 209237289, 209010983, 209164410, 209010582, 208562012, 207895336, 207700100, 207437267, 207150726, 207655373, 207939224, 207349148, 206696243, 206618080, 206625080, 206467094, 206289673, 205852070, 205517406, 205604630, 205721149, 205537148, 205185051, 204744186, 204474030, 204722691, 204854908, 204674625, 204540157, 204291229, 204322701, 204497566, 204348946, 204323044, 204429073, 204264755, 203806171, 203656902, 203865795, 203986969, 203917427, 203292923, 202820644]
3386.9B02820644K14539M30241J71642k08969J29432j56669m84162M77j31740q7929
3396.5B02697506k47936q3676P10736K16369l77731K05212K82077k90393O1073K74258
3406.2B03447495O5002L16734J96800j58748k99683q1291J53198M16527N10616j583
3415.8B04565067j93100k48851J03111M94118K47840J46122J42880N62363M55818j57872
3425.5B06117496k17285M2248P49512P54108L0003l8834O79741O19850p4100L66421
3435.1B09029160J51195m16222M61045R96723K82822j70231M44088M04415j50356J60484
3444.7B11193123Q06217P64847q4419L53603N33600j36051M27551R66339O47030L42655
3454.4B15814495M02870O49834Q36887P07588L28160L20167N33677P74269M03366o2142
$$ y = [202820644, 203035183, 203465424, 203637066, 203428097, 203557529, 203400860, 202916698, 202917175, 202785435, 202697506, 202449570, 202365894, 203076630, 203292999, 202915268, 203120480, 203402557, 203112164, 203173237, 203447495, 203512497, 203829231, 204026031, 203867283, 203567600, 203486309, 203639507, 204056034, 204566650, 204565067, 204371967, 204123116, 204226227, 204720345, 204968185, 205114307, 205257187, 205819550, 206275368, 206117496, 205900211, 205942459, 206691971, 207446079, 207476082, 207437248, 208116989, 208736839, 208662739, 209029160, 209180355, 208764133, 209225178, 210221901, 210504723, 210334492, 210778580, 211182995, 211032639, 211193123, 211999340, 212764187, 212679768, 213033371, 213566971, 213430920, 213858471, 214824810, 215471840, 215814495, 216217365, 216867199, 217704086, 218411674, 218739834, 219060001, 219593678, 220367947, 220771313, 220709171]
3464B20709171L31192O91243O09626M51107R07383R40209K04887J78948N13401P29732
3473.7B26266899P45583O42528N88932L87268K60334N95112J053887J022014N17845
3482.3B32080402O1837O32743J092225Q04443N34859M39834J066513J042214P73849
3491B38528919R25713J86539j00670N16452J033135Q13084L36875J012688J266823
3499.7B44519558O59580J322727J403675R7542L84884P22027N34992P85427J388722
3508.4B51819134J190014J49116O30150Q76808J213017J226043O02532R27505M88301
3517.1B59122620P64255J302166O78768O96144R46484J211662R86557R45034J179829
3525.7B67833519P33604P94220J420422Q73528M80556J018200J445274J421986O47735
$$ y = [220709171, 221040363, 221731606, 222341232, 222792339, 223699722, 224639931, 224844818, 225023766, 225537167, 226266899, 227012482, 227655010, 228243942, 228631210, 228891544, 229486656, 230540543, 231562557, 232080402, 232142239, 232774982, 233867207, 234671650, 235206509, 235646343, 236712856, 237755070, 238528919, 239454632, 239641171, 239540501, 240056953, 241090088, 241903172, 242240047, 243252735, 244519558, 245179138, 246501865, 247905540, 248003082, 248387966, 249109993, 249644985, 250430412, 251819134, 253009148, 253158264, 253788414, 254665222, 255878239, 257104282, 257706814, 258634319, 259122620, 259886875, 261189041, 261867809, 262563953, 263510437, 264722099, 265708656, 266653690, 267833519, 268567123, 269361343, 270781765, 271655293, 272135849, 273154049, 274599323, 276021309, 276669044]
3534.4B76669044J142922J126137N54580J469994J146793J146336R92699J078968J270523
3543.1B86597996J447296K007580R07669J676769L97701K67029K147961J810302J620255
3551.8B98880558J08604J378117J798630J038627J428891O88152K112942J957893J007500
3560.5C10399914P44209J335487J598874J221427L419304R85146L79028J310845L79181
3569.1C21773415L094558J563492J466332J936874J404152Q83217J280479K701988
3576.9C36104507R98879K087936K329560R36813J563110J781197J994514J360894L721046
3585.5C52878456K885552n69306K139435Q20312K193947K634354K471886J335258R60579
3594.2C67750473L536491M46206J841392L531380J546898K542534R78546J336021K703972
$$ y = [276669044, 277811966, 278938103, 279492683, 280962677, 282109470, 283255806, 284248505, 285327473, 286597996, 288045292, 290052872, 290960541, 292637310, 293035011, 293302040, 295450001, 297260303, 298880558, 298989162, 300367279, 302165909, 303204536, 304633427, 305321579, 307434521, 309392414, 310399914, 311144123, 312479610, 314078484, 315299911, 318719215, 319704361, 320083389, 321394234, 321773415, 324867973, 326431465, 327897797, 329834671, 331238823, 332122040, 333402519, 336104507, 337103386, 339191322, 341520882, 342457695, 344020805, 345802002, 347796516, 349157410, 352878456, 355764008, 355194702, 357334137, 358154449, 360348396, 362982750, 365454636, 366789894, 367750473, 371286964, 371733170, 373574562, 377105942, 378652840, 381195374, 382173920, 383509941, 386213913]
3602.9C86213913K029877K219314K921562L880616J133346J859474P28112K74124N964432
3611.6D07224770K437553n67970L955993Q32367L584900M003525O51932K811775J633415
3620.3D26568260J124001K681122K927475K294921L163147L391877K711830O910438
3628D51773071M239273q249168J621895M111328N687942L140107k73857K589645M093513
3636.6D68733749L511467J504097K187500K817879L015061K697219J483841K824288
3644.4D88775101M115181N697555m1504k715950O126671K944679K36321r4299M167175
3653E09210930M025688M160919O743736m849052J026039N706482K145615K238083J115646
3661.7E31524086K436905K033081J898766K389984R83581M337998L126068M3525K512551
$$ y = [386213913, 388243790, 390463104, 393384666, 397265282, 398398628, 400258102, 400986214, 401260338, 407224770, 409662323, 409094353, 413050346, 413882713, 417467613, 421471138, 422123070, 424934845, 426568260, 427692261, 430373383, 433300858, 435595779, 438758926, 442150803, 444862633, 451773071, 456012344, 447763176, 449385071, 453496399, 459184341, 462324448, 462050591, 464640236, 468733749, 472245216, 473749313, 475936813, 478754692, 481769753, 484466972, 485950813, 488775101, 492890282, 498587837, 498546333, 495830383, 501957054, 504901733, 505138054, 505043755, 509210930, 513236618, 517397537, 524141273, 519292221, 520318260, 526024742, 528170357, 530408440, 531524086, 533960991, 535994072, 537892838, 540282822, 541266403, 545604401, 548730469, 548773994, 551286545]
3670.4E51286545m811821J517067Q150368R103317K634659j5514870J65787P789878
3678.1E60320930N022202j654053M37584K501755J549950J725006J250305N55839L439370
3686.8E75148888O463699n842896l683509P123260l883400k10609M997101Q04138J437034
3695.5E82353706M73595j04675J562500Q67958K507095K878952l791656k532425L537712
3704.1E87752762J954651J177826M46510J565437M672089n209770K689628N520592
3711.9F00569725j2337875L295707M940339Q28056N01289J989060J814460l525009
3719.6E98075752l9901M903259k204628l406716M503136J096039k1057j257897j052246
3728.3F00595741K713967J144828N157929j568222p895165P818261J079597r385757
$$ y = [551286545, 546474724, 547991791, 556142159, 565245476, 567880135, 552365265, 552531052, 560320930, 565343132, 563689079, 564126663, 566628418, 568178368, 569903374, 571153679, 571709518, 575148888, 581612587, 575769691, 572086182, 579209442, 575326042, 575115433, 580112534, 580916672, 582353706, 582827301, 582722626, 584285126, 585153084, 587660179, 590539131, 586747475, 584215050, 587752762, 589707413, 590885239, 591331749, 592897186, 597569275, 592359505, 595049133, 600569725, 588231850, 591527557, 596467896, 597295952, 597797241, 599786301, 601600761, 598075752, 598035851, 602939110, 600734482, 597327766, 601830902, 602926941, 602905884, 601647987, 600595741, 603309708, 604454536, 609612465, 608044243, 600149078, 607967339, 609046936, 599661179]
3736E99661179J733970L216820k04887J695671K782898l717881K505303J1557426n508308
3744.7F13722191j6352348Q357963M778023N136871L71170q538742Q973656o104736
3752.4F10344048q148270N598373M044266L357201m823380J944580O320839o890488
3760.1F11747169k629928L660736J417046R3040L534927j483345m565086K953682M835281
3768.8F19563522R16520q000107J363334K437363p06139J267929N48974O09169K1858
3777.4F18022423K797508J107216o998177J155548K006913J147995J631927k591972
3785.2F18279381q13217J459655R84497N26925l58887k29035p3776O02608O4392R75037
3794.8F21417580K925682l373719l868103J680756L586426O932449m766502j1389504
$$ y = [599661179, 601395149, 604611969, 604407082, 606102753, 608885651, 605167770, 607673073, 619230499, 613722191, 597369843, 605727806, 610505829, 615642700, 616013870, 607475128, 616448784, 610344048, 602195778, 607794151, 611838417, 615195618, 610372238, 612316818, 618637657, 611747169, 609117241, 612777977, 614195023, 614288063, 617822990, 616339645, 611774559, 614728241, 619563522, 620480042, 612479935, 613843269, 616280632, 615574493, 616842422, 617391396, 618000565, 618022423, 620819931, 621927147, 614928970, 616084518, 618091431, 619239426, 620871353, 618279381, 617466164, 618925819, 619910316, 620437241, 620078354, 619849319, 619775543, 620378151, 620442543, 621417580, 624343262, 620969543, 617101440, 618782196, 622368622, 629301071, 624534569, 613145065]
3802.5F13145065K698784K374535M943199O132927q106690n594177M544602K646713
3810.2F22784958q9302j564n64995J326675N776368l72582j3030395L350563N339584
3818.9F24519310L765106K243538j4193420l18222M407081K166367K760467J05095
3826.6F25455322l672027k27280J752548L084526K161942p220459M47044O675072l616562
3835.3F24840126j529274P585716n802841n321655P005157m237632j354752O476288
3843F27661133j668015l837967J504746L57513J77498J771546o21567J532974N594063
3851.7F32471924l214417R54895j2745018j608963R087906p2250j812515K111816J876526
3860.4F27049904J882286m739227l91541N853424m945564n257492L583603M370575
$$ y = [613145065, 615843849, 618218384, 623161583, 629294510, 621187820, 615593643, 620138245, 622784958, 622695656, 622694092, 622129097, 623455772, 629232140, 628859558, 615829163, 619179726, 624519310, 628284416, 630527954, 616334534, 616016312, 620423393, 622589760, 625350227, 625455322, 621783295, 621556015, 623308563, 626393089, 628555031, 621334572, 621781616, 628456688, 624840126, 623310852, 630896568, 625093727, 619772072, 626777229, 622539597, 621184845, 627661133, 625993118, 622155151, 623659897, 624017410, 624194908, 625966454, 625344887, 626877861, 632471924, 629257507, 630212402, 617467384, 615858421, 624946327, 624874077, 623061562, 625173378, 627049904, 628932190, 624192963, 623801422, 629654846, 624709282, 619451790, 623035393, 627405968]
3868.1F27405968N432319o211815r024887L540345O115455M217453r111976o55709
3875.8F21707153L404847k76833J977158M285392k750778p663727L850746J572228
3883.5F26106186P60498N101852j0800857q37555L906593J877709M459991m57764p619819
3892.2F22496834N4397K992745j373825Q36105J021423J154862K487144q194542L376694
3900.9F24851837K587090n091439M233666j543923k134513p66526K55814K156486J57967
3909.6F24706459m425m68597N18608Q93783N8632N34172J871605k300415m599342L543586
3919.2F24754066J079293l504753J752052J960907R70688j557617k582016P72438J325912
3927.9F24970970J186981o86340k56844J490479k459946j035957J693840j40305J05248
$$ y = [627405968, 632838287, 626626472, 617601585, 621141930, 627257385, 631474838, 622362862, 621707153, 625112000, 624835167, 626812325, 631097717, 628346939, 620683212, 624533958, 626106186, 626866684, 631968536, 621167679, 620330124, 624236717, 626114426, 630574417, 630116653, 622496834, 622551231, 625543976, 624170151, 625006256, 626027679, 627182541, 629669685, 621475143, 624851837, 627438927, 622347488, 626581154, 625037231, 622902718, 622136192, 622392006, 624548492, 624706459, 624702034, 624233437, 624752045, 625645828, 625704460, 626238632, 628110237, 625809822, 621210480, 624754066, 625833359, 622328606, 624080658, 626041565, 627012253, 625454636, 622872620, 623645058, 624970970, 626157951, 625471611, 625214767, 626705246, 624245300, 623209343, 624903183, 624762878, 624868126]
3936.6F24868126J2398q43239o82640k48108K053795J827774l464775j636925J250801
3945.2F23137207P34291Q04978r02520P81555p2631k410775J482125K40173o54945
3953.9F23139458P16133N62630M93812r26170k70119m22363L84292P78694j124992
3962.6F23331375K71187N67856l90511n33294M73327P71713j068992q95500Q00933
3971.3F23328094P97196m43382n06859m1733K53563k34451l82843J64299j20278O45905
3980.9F23459511O72798m48532L0479L28064p86209o17142K90604L50761P16553n5847
3990.6F23941040k49557j60790m22249M04892J10970k04659k03247J17989J30539K1400
4000.2F23486328
$$ y = [624868126, 624880524, 624037285, 623354645, 623106537, 625160332, 626988106, 623523331, 621886406, 623137207, 623871498, 624676476, 623773956, 624555511, 624482880, 622072105, 623554230, 623794403, 623139458, 623855591, 624418221, 624912033, 623985863, 623715744, 623293381, 623677673, 624456367, 623331375, 623602562, 624170418, 623779907, 623246613, 623719940, 624491653, 623422661, 622527161, 623328094, 624125290, 623681908, 623175049, 623133316, 623386879, 623152428, 622769585, 622933884, 622813606, 623459511, 624132309, 623683777, 623714256, 624042320, 623256111, 622638969, 622929573, 623280334, 623996887, 623941040, 623691483, 623530693, 623108444, 623513336, 623624306, 623419647, 623216400, 623334389, 623464928, 623486328]
##END=$$ End of the data block
