##TITLE=$$ Begin of the data block
##JCAMP-DX=5.00 $$ ACD/SpecManager v 10.08
##SPECTROMETER/DATA SYSTEM=Varian
##DATE=04 Dec 2012 14:36:46
##DATA TYPE=INFRARED SPECTRUM
##DATA CLASS=XYDATA
##ORIGIN=
##OWNER=
##NPOINTS=3735
##FIRSTX=399.26403809
##LASTX=4000.35498047
##MAXX=4000.35498047
##MINX=399.26403809
##MAXY=87.05952454
##MINY=50.47422791
##XFACTOR=1.0000000000
##YFACTOR=0.000000100000000
##FIRSTY=80.94631195
##DELTAX=0.96440572
##XUNITS=1/CM
##YUNITS=TRANSMITTANCE
##XYDATA=(X++(Y..Y))
399.3H09463120M5630264Q478851P023010k9485092M066010j9700241j6207581J436005
$$ 809463120 855093384 863572235 870595245 841110153 845176163 825475922 809268341 810704346
407H10704346j9874573J0336304J631012J8576049R869767J2189865m263840k6435318
$$ 810704346 790829773 801166077 802797089 821373138 831242905 843432770 839168930 812733612
414.7H12733612l618774j3762970P211380j0436249M5202560L933106k7545319N732575
$$ 812733612 809114838 795351868 802563248 792126999 837329559 841262665 813717346 819449921
422.4H19449921K799606R055939j6727524l781128r30328K805557R604797j5324173
$$ 819449921 822249527 831305466 814577942 810796814 809866486 812672043 822276840 806952667
430.1H06952667N115662R14841O775436K631454K318039n61447j8831787L078461M42123
$$ 806952667 812068329 812983170 819758606 822390060 824708099 824146652 805314865 808393326 808835449
438.8H08835449P585297n112000k942428J454010J280975J7714233m590454J197663
$$ 808835449 816420746 811308746 808366318 809820328 811101303 828815536 824225082 825422745
446.5H25422745p422943k683792l847123q079147J393738R95865J7820968m319458
$$ 825422745 817999802 815316010 811468887 803389740 804783478 805779343 823600311 819280853
454.2H19280853O05927o156388j7982940l000641R445801K1849136q857422q464050
$$ 819280853 819886780 813730392 795747452 792746811 802192612 824041748 815184326 806720276
462H06720276k748032K199402Q019028L385467J1649781j3470230n391465j033935
$$ 806720276 803972244 806171646 814190674 817576141 829225922 815755692 810364227 809330292
469.7H09330292P073745P172318j5134583l002700J646881J5461960j108780k458115
$$ 809330292 816404037 823576355 808441772 805439072 807085953 822547913 821439133 818981018
477.4H18981018n270920q147201L151626j830749J3495178o20880o325836O16760N577240
$$ 818981018 813710098 805562897 808714523 806883774 820378952 819758072 813432236 814048996 819626236
486.1H19626236m86450j2343674K750015J449814O405945n649872n883331K664566
$$ 819626236 819139786 806796112 809546127 810995941 817401886 811752014 805868683 808533249
493.8H08533249J40381P886276J854401L605270r408035k953034L582001k035522L461227
$$ 808533249 808673630 816559906 818414307 822019577 812611542 809658508 813240509 811204987 814666214
502.5H14666214k532883J422806n424271K829514n7678l738327L841934j274033M763871
$$ 814666214 812133331 813556137 808131866 810961380 810903702 807165375 811007309 809733276 814497147
511.1H14497147j241150j285172o158523K118530Q506851m018555K509842l47824M036865
$$ 814497147 813255997 811970825 805812302 807930832 816437683 812419128 814928970 814581146 818618011
519.8H18618011k376556n768433l216705k737274J435165j689682M177399k008285
$$ 818618011 816241455 810473022 807256317 804519043 805954208 804264526 808441925 806433640
527.5H06433640j02845K586975L678055L122711n083007k4872l230057j547546j775818
$$ 806433640 806330795 808917770 812595825 815718536 810635529 810610657 807380600 805833054 804057236
536.2H04057236Q55331M416046P5913L727798L096314L582992o603698o448060j334304
$$ 804057236 804912567 809328613 809404526 813132324 816228638 819811630 813207932 806759872 805425568
544.9H05425568j598740J767578j728058L908921J240692L880386K544327q20465K812042
$$ 805425568 803826828 805594406 803866348 807775269 809015961 812896347 815440674 814620209 817432251
553.6H17432251n645752l369217k567367O63452p70493j290054M093094K168426M228668
$$ 817432251 811786499 808417282 805849915 806513367 805742874 804452820 808545914 810714340 814943008
562.3H14943008K77329J651230k820282m064026l091126n509567l42254k482300L985443
$$ 814943008 815220337 816871567 814051285 809987259 806896133 801386566 801044312 798562012 802547455
570.9H02547455M385300L359985L331299J069793R83582o217575j475449k579269l908463
$$ 802547455 806932755 810292740 813624039 814693832 815677414 809459839 807984390 805405121 801496658
579.6H01496658l656387K424698O116562K551727P671890M15421q44574k476196n043106
$$ 801496658 797840271 800264969 806381531 808933258 816605148 817020569 816175995 813699799 808656693
588.3H08656693l202134n005111p96280j448899M344788K108612K281952O950836K841644
$$ 808656693 805454559 800449448 799653168 798204269 802549057 804657669 806939621 813890457 816732101
597H16732101n44281n464935k266006n365067k588043O80847j321640K928467K824478
$$ 816732101 816187820 810722885 808456879 803091812 800503769 801184616 799862976 802791443 805615921
605.6H05615921M841995J677780J255951j742248m221802l372345n316849n51300j161880
$$ 805615921 810457916 812135696 813391647 811649399 807427597 804055252 798738403 798187103 797025223
614.3G97025223K410278J962509L210068N943298J246033J174164l529511j985473
$$ 797025223 799435501 801398010 804608078 810551376 811797409 812971573 809442062 807456589
622H07456589l521271l133087j302185j690521L185043J681442L805924L655471L924790
$$ 807456589 803935318 800802231 799500046 797809525 800994568 802676010 806481934 810137405 814062195
630.7H14062195L44314l481369k423019n447617k533035k067490J684266L616333M400787
$$ 814062195 814406509 810925140 808502121 803054504 800521469 798453979 800138245 803754578 808155365
639.4H08155365M112320N80139K226868k767792k765579m495392l206253K02408o46744
$$ 808155365 812267685 812847824 815074692 812306900 809541321 805045929 801839676 802042084 801395340
648.1H01395340J390152r0637M633331K131119J704635K184449l488770k877121l165893
$$ 801395340 802785492 802694855 807328186 809459305 811163940 813348389 809859619 806982498 803816605
656.8H03816605o43464k091674J962585K973786J469879L641205J06811P14417o7444
$$ 803816605 803173141 801081467 803044052 806017838 807487717 811128922 811235733 811950150 811882706
665.4H11882706J925354m346237k2688675Q023910O053085M562989O29730K633972
$$ 811882706 813808060 809461823 786773148 794797058 800850143 805413132 806042862 808676834
673.2H08676834J498871J341476j01013k993240R17740j928177j967621k531967J526031
$$ 808676834 810175705 811517181 811416168 808422928 809340668 807412491 805444870 802912903 804438934
681.8H04438934K954254R50623J483078r80911J178970k130890N64194N06744j335144
$$ 804438934 807393188 808343811 809826889 808845978 810024948 807894058 808458252 808964996 807629852
690.5H07629852o6909k969666J946030J676941K440033P44018o05164J295777j041870
$$ 807629852 807562943 804593277 806539307 808216248 810656281 811400299 810795135 812090912 811049042
699.2H11049042M74090k093582j540680j008987J152649J661453j26343K201615j580582
$$ 811049042 811523132 809429550 807888870 806879883 808032532 809693985 809567642 811769257 810188675
707.9H10188675j358643q00857J063690M56467j280213J123200o16150J393280J073303
$$ 810188675 808830032 808029175 809092865 809549332 808269119 809392319 808776169 810169449 811242752
716.6H11242752Q45871p83310j431351l8452k008362j126251j098251K011871Q64716
$$ 811242752 812088623 811305313 809873962 809835510 807827148 806700897 805602646 807614517 808479233
725.2H08479233J578064J665649q78906K073135j76468l66745k247924j690598m67911
$$ 808479233 810057297 811722946 810844040 812917175 812740707 812373962 810126038 808435440 807967529
733.9H07967529p30362J454239R29642K801743n76706M44336J230468q42285j129379
$$ 807967529 807237167 808691406 809621048 812422791 811846085 812290421 813520889 812678604 811549225
742.6H11549225l628464K8992l9749M13742j00251Q99811K843323J169739K867431
$$ 811549225 807920761 807949753 807910004 808323746 808223495 809123306 811966629 813136368 816003799
751.3H16003799j304702k675019k406616j616363k036286j526718L008041Q81043J965027
$$ 816003799 814699097 812024078 809617462 808001099 805964813 804438095 807446136 808327179 810292206
760H10292206K438125L111039Q61587k754593j766815k969513j272812k554397l45841
$$ 810292206 812730331 815841370 816702957 813948364 812181549 809212036 807939224 805384827 805038986
768.6H05038986J327057J817627L621140K047576K266846j583404q45642j954041l949585
$$ 805038986 806366043 808183670 811804810 813852386 816119232 814535828 813690186 811736145 807786560
777.3H07786560j302719l6163J279907j67847K258530K136230K659302K160339j118316
$$ 807786560 806483841 806447678 807727585 807559738 809818268 811954498 814613800 816774139 815655823
786H15655823j917191m316635j999512j685867J86844J054764J612701L379822K357483
$$ 815655823 813738632 809421997 807422485 805736618 805923462 806978226 808590927 811970749 814328232
794.7H14328232M338608N03006k103424l345032l554230k937927r54514K668152P78885
$$ 814328232 818666840 819169846 817066422 813721390 810167160 807229233 806274719 808942871 809721756
803.4H09721756K934036J806183K462769J586609q49686Q47931l758393k675018k437668
$$ 809721756 812655792 814461975 816924744 818511353 817661667 818509598 814751205 812076187 809638519
812H09638519r08050J82342l02887K909775L203812M496231q0643j761627j351929
$$ 809638519 808730469 808912811 808609924 811519699 814723511 819219742 819139099 817377472 816025543
820.7H16025543k363891k462693j731186J066590q94852J998062K264099J511383K180252
$$ 816025543 813661652 811198959 809467773 810534363 809639511 811637573 813901672 815413055 817593307
829.4H17593307K27662j478424l064347R22928k173004k513123o15844j127091J675186
$$ 817593307 817820969 816342545 813278198 814201126 812028122 809514999 808899155 807772064 809447250
838.1H09447250K484284M963074M87594j633758k084656k559967k61383j007920l99169
$$ 809447250 811931534 816894608 817382202 815748444 813663788 811103821 810842438 809834518 809435349
846.8H09435349k257004R98840J936722J980057L174057J122131J247940j852646j429672
$$ 809435349 807178345 808177185 810113907 812093964 815268021 816390152 817638092 815785446 814355774
855.4H14355774k860184j339111M61960r51233J859283R5749J086273J668625M02146
$$ 814355774 811495590 810156479 810618439 809667206 811526489 811622238 812708511 814377136 814779282
864.1H14779282k96555J98822j38092j837311O6605j507492j268769r55963K376862
$$ 814779282 814482727 814681549 814543457 812706146 812772751 811265259 809996490 809040527 811417389
872.8H11417389L128357J7166P63855j702728M48150j210251j886215K5711n02090
$$ 811417389 814545746 814562912 815326767 813624039 814072189 812861938 810975723 811001434 810499344
881.5H10499344J021423o52008K081375J635666M80194k45056k025604j121979j223144
$$ 810499344 811520767 810868759 812950134 814585800 815065994 814820938 812795334 811673355 810450211
890.2H10450211R45663j403122j000214P31354R64966P47147j057740N03312l06778
$$ 810450211 811395874 809992752 808992538 809723892 810688858 811436005 810378265 810881577 810574799
898.8H10574799L57208m84085j56708k41165j518936P34405L84903J208344l52402
$$ 810574799 810932007 810447922 810291214 810050049 808531113 809265518 809650421 810858765 810506363
907.5H10506363M78897k05383j691742J01700j653672N46952J007080M99038n21240
$$ 810506363 810985260 810779877 809088135 809189835 807536163 808083115 809090195 809589233 809067993
916.2H09067993q6059N43136j217117K83737j684112n42756j3885O0120J006088r842
$$ 809067993 808981934 809525070 808307953 808591690 806907578 806364822 806350937 806411057 807417145 807407303
925.8H07407303J263275o88477o7520l63617o94275l49273n31845P87201r56650k62680
$$ 807407303 808670578 807982101 807914581 807550964 806856689 806507416 805975571 806762772 805806122 805543442
935.5H05543442K78854J813049O60477o75354M96369j001435M7150m81110n31769j203155
$$ 805543442 805822296 807635345 808295822 807620468 808116837 807115402 807162552 806681442 806149673 804946518
945.1H04946518L05862M62571j221924K060699Q30994J508789N81970j772156j887664
$$ 804946518 805252380 805714951 804493027 806553726 807384720 808893509 809475479 807703323 805815659
953.8H05815659k884369j229630m32052J719818R47113L36914N12924Q6746N35355
$$ 805815659 802931290 801701660 801269608 802989426 803936539 804273453 804786377 804873123 805408478
962.5H05408478p69119l53776j878814j063080j178284j248779P05414J54342P00684
$$ 805408478 804639359 804285583 802406769 801343689 800165405 798916626 799622040 799776382 800477066
971.2H00477066l20358R34448L07846r83047j405869j819992n96466j951981j80435
$$ 800477066 800156708 801091156 801399002 800415955 799010086 797190094 796593628 794641647 794461212
979.8G94461212k52685O20117J793976M47769M5166j139450J43509j437378j470719
$$ 794461212 794208527 794828644 796622620 797070389 797115555 795976105 796119614 794682236 793211517
988.5G93211517j732254j568298L08533j11771J144638l37067J274949R39712o56280
$$ 793211517 791479263 789910965 790219498 790107727 791252365 790915298 792190247 793129959 792473679
997.2G92473679m72794k003632j137924k098160N26123M56620n48859J057053L20358
$$ 792473679 792000885 789997253 788859329 786761169 787287292 787743912 787195053 788252106 788572464
1005.9G88572464Q95081r7733J56403j034851j276780j414108j055069N15289p38601
$$ 788572464 789467545 789369812 789526215 788491364 787214584 785800476 784745407 785260696 784522095
1014.6G84522095Q57925L31345N23224j8692m52195j66778j908798n50385j065750
$$ 784522095 785380020 785711365 786234589 786215897 785763702 785596924 783688126 783137741 782071991
1023.2G82071991K84424k88086k97775O28585j27410J762542J06583j27640j415329
$$ 782071991 782356415 782068329 781770554 782399139 782271729 784034271 784140854 784013214 782597885
1031.9G82597885k98843P46307j358566K57644L24250Q76388p46994R0714J267242
$$ 782597885 782299042 783045349 781686783 781944427 782268677 783145065 782398071 782488785 783756027
1040.6G83756027L63083N21317p02591Q3389j078339k84881j04981M51050L98865j097489
$$ 783756027 784119110 784640427 783937836 784021225 782942886 782658005 782553024 783004074 783402939 782305450
1050.2G82305450N56794o85120R83124J58996l45611O27441l99704J64109j488190
$$ 782305450 782862244 782177124 783160248 783319244 782973633 783601074 783201370 783365479 781877289
1058.9G81877289J69296K10724Q85315K79846q88672P34329l71856N29632j084137
$$ 781877289 782046585 782257309 783142624 783422470 782533798 783268127 782896271 783425903 782341766
1067.6G82341766N2033P02286m14658l9291m18549J535645k28425o22634j085892p21512
$$ 782341766 782393799 783096085 782681427 782642136 782223587 783759232 783530807 782908173 781822281 781100769
1077.2G81100769p46536j181793J024169k94036Q73031J495285J517029j075592j622086
$$ 781100769 780354233 779172440 780196609 779902573 780775604 782270889 783787918 782712326 781090240
1085.9G81090240p9422j825256J252060J40152j57013O83212J024552J400757j143570
$$ 781090240 781010818 779185562 780437622 780577774 780420761 781103973 782128525 783529282 782385712
1094.6G82385712q3084j054841p65152j465682n90058N74570q46176J059646K40784
$$ 782385712 782302628 781247787 780482635 779016953 778426895 779001465 778155289 779214935 779455719
1103.3G79455719J017456M30603M8142j66779p94907j88064k335129p73010m95301
$$ 779455719 780473175 780903778 780951920 780785141 779990234 779802170 777467041 776694031 776198730
1112G76198730R77021J213760M76151K324600Q11844l5019j381989R4071l92227j714554
$$ 776198730 777175751 778389511 778865662 781190262 782002106 781967087 780585098 780679169 780286942 778572388
1121.6G78572388j057663j133118R43756Q62885K229538J475906L95660M12751j32370
$$ 778572388 777514725 776381607 777325363 778188248 780417786 781893692 782289352 782702103 782569733
1130.3G82569733j33896k121353k56806o9046R2011L40042N46570K135620J028290
$$ 782569733 782435837 780314484 780057678 779988632 780080643 780420685 780967255 783102875 784131165
1139G84131165J020278j017990p01675m25491j128388q75625j247101J85470o39038
$$ 784131165 785151443 784133453 783431778 783006287 781877899 781002274 779755173 779940643 779301605
1147.6G79301605N72815L33252M74548J011429j76925M48303j646729q87069r31397
$$ 779301605 779874420 780207672 780682220 781693649 781516724 781965027 780318298 779431229 778499832
1156.3G78499832j132355K32010P81555J256257L70636J682205M06875K12555K10572
$$ 778499832 777367477 777599487 778381042 779637299 780007935 781690140 782097015 782309570 782520142
1165G82520142j002045n82275j158066j20545m71573Q22602J811065J842118J987076
$$ 782520142 781518097 780935822 779777756 779657211 779185638 780008240 781819305 783661423 785648499
1173.7G85648499P86895O90384q18252p91932j140060m45938l17688q15811J526565
$$ 785648499 786435394 787125778 786307526 785515594 784375534 783929596 783611908 782796097 784322662
1182.4G84322662J894303K003250J83945j70823J83258q70590j137314j152267J297
$$ 784322662 786216965 788220215 788404160 788233337 788416595 787546005 786408691 785256424 785257721
1191G85257721p98645N67551P37915O11801J560440K91977N09186o07834q07190j357117
$$ 785257721 784459076 785026627 785764542 786376343 787936783 788228760 788737946 788130112 787322922 785965805
1200.7G85965805j340942n12085K05536J071319j50909J145019Q59146L18680K5635
$$ 785965805 784624863 784112778 784318314 785389633 785238724 786383743 787242889 787561569 787587204
1209.4G87587204k45209N35355j098786p78198n72052J53427R5826J16348J155014
$$ 787587204 787341995 787877350 786778564 786000366 785428314 785581741 785677567 785793915 786948929
1218G86948929O07757R17740o7901N7754o88476j184540m64096j71738J30005r55887
$$ 786948929 787556686 788474426 788406525 788464279 787775803 786591263 786127167 785955429 786085434 785129547
1227.7G85129547Q06961P99027L85055N31388n57938q33283j369094R536j75476J21842
$$ 785129547 785936508 786735535 787120590 787651978 787094040 786260757 784891663 784901199 784725723 784847565
1237.3G84847565K93731L08228Q62808J20545M45861r16671o43921m97132j84555K37961
$$ 784847565 785141296 785449524 786312332 786432877 786878738 785962067 785318146 784821014 784636459 784874420
1247G84874420o18591M12292j74560P21054O79703Q1558L0441q97903k90528r21936
$$ 784874420 784255829 784668121 784493561 785214615 785894318 785975876 786006317 785108414 784817886 783895950
1256.6G83895950n31997j07880O49109N85327M70123R98078l85666j68305p27157m21295
$$ 783895950 783363953 783256073 783905182 784490509 784960632 785958710 785573044 785404739 784677582 784256287
1266.3G84256287m36020p32880P3395M1275O07223K43683R77936M38309J61209k68631
$$ 784256287 783820267 783087387 783160782 783202057 783809280 784052963 785030899 785469208 785630417 785361786
1275.9G85361786j475296o10581q87374K04849K95028M89121Q76999N93567R56344
$$ 785361786 783886490 783275909 782388535 782593384 782888412 783377533 784254532 784848099 785804443
1284.6G85804443j45645j82495j217346j174927q72269o37130J20544n0125J126785
$$ 785804443 785658798 785476303 784258957 783084030 782211761 781574631 781695175 781645050 782771835
1293.3G82771835Q03452J120376M47083k27814j31454j179962j434479j821289J75247
$$ 782771835 783575287 784695663 785142746 784914932 784783478 783603516 782169037 780347748 780522995
1301.9G80522995J89743J91956Q72116R03091J836243L08151k61307r81750j545258
$$ 780522995 780712738 780904694 781776810 782679901 784516144 784824295 784562988 783581238 782035980
1310.6G82035980k377014j932907p2022o7138J603622J085968Q34732Q49457N30014
$$ 782035980 779658966 777726059 777654037 777586899 779190521 780276489 781111221 781960678 782490692
1319.3G82490692L16620r51920r78546k040405j045532k41547M13284J092911J025696
$$ 782490692 782807312 781855392 780876846 778836441 777790909 777549362 777962646 779055557 780081253
1328G80081253J470490O25076R27963n56183j270370j820832j834869q36792j635132
$$ 780081253 781551743 782176819 783104782 782548599 781278229 779457397 777622528 776785736 775150604
1336.7G75150604P84378N38941P96737K033005J470184J322709p05719j108246j732941
$$ 775150604 775934982 776473923 777270660 779303665 780773849 782096558 781390839 780282593 778549652
1345.3G78549652j341934j528092j153640N75790J394653K521058J299743Q69446n18951
$$ 778549652 777207718 775679626 774525986 775101776 776496429 779017487 780317230 781186676 780667725
1354G80667725j528778j147233r99298p54165j649933J50528m93469L31802J351929
$$ 780667725 779138947 777991714 776992416 776238251 774588318 774738846 774245377 774577179 775929108
1362.7G75929108M66003K629013Q19092q38776j673431k320252k126007n18722O65741
$$ 775929108 776395111 779024124 779843216 779004440 777331009 775010757 772884750 772366028 773031769
1371.4G73031769L69644J198959j55868N28488J686478J125564o45065k357636j656036
$$ 773031769 773401413 774600372 774444504 774972992 776659470 777785034 777139969 774782333 773126297
1380.1G73126297j910477o41937q07342M66995J719360J650543J431809r42459J810379
$$ 773126297 771215820 770573883 769766541 770233536 771952896 773603439 775035248 774092789 775903168
1388.7G75903168N12542j518173j696472r17969M24347k374725j75552K462921K412109
$$ 775903168 776415710 774897537 773201065 772283096 772707443 770332718 770157166 772620087 775032196
1397.4G75032196L30200k214584R70993O68335r60999j453399m85764k406769k6855
$$ 775032196 775362396 773147812 774118805 774787140 773826141 772372742 771886978 769480209 769453354
1406.1G69453354K557602J454696J481476J1139j7547o94046j099854n41229j393280
$$ 769453354 772010956 773465652 774947128 774958267 774940720 774246674 773146820 772605591 771212311
1414.8G71212311n66483j345215L62244P45239k324295K699662L337554R72596k141114
$$ 771212311 770645828 769300613 769662857 770408096 768083801 770783463 774121017 775093613 772952499
1423.4G72952499k636566o61316L09906q56170j24436M15650n62363J877747J189422
$$ 772952499 770315933 769654617 769964523 769108353 768983917 769399567 768837204 770714951 771904373
1432.1G71904373J15433j42746P95288m61273o886826Q48465K068024O18439L77578
$$ 771904373 772019806 771877060 772672348 772211075 765324249 766172714 768240738 768859177 769236755
1440.8G69236755J427231O58493J86157N58167n79910p5150j879425k890625L50342
$$ 769236755 770663986 771322479 771508636 772066803 771486893 771411743 769532318 766641693 766992035
1449.5G66992035J337051L45917o23016J137237Q08563M01536j983033p803573j080017
$$ 766992035 768329086 768675003 768051987 769189224 769997787 770399323 768416290 760612717 759532700
1458.2G59532700K886505K463836K057419J073380L00827J333084j937943J63575K522735
$$ 759532700 762419205 764883041 766940460 768013840 768314667 769647751 767709808 767873383 770396118
1466.8G70396118M80652J65558r77478L46832j982880o106491K53907L648300L865967
$$ 770396118 770876770 771042328 770064850 770411682 768428802 762322311 762576218 766224518 770090485
1475.5G70090485q28095J227417J687012l33023K65503j230088o87408J71585L22876
$$ 770090485 769262390 770489807 772176819 771843796 772109299 770879211 770191803 770363388 770686264
1484.2G70686264J96991N24521j051941p62329K310943k427368k288513J891708J740113
$$ 770686264 770883255 771407776 770355835 769593506 771904449 769477081 767188568 769080276 770820389
1492.9G70820389M36096J037445J09711n584030L187103J291962k92130K102814k57492
$$ 770820389 771256485 772293930 772403641 766819611 770006714 771298676 771006546 773109360 772851868
1501.6G72851868n16129k7084Q72116l89557p688599o893692M911728M965668J653137
$$ 772851868 772335739 772308655 773180771 772791214 765102615 758208923 763120651 768086319 769739456
1510.2G69739456K614212p1258j351014J072922l62854n11093l293915k709427M473191
$$ 769739456 772353668 772282410 770931396 772004318 771641464 771130371 767836456 765127029 769600220
1518.9G69600220L188781m596405l961029K776337L225479J258621l479843L39432
$$ 769600220 772789001 768192596 764231567 767007904 770233383 771492004 768012161 768351593
1526.6G68351593Q86612q02918J101151J738586L55530k95639k670746l449707L654022
$$ 768351593 769238205 768435287 769536438 771275024 771630554 771334915 768664169 765214462 768868484
1535.3G68868484J301728K66876m2419r330292n312271N995559L120652l27835L517990
$$ 768868484 770170212 770437088 770394669 761064377 755752106 761747665 764868317 764540482 768058472
1544G68058472J105880j282043J726837j42364J87301k197189k014465J796798J229096
$$ 768058472 769164352 767882309 769609146 769466782 769654083 767456894 765442429 767239227 768468323
1552.7G68468323N31921l978653J024475L511658N72052j5732346r250106J0139694
$$ 768468323 769000244 765021591 766046066 769557724 770129776 754397430 745147324 755287018
1560.4G55287018P134781M148407J212692P18384j463623M25949J079254k34528n63964
$$ 755287018 762421799 766570206 767782898 768501282 767037659 767463608 768542862 768308334 767744370
1569.1G67744370n792542K350693K110595j26495m88663M48075j27793o810531M197464
$$ 767744370 761951828 764302521 766413116 766286621 765797958 766246033 766118240 759307709 763505173
1577.7G63505173K805633M08402l04489q79288n45654j327362j15967j41526N38865
$$ 763505173 766310806 766719208 766414719 765535431 764989777 763662415 763546448 763404922 763943787
1586.4G63943787L39508k92969L80020o69098m03213r63135j69449p32498j350250
$$ 763943787 764283295 763990326 764370346 763701248 763298035 762334900 762165451 761432953 760082703
1595.1G60082703r8877l47138N37110m03519j22299m5014n61905q93173j165619J5793
$$ 760082703 759983826 759636688 760173798 759770279 759647980 759602966 759041061 758147888 756982269 756998062
1604.7G56998062l67584m44336j328430l5629o81229p21970J221695m76990m74319
$$ 756998062 756630478 756186142 754857712 754822083 754140854 753418884 754640579 754163589 753689270
1613.4G53689270j332931N07507j448212q961029L682556J936112O73217k97088M53644
$$ 753689270 752356339 752863846 751415634 742454605 746137161 748073273 748746490 748449402 748903046
1622.1G48903046j366120m479904J988449J172333M17023k488022j323548J640397
$$ 748903046 747536926 743057022 745045471 746217804 746634827 744146805 742823257 744463654
1629.8G44463654K99453m5166r3765J189194J348266q355407j145249L057709R64050
$$ 744463654 744763107 744717941 744624176 745813370 747161636 738806229 737660980 740718689 741682739
1638.5G41682739J679459M75998j49155J377869j37177J158829Q01239m278336j651001
$$ 741682739 743362198 743838196 743689041 745066910 744929733 746088562 746889801 742611465 740960464
1647.2G40960464L97797K447968K477722K158432Q26187j3202286o654205J1476822
$$ 740960464 741358261 743806229 746283951 748442383 749268570 736066284 729412079 740888901
1654.9G40888901O051635K943573R72214m41513j87301k77482L05405k020874j740265
$$ 740888901 746940536 749884109 750856323 750414810 750227509 749950027 750255432 748234558 746494293
1663.6G46494293K901764J582108J034851J611328Q49609m726333q42896J959686o12030
$$ 746494293 749396057 750978165 752013016 753624344 754473953 749747620 748904724 750864410 750252380
1672.3G50252380J912537K230835k617645k322007M156342K308273M22440q8120k167663
$$ 750252380 752164917 754395752 751778107 749456100 753612442 755920715 756343155 756255035 754087372
1680.9G54087372J801681J988144m121399j0128250M514771O364059K551422K67563
$$ 754087372 755889053 757877197 753755798 743627548 748142319 754506378 757057800 757325363
1688.6G57325363M09317k71911R18579O72454o57653O21719M76608r110336K382889
$$ 757325363 757734680 757462769 758381348 759053802 758396149 759017868 759494476 750384140 752767029
1697.3G52767029M694748L578567k610168q064041O925506L349762l07312j826706
$$ 752767029 757461777 761040344 758430176 750366135 757291641 760641403 760334091 758507385
1705G58507385p11364j109238O99539K383347M4021l70178J189575J155472M14276
$$ 758507385 757796021 756686783 757386322 759769669 759813690 759443512 760633087 761788559 762202835
1713.7G62202835k782364j790542J760101m94156o771240L759308L421859J368332
$$ 762202835 759420471 757629929 759390030 758895874 752124634 755883942 759305801 760674133
1721.4G60674133J370774J08490j00632L02734j23214j038056p27539K67334k667313
$$ 760674133 762044907 762153397 762052765 762355499 762232285 761194229 760466690 760734024 758066711
1730.1G58066711m04510K741089J225052l960495l536835M953537L006897K32696O44455
$$ 758066711 757662201 760403290 761628342 757667847 754131012 759084549 762091446 762324142 762968597
1738.8G62968597k579574l817291K583694J140976j645660N35888J946182Q89435l64532
$$ 762968597 760389023 756571732 759155426 760296402 758650742 759186630 761132812 762022247 761657715
1747.5G61657715o76727j227189J818238j788941k679367K676926O38428R39788J045533
$$ 761657715 760980988 759753799 761572037 759783096 757103729 759780655 760419083 761358871 762404404
1756.2G62404404j707383Q38166J232147L77350l71094m161987j214218K049179O83593
$$ 762404404 760697021 761535187 762767334 763144684 762773590 758611603 757397385 759446564 760130157
1764.8G60130157J40534R26971K93427j260758J028977J701736k044220m814987r54208
$$ 760130157 760270691 761197662 761491089 760230331 761259308 762961044 760916824 756101837 755147629
1773.5G55147629L094101J215515j362534J590958Q92868J079483O57578j617814M22898
$$ 755147629 758241730 759457245 758094711 759685669 760578537 761658020 762315598 760697784 761120682
1782.2G61120682L62930K40021j891098j390686Q98971j18637K89307M60968j16501
$$ 761120682 761483612 761723633 759832535 758441849 759340820 759222183 759511490 759972458 759855957
1790.9G59855957j09405j830445l69949J981277j80969j738968Q97675J256408k85720
$$ 759855957 759746552 757916107 757546158 759527435 759346466 757607498 758505173 759761581 759475861
1799.5G59475861j403428J051789M66156K36969J158523q19625k78397o68030j024475
$$ 759475861 758072433 759124222 759590378 759827347 760985870 760166245 759887848 759219818 758195343
1808.2G58195343M86374j26495r77250M08326J351013L28293N68008J56326n29098
$$ 758195343 758681717 758555222 757577972 757986298 759337311 759665604 760233612 760389938 759860840
1816.9G59860840j459503q11539Q82721n37338n5695k26135Q48541J482926k454224
$$ 759860840 758401337 757589798 758472519 757935181 757879486 757653351 758501892 759984818 757530594
1825.6G57530594K3727Q44422K07977j967545m131698J932831K183761N25589J17951
$$ 757530594 757554321 758398743 758606720 756639175 752507477 754440308 756624069 757149658 757267609
1834.3G57267609Q71124N26047n19028q21457k09656k86026p57446n97000N61218J63880
$$ 757267609 758138733 758664780 758145752 757324295 757114639 756828613 756071167 755474167 756035385 756199265
1843.9G56199265l731995J730118K347717l87421j65863J5641K22930n93566m56849
$$ 756199265 752467270 754197388 756545105 756157684 755991821 756007462 756230392 755636826 755179977
1852.6G55179977m48837m54788O27899L96195P45391k83050O8283L03268o59103o29654
$$ 755179977 754731140 754276352 754904251 755300446 756045837 755762787 755831070 756134338 755475235 754845581
1862.2G54845581r26819l69873m87366M28849J31836J41296K3804j465225J390762
$$ 754845581 753918762 753548889 753061523 753490372 753622208 753763504 753787308 752322083 753712845
1870.9G53712845O02951k92206p30591r58557j85852m1199P60193M89426O42853J42898
$$ 753712845 754315796 754023590 753292999 752334442 752148590 752107391 752867584 753357010 753999863 754142761
1880.6G54142761J73645J8463o31942n41153j447831l65219j23443O99692P7667j352082
$$ 754142761 754316406 754334869 753702927 753161774 751713943 751348724 751225281 751924973 752002640 750650558
1890.2G50650558J745835J059112j18942l01361j122360j485291l64074N1117k79313
$$ 750650558 752396393 753455505 753336563 753035202 751912842 750427551 750063477 750114594 749835281
1898.9G49835281L23410J51749J024628P32040Q4610O4850o39572n47791j275100p49283
$$ 749835281 750158691 750310440 751335068 752067108 752151718 752216568 751576996 751029205 749754105 749004822
1908.5G49004822o69251q08639M27093J146851J279526R68933N54123k82822k10037
$$ 749004822 748335571 747526932 747954025 749100876 750380402 751349335 751903458 751620636 751410599
1917.2G51410599l584290j916961J316299q7051M87594n81207K51846J794434R53216
$$ 751410599 747826309 745909348 747225647 747138596 747626190 747044983 747296829 749091263 750044479
1925.9G50044479J19553n74036j95617j133347j195602q67081l61252L34473M68063
$$ 750044479 750164032 749589996 749394379 748261032 747065430 746198349 745837097 746171570 746639633
1934.6G46639633Q19702M95835R41772q011m35867q57697r22393j274948k738114P68509
$$ 746639633 747459335 747955170 748896942 748888931 748453064 747595367 746672974 745398026 742659912 743428421
1944.2G43428421J031799P89414J113128O20881J051864j5945m96445j087875r07898
$$ 743428421 744460220 745249634 746362762 746983643 748035507 748019562 747523117 746435242 745527344
1952.9G45527344r06372j052399o6681K58255R89075Q30154P56760N3558j73569l12271
$$ 745527344 744620972 743568573 743501892 743760147 744749222 745579376 746336136 746389694 746216125 745903854
1962.5G45903854j056518p71942r38721k41013n93109M9591J015549J009903J214752
$$ 745903854 744847336 744075394 743136673 742895660 742302551 742352142 743367691 744377594 745592346
1971.2G45592346j2970l63083p83767q05359j037979r46427j07498k29797M12521N80444
$$ 745592346 745579376 745216293 744432526 743627167 742589188 741642761 741535263 741305466 741717987 742298431
1980.8G42298431J259385N83038k87247k32467p54700m46015j239090j346206n71671
$$ 742298431 743557816 744140854 743853607 743621140 742866440 742420425 741181335 739835129 739263458
1989.5G39263458R28345J216125p6522O20498O51779M83780m48379j136704j166381
$$ 739263458 740191803 741407928 741331406 741951904 742603683 743087463 742639084 741502380 740335999
1998.2G40335999r25675m40903m27780N62744O48194P24945M83703J12915k97546q28857
$$ 740335999 739410324 738969421 738541641 739104385 739752579 740477524 740961227 741074142 740776596 739947739
2007.8G39947739m97361j070022n04761m11301j52587L07693K21252J189957K32849
$$ 739947739 739450378 738380356 737875595 737464294 737311707 737619400 737840652 739030609 739263458
2016.5G39263458m75998l83453o27289p82165m06189k48261q42438n874L61862Q84018
$$ 739263458 738787460 738404007 737776718 736994553 736588364 736340103 735497665 735491791 735853653 736737671
2026.2G36737671O44989M7455L9139m12598k74124q44269n61829n20248l39050J297
$$ 736737671 737382660 737430115 737469254 737056656 736782532 735938263 735376434 734856186 734517136 734518433
2035.8G34518433q0490P52716K10037J67999j80283o22177m54712o40258m36859l31727
$$ 734518433 734437943 735190659 735400696 735568695 735388412 734766235 734311523 733671265 733234406 732902679
2045.5G32902679M52118K71912K98309M94538L76281J32370o18591l83224p71027o27670
$$ 732902679 733354797 733626709 733925018 734419556 734795837 734928207 734309616 733926392 733155365 732527695
2055.1G32527695m82865j95312K88772J33591N17578K0218L6926J76468P8736o36444
$$ 732527695 732044830 731849518 732138290 732271881 732789459 732809677 732846603 733023071 733101807 732465363
2064.7G32465363j223984o07300r9182O25534J00479K40479J86157K2201K11411m46854
$$ 732465363 731241379 730634079 730534897 731160431 731260910 731501389 731687546 731709747 731921158 731474304
2074.4G31474304j06811o15921m73786j75934k53830m6920J06430P56836L22647K23541
$$ 731474304 731367493 730751572 730277786 730101852 729848022 729801102 729907532 730664368 730987015 731210556
2084G31210556n07202m71649l16010q92181l35312m79889L67737L77426P2861L73077
$$ 731210556 730703354 730231705 729915695 729023514 728688202 728208313 728576050 728953476 729026337 729399414
2093.7G29399414J57929J42440l03573l22190o78558n29022n00794K4948L08152l61328
$$ 729399414 729557343 729699783 729396210 729074020 728395462 727866440 727365646 727390594 727698746 727337418
2103.3G27337418N15518N27649M25796j5869l51944m22974q46710m40597n33448j07879
$$ 727337418 727852936 728380585 728806381 728790512 728438568 728015594 727168884 726728287 726194839 726086960
2113G26086960P1030O18591N40161J61056N02625m44946p27539r08738k47802k73590
$$ 726086960 726157990 726776581 727316742 727477798 727980423 727535477 726807938 725899200 725651398 725377808
2122.6G25377808n07737L61481J50910O22863K07749o4469M89121K02255p74231r80148
$$ 725377808 724870071 725231552 725382462 726005325 726213074 726148605 726637726 726839981 726065750 725085602
2132.3G25085602k97547m70275j82190l60032J02463O31638N56946L78799j36871M18396
$$ 725085602 724788055 724317780 724135590 723775558 723878021 724509659 725066605 725445404 725308533 725726929
2141.9G25726929o41098j289139j066361n04150L31116L89023P52639l3950M02984
$$ 725726929 725085831 723796692 722730331 722226181 722557297 722946320 723698959 723665009 724067993
2150.6G24067993K61994k38495j11389q27408n79300q96836k69699n1880P3395Q55942
$$ 724067993 724329987 724091492 723980103 723152695 722573395 721676559 721406860 721354980 721428375 722284317
2160.2G22284317Q47321O42547m99039k32315k68783n29862m88891m43268j40762l91388
$$ 722284317 723131638 723774185 723275146 723042831 722774048 722244186 721755295 721312027 721171265 720779877
2169.9G20779877N34591P13807O74133o9046m07715J6327o95496l77960n99976l07312
$$ 720779877 721314468 722028275 722702408 722633362 722225647 722241974 721546478 721168518 720568542 720261230
2179.5G20261230R3232J56097L52097L96499M42734l19366K18277j2284l34472q74405
$$ 720261230 720354462 720510559 720862656 721259155 721701889 721382523 721600800 721588516 721254044 720379639
2189.1G20379639j135407J4572k47421M29764M67682K71301N17883K66877Q8119l05328
$$ 720379639 719244232 719258804 719011383 719441147 719908829 720180130 720698013 720964890 721053009 720747681
2198.8G20747681j91193j025619o96335m30756j30081Q73489O82679M34341m41513
$$ 720747681 720556488 719530869 718834534 718403778 718273697 719147186 719829865 720264206 719822693
2207.5G19822693p2479k51999n93567j46256k13699j00250n23682l662J19476N30548
$$ 719822693 719750214 719498215 718904648 718758392 718544693 718444443 717920761 717917099 718036575 718567123
2217.1G18567123N26276R0485L11889n06134m03137n41611l96957l05328j95237J21537
$$ 718567123 719093399 719183884 719495773 718989639 718586502 718044891 717647934 717342606 717147369 717268906
2226.8G17268906q2627N80902L00522L84140j91421n29099q2245m52118l78036o93283
$$ 717268906 717186279 717767181 718067703 718451843 718260422 717731323 717649078 717196960 716818924 716125641
2236.4G16125641J9989J64413K53830M44107l4637j984k04010J72348o26526o34994
$$ 716125641 716145630 716310043 716563873 717007980 716973343 716971359 716767349 716939697 716313171 715678177
2246G15678177j82266l35694r613q6441L71247J12457K55585l6469k87018k25601q46710
$$ 715678177 715495911 715160217 715150604 715064163 715435410 715547867 715803452 715766983 715479965 715254364 714407654
2256.7G14407654k89536j65176P4692J36108K94418R6054j44424J79443m27627O4239
$$ 714407654 714118118 713952942 714027634 714163742 714458160 714554214 714409790 714589233 714161606 714225845
2266.3G14225845j08108o68564p70035j80282M21981J54572O35605K13241K23236j53198
$$ 714225845 714117737 713449173 712679138 712498856 712920837 713075409 713711014 713924255 714147491 713994293
2275.9G13994293m39911j63574m75693l36227m54331J12000k29K16446J16806j84936
$$ 713994293 713554382 713390808 712915115 712578888 712124557 712236557 712236328 712452774 712569580 712384644
2285.6G12384644J45645m16489k41852o99463j58386k80914n73883P5760Q0261P54166
$$ 712384644 712530289 712113800 711871948 711172485 711014099 710733185 710159302 710235062 710315323 711069489
2295.2G11069489k3652K07215o76270j000900k12631j182785k17438k62375Q8806k8534
$$ 711069489 711045837 711253052 710576782 709575882 709363251 708180466 707963028 707700653 707789459 707760925
2304.9G07760925k02636J72195p401J54038q44345j45569j179428p35245n89447j015930
$$ 707760925 707558289 707730484 707723083 707877121 707032776 706887207 705707779 704972534 704383087 703367157
2314.5G03367157J141815j77612k37045j054764K5940L87497j222916l51715j789932
$$ 703367157 704508972 704331360 704094315 703039551 703065491 703452988 702230072 701878357 700088425
2323.2G00088425l94516j313553K46200R55429q99581N85174m99802L70789j335297
$$ 700088425 699693909 698380356 698626556 699581985 698682404 699267578 698767776 699138565 697803268
2331.9F97803268j19247M13742j193008j908j029358l74679m05731J142578m81110
$$ 697803268 697684021 698097763 696904755 696902847 695873489 695498810 695093079 696235657 695754547
2340.6F95754547k84424J067505l99704j35193j884384L72162L53546J806488K292633
$$ 695754547 695470123 696537628 696137924 696002731 694118347 694490509 694844055 696650543 698943176
2349.2F98943176k69394p75604k059021j157455p64389j79825r06830k262421r39789
$$ 698943176 698673782 697898178 695839157 694681702 693917313 693737488 692830658 690568237 689628448
2357.9F89628448k061233L86124k56043J079331J064910N99289J0682j480484Q04367
$$ 689628448 687567215 687953339 687697296 688776627 689841537 690440826 690451508 688971024 689775391
2366.6F89775391p75147J325455R66568O02798J199417K78092J239014M23812J091614
$$ 689775391 689000244 690325699 691292267 691895065 693094482 693372574 694611588 695035400 696127014
2375.3F96127014Q52204R54360J76926l76129L22800r0790P49206J02311M26330J078415
$$ 696127014 696979218 697933578 698110504 697734375 698057175 697966385 698715591 698817902 699244232 700322647
2384.9G00322647O16379K08816p9574M62570m87900o05545p56073k33993M70733l91769
$$ 700322647 700939026 701147842 701068268 701530838 701042938 700437393 699681320 699447327 699918060 699526291
2394.6F99526291K27203L60871K60543m84314n16204J02996l16009n11093o71463J74866
$$ 699526291 699753494 700114365 700374908 699890594 699374390 699477386 699161377 698650284 697978821 698153687
2404.2F98153687J79367o3324k33307l2578K93045r8190J03760m87290m44793n31693
$$ 698153687 698333054 698269730 698036423 698003845 698296890 698198700 698302460 697815170 697370377 696838684
2413.8F96838684j60599P0572n86471M8599J59607N23758K00805j40075k98615o63452
$$ 696838684 696678085 696748657 696162186 696210785 696370392 696894150 697094955 696954880 696656265 695992813
2423.5F95992813l97644l17459o8359m27170K73514J48620j09634J84936j97525q3236
$$ 695992813 695595169 695277710 695209351 694782181 695055695 695204315 695094681 695279617 695082092 694998856
2433.1F94998856p59049j62048n76554m89807K87400k50245M63486J77231L57132k35291
$$ 694998856 694239807 694077759 693501205 693011398 693298798 693048553 693512039 693689270 694046402 693811111
2442.8F93811111m78286k4109o77033n56106o88706M0207j38016O6529L15628j03302
$$ 693811111 693332825 693308716 692631683 692075577 691386871 691427078 691289062 691355591 691671219 691567917
2452.4F91567917L76358n4474q2397o43158m71955m17633n98221j22985k77634L19977
$$ 691567917 691944275 691889801 691807404 691164246 690692291 690274658 689676437 689553452 689275818 689595795
2462.1F89595795K90680N02929R2469j18866j42212n05448l58734j271515m89197O028
$$ 689595795 689886475 690389404 690481873 690363007 690220795 689715347 689356613 688085098 687595901 687601929
2471.7F87601929M85305Q92334K77253N04684m1885k86789r21555q26263n91583o71845
$$ 687601929 688087234 688979568 689256821 689761505 689719620 689432831 688511276 687685013 687093430 686421585
2481.3F86421585n62439l90854Q89588N64575O13403J80283k89002q0032n58701l96041
$$ 686421585 685859146 685468292 686357880 686922455 687535858 687716141 687427139 687347107 686788406 686392365
2491F86392365j057282l31192J9531Q1177L92914P5531P00073K48642j83029p14417
$$ 686392365 685335083 685003891 685023422 685104599 685497513 685573044 686273117 686521759 686338730 685624313
2500.6F85624313k04010m68368j155625J7319q240K36588P553K31628L12729q8348
$$ 685624313 685420303 684951935 683796310 683813629 683805389 684041977 684049530 684281158 684593887 684505539
2510.3F84505539J56021n34973n68771q16346n94177l39355n1270J59760O3400R39178
$$ 684505539 684661560 684126587 683557816 682741470 682147293 681807938 681756668 681916428 681979828 682919006
2519.9F82919006N99060j2970n71823l75747n14298r20944m91562m35410L81165J82877
$$ 682919006 683518066 683505096 682933273 682557526 682043228 681122284 680630722 680195312 680576477 680759354
2529.6F80759354L48434N10330R3003j39313o00357l10440o05240k05689m58374l31039
$$ 680759354 681107788 681618118 681711121 681571808 680971451 680661011 680055771 679850082 679391708 679060669
2539.2F79060669J64642Q0262Q45489J92261J64261k08741n84259o57425r19647k91900
$$ 679060669 679225311 679305573 680151062 680343323 680507584 680298843 679714584 679057159 678137512 677845612
2548.9F77845612m54178K10495L56445L32565l738q3237L63770o78864n20630l66363
$$ 677845612 677391434 677601929 677958374 678290939 678287201 678203964 678567734 677888870 677368240 677001877
2558.5F77001877l87802o57502r4909P01980K72293M46091l47900j15662o6604m99039
$$ 677001877 676614075 675956573 675861664 676563644 676835937 677282028 676934128 676818466 676751862 676252823
2568.1F76252823k89002n46264o69098o94809L62320L61023M11453L74527K3880K59705
$$ 676252823 675963821 675417557 674748459 674053650 674415970 674776993 675188446 675562973 675586853 675846558
2577.8F75846558j64490k51923r68017m98658k02026k46735j78451l13034P43561K83508
$$ 675846558 675682068 675430145 674462128 673963470 673761444 673514709 673336258 673023224 673766785 674050293
2587.4F74050293K57645j85852l43781j95847j020278n72281o49109J07651K06298
$$ 674050293 674307938 674122086 673778305 673582458 672562180 671989899 671340790 671448441 671654739
2596.1F71654739K14234N03921K69547N00335m87213n87158o93054l70255k99530n96847
$$ 671654739 671868973 672372894 672642441 673142776 672655563 672068405 671375351 671005096 670705566 670108719
2605.7F70108719L1204J38168N84946P1716J78223K56424k66952r12247r82590J39618
$$ 670108719 670139923 670278091 670863037 670934753 671112976 671369400 671102448 670190201 669207611 669347229
2615.4F69347229m59213k54441K7771J51291L90778K18124R8954n86777k08359q63495
$$ 669347229 668888016 668633575 668661346 668812637 669203415 669421539 669520493 668933716 668725357 667861862
2625F67861862m24805O7139k28729K37274k72751L54614J45035O562K6931j47323m34265
$$ 667861862 667437057 667504196 667275467 667512741 667239990 667594604 667739639 667746201 667773132 667625809 667191544
2635.6F67191544j090851l20053n67322Q2474J63269o9046M84237J9226k4337n30625
$$ 667191544 666100693 665780640 665213318 665295792 665459061 665390015 665874252 665893478 665869141 665338516
2645.3F65338516l3951k96325o48804l67737l33786L01361J27182K63748k29873k35748
$$ 665338516 665304565 665008240 664359436 663991699 663657913 663959274 664086456 664350204 664120331 663884583
2654.9F63884583n5695K19116o3171r96018r0713k98386j96609k49863J17569O06613
$$ 663884583 663828888 664048004 663984833 662988815 662898102 662599716 662403107 662153244 662270813 662877426
2664.6F62877426P0343L61481n20477j69068n30395j003189l83301j93100L05176k46659
$$ 662877426 662947769 663309250 662788773 662619705 662089310 661086121 660702820 660509720 660814896 660568237
2674.2F60568237L27301L40882L68194q4839q04214l29208p74918j44196l88870j83411
$$ 660568237 660895538 661236420 661604614 661519775 660715561 660386353 659611435 659467239 659078369 658894958
2683.9F58894958K51465O2790K68402K11182N39474n00183l15857o71157q97217k44827
$$ 658894958 659146423 659209213 659477615 659688797 660228271 659728088 659412231 658741074 657843857 657599030
2693.5F57599030p62864Q164K08740O89468O61316M16336j68609q52509r8877m73327
$$ 657599030 656836166 656844330 657053070 657742538 658403854 658820190 658651581 657799072 657700195 657226868
2703.1F57226868n36728r39331l80249K99835J32904L59421L31573N57785m87060j06812
$$ 657226868 656690140 655750809 655370560 655670395 655803299 656162720 656494293 657052078 656565018 656458206
2712.8F56458206k54898p31659l17459o57349L9521j22376L46832K77482L32794M41589
$$ 656458206 656203308 655471649 655154190 654496841 654536362 654413986 654760818 655038300 655371094 655812683
2722.4F55812683l85513k71225r77249l56675n29937p17926k55127j17417P89261K47040
$$ 655812683 655427170 655155945 654178696 653822021 653292084 652574158 652319031 652201614 652990875 653237915
2732.1F53237915L41797K46124R1477n77088q57467k22168p99790j78528p1563J12762
$$ 653237915 653579712 653825836 653917313 653340225 652482758 652260590 651460800 651282272 651210709 651323471
2741.7F51323471K29645N02319Q43277j32065l25470o55670p54089r54132p9575J39771
$$ 651323471 651553116 652055435 652898712 652766647 652441177 651785507 651031418 650077286 649997711 650137482
2751.4F50137482n06287K43759N47333P21741k62070k55661j15128r2773l57666j341400
$$ 650137482 649631195 649874954 650422287 651144028 650881958 650626297 650511169 650418396 650060730 648719330
2761F48719330k81143m07639J51978N34896K29187K55967r9640K84881q00705o94198
$$ 648719330 648438187 648030548 648182526 648717422 648946609 649202576 649102936 649387817 648587112 647892914
2770.7F47892914p22351n15671p5760l18832M83627j0986P80410O47049J4420o4163
$$ 647892914 647170563 646654892 646579132 646260300 646743927 646732941 647513351 648160400 648174820 648110657
2780.3F48110657p10449o98395j217804k92359j96228r6893O23474O83823L94668j60217
$$ 648110657 647400208 646701813 645484009 645191650 644995422 644898529 645522003 646205826 646600494 646440277
2789.9F46440277J78528l56522j47705q90655j069565j97678l59726K01340k63596
$$ 646440277 646618805 646262283 646114578 645223923 644154358 643956680 643596954 643798294 643534698
2798.6F43534698O13633O65817j00403j37634m60282k45971r67789n33752m25568j42136
$$ 643534698 644148331 644814148 644713745 644576111 644115829 643869858 642902069 642368317 641942749 641800613
2808.3F41800613L29361K96097N87616J84326K58942m33731k00272o57654j238784
$$ 641800613 642129974 642426071 643013687 643198013 643456955 643023224 642822952 642165298 640926514
2816.9F40926514n40924n18418K62451L95890N65109K48947M37164j23977j080094
$$ 640926514 640385590 639867172 640129623 640525513 641090622 641339569 641776733 641652756 640572662
2825.6F40572662k98004o73370l11127n48630l52592j18141j8387O40678j67961M97971
$$ 640572662 640274658 639601288 639290161 638741531 638388939 638270798 638252411 638893089 638725128 639223099
2835.3F39223099Q8958j20887n07202j194268m45251o29883k19459m54255M62914L98369
$$ 639223099 639312057 639191170 638683968 637489700 637044449 636414566 636195107 635740852 636203766 636602135
2844.9F36602135l75099J73797k45476m41398j266365m32549m53796o70204k671k63862
$$ 636602135 636227036 636400833 636155357 635713959 634447594 634015045 633561249 632891045 632888374 632624512
2854.6F32624512M48189J91650M91028M81949N11360k84958j348114o03333m86755
$$ 632624512 633072701 633264351 633755379 634237328 634748688 634463730 633115616 632512283 632025528
2863.2F32025528k8496j53656M29001L47443L85551O15654o50978r9831m66690p56683
$$ 632025528 631997032 631843376 632272377 632619820 633005371 633621025 632970047 632870216 632403526 631646843
2872.9F31646843p86514o01349q9798J51443N62973l4027M95415m38271m57306K38457
$$ 631646843 630860329 630258980 630169182 630320625 630883598 630849571 631344986 630906715 630449409 630687866
2882.5F30687866m19960l78113j042976l34396l16658o9390M36287L07999O26182J47171
$$ 630687866 630267906 629889793 628846817 628512421 628195763 628126373 628562660 628870659 629496841 629644012
2892.2F29644012m8675j022339m63905l98407q41751m46968m52538N95589J15051K74925
$$ 629644012 629595337 628572998 628109093 627710686 626868935 626421967 625969429 626565018 626680069 626954994
2901.8F26954994J90087m18358l33405m17900k66647o89469k32963o87943k79731J45225
$$ 626954994 627145081 626726723 626393318 625975418 625708771 625019302 624786339 624098396 623818665 623963890
2911.4F23963890L0556M07905j00669M0168j190796o08024k06146q03605j35002l73535
$$ 623963890 623994446 624402351 624301682 624341850 623151054 622543030 622336884 621533279 621398277 621024742
2921.1F21024742J59149k18162J44500K53258J87760L22876m00162l79295m99497K11334
$$ 621024742 621183891 620965729 621110229 621363487 621551247 621874123 621473961 621094666 620595169 620806503
2930.7F20806503n45883j82991O44455L03154K96555q5259M92745n76249r9716M31099
$$ 620806503 620260620 620077629 620722084 621025238 621321793 621236534 621729279 621153030 621053314 621484413
2940.4F21484413m91257k16255j73149O27327L75786K93846j1177j34659l2196n10216
$$ 621484413 620993156 620776901 620603752 621231079 621606865 621900711 621889534 621754875 621722679 621212463
2950F21212463j22795o96754m02069P2555N57099K77481j19858P9231l98178K71912
$$ 621212463 621089668 620392914 619990845 620063400 620620499 620897980 620778122 620857353 620459175 620731087
2959.7F20731087k3270j18637j073837r47991L67737J67046Q35571M6349j75972l63808
$$ 620731087 620707817 620589180 619515343 618567352 618935089 619102135 619937706 619984055 619808083 619444275
2969.3F19444275J78490O95419l59993l57666p16133K82860j66321k07558N42297O5995
$$ 619444275 619622765 620318184 619958191 619600525 618884392 619167252 619000931 618793373 619335670 619401665
2979F19401665N56793j56364q4878m91790p10259m42543k25525K24800j19705M88167
$$ 619401665 619958458 619802094 619717216 619225426 618515167 618072624 617847099 618071899 617952194 618440361
2988.6F18440361l83186N9776O40488J03798M1694n74379J48697k82860n79719o58112
$$ 618440361 618057175 618116951 618757439 618861237 618902931 618328552 618477249 618194389 617614670 616956558
2998.2F16956558l57742K33688K33498O93817q888J5411m31137l37677m81605r05304
$$ 616956558 616598816 616832504 617066002 617759819 617750931 617766342 617335205 616997528 616515923 615610619
3007.9F15610619K10990o9084o7444n0392L26805Q7243J25274K13738o68221q9111
$$ 615610619 615821609 615752525 615685081 615634689 615961494 616048737 616174011 616387749 615719528 615630417
3017.5F15630417m80957j96648p20749m03595Q10433O5651N6534n77469K54631N4817
$$ 615630417 615149460 614952812 614232063 613828468 614638901 614704552 614761086 614183617 614438248 614493065
3027.2F14493065o38580r3041l50494m01306q07839J45264K9487J77994M42963m5395
$$ 614493065 613854485 613761444 613410950 613009644 612201805 612347069 612376556 612554550 612997513 612952118
3036.8F12952118P629r80377m57229l28255k40708P0916o4240P1411K2507R117n51414
$$ 612952118 612959747 611979370 611522141 611193886 610953178 611024094 610959854 611031265 611053772 611062889 610511475
3047.4F10511475M52118K33192n08041n45350n79223o3667l55645J52626l22761j11008
$$ 610511475 610963593 611196785 610688744 610143394 609564171 609500504 609144859 609297485 608974724 608863716
3057.1F08863716Q2321j62811j3542m88243K30903k60582k06451p38487l97339K81067
$$ 608863716 608946037 608783226 608769684 608281441 608512344 608251762 608045311 607306824 606909485 607190552
3066.7F07190552o47354N09262L9329L94593P9917j038322n44052n77812J34239l59459
$$ 607190552 606543198 607052460 607091789 607486382 607566299 606527977 605983925 605406113 605540352 605180893
3076.4F05180893k96860P1907P37419L71209n08652p0725r13047k96822k97241l09258
$$ 605180893 604884033 604955940 605693359 606064568 605555916 605485191 604572144 604275322 603978081 603668823
3086F03668823m08897p04270J73493L29285M10270n45006L56675L6392p26738K5101
$$ 603668823 603259926 602555656 602729149 603058434 603468704 602923698 603280373 603316765 602590027 602615128
3095.6F02615128n71099k29263o27518r7732j06583k03705j26610n25436N71709J01127
$$ 602615128 602044029 601814766 601187248 601089516 600982933 600779228 600652618 600127182 600698891 600800018
3105.3F00800018J15624n30472p89909o26412o08902L91960n340M73709K02904J29661
$$ 600800018 600915642 600385170 599595261 598968849 598359947 598751907 598746567 599220276 599423180 599552841
3114.9E99552841m41665p44362J07956m56314l02773r11026k34375J84517J66969L65563
$$ 599552841 599111176 598366814 598474770 598018456 597715683 596804657 596570282 596754799 596921768 597287331
3124.6E97287331k58294k0217o85578K3499k49787o21528m08364n12352K92931l99361
$$ 597287331 597029037 597008820 596323242 596346741 596096954 595475426 595067062 594554710 594847641 594448280
3134.2E94448280J2856K26745M78974l46222j191483m65469n80559K25487k57683J13068
$$ 594448280 594461136 594687881 595166855 594820633 593629150 593163681 592583122 592808609 592550926 592663994
3143.9E92663994N7640k18315L52707k78092K1363o09780k85835m75769m34380l54156
$$ 592663994 592721634 592503319 592856026 592577934 592599297 591989517 591703682 591227913 590793533 590439377
3153.5E90439377q47321L39508k14195N18608M47540k62146J38817k13165m68025r90486
$$ 590439377 589592056 589931564 589717369 590235977 590683517 590421371 590560188 590347023 589878998 588888512
3163.1E88888512n80101q76503Q6326K15721k04086N25017L0136J46637o83441o00701
$$ 588888512 588308411 587431908 587518234 587733955 587529869 588054886 588085022 588231659 587548218 586947517
3172.8E86947517q32977n57938p0266l60756K87552j207733k1935R40208J36185k97623
$$ 586947517 586114540 585556602 585486336 585125580 585413132 584205399 584183464 585123672 585259857 584962234
3182.4E84962234n34591L89175n88379n03997p25747p67669j46294k05002K90604L10593
$$ 584962234 584427643 584816818 584228439 583724442 582998695 582231026 582084732 581879730 582170334 582480927
3192.1E82480927M10232r11827m43878M9515m36516k99492o75316j84784n39627J77917
$$ 582480927 582891159 581979332 581535454 581584969 581148453 580848961 580173645 579988861 579449234 579627151
3201.7E79627151M9515o5498p2289p09953N4894p79953l14446l42407m52919m3450
$$ 579627151 579676666 579611168 579538879 578828926 578883820 578103867 577789421 577447014 576994095 576950645
3211.4E76950645k14042P10830M9210k42844n96237k27852M8027n39970n34859j022911
$$ 576950645 576736603 577447433 577496643 577253799 576657562 576429710 576477737 575937767 575402908 574379997
3221E74379997n82580j14441L53203j90087J82724M01116j97792O9122j221275o67839
$$ 574379997 573797417 573682976 574036179 573846092 574028816 574429932 574232140 574301262 573079987 572412148
3230.7E72412148J05209l47672j200142m16679P41539k06757K20795m02260j9760l5095
$$ 572412148 572517357 572169685 570969543 570552864 571294403 571087646 571308441 570906181 570886421 570851326
3240.3E70851326m90456n1498n81322J64719q22792l55454K90337J11160O3477r89876
$$ 570851326 570360870 570309372 569728050 569892769 569069977 568714523 569004860 569116020 569179497 568189621
3249.9E68189621m24881o49300j45492o41175n54504M07562j945N13000j26876J42364
$$ 568189621 567764740 567115440 566969948 566328773 565774269 566181831 566179886 566692886 566566010 566708374
3259.6E66708374q7471K5787l09829j192437l47671q30917m61541l2463M47998J8044
$$ 566708374 566620903 566646690 566336861 565144424 564796753 563965836 563504295 563471832 563919830 563937874
3269.2E63937874j72882J96304l97835N3215r79652m32282n4893n75867j92795l54080
$$ 563937874 563764992 563961296 563563461 563616676 562637024 562204742 562149849 561573982 561381187 561027107
3278.9E61027107q8463j65557O58607j03416m61617j23215m88319n84412q10890R6207
$$ 561027107 560938644 560773087 561431694 561328278 560866661 560743446 560255127 559670715 558859825 558956032
3288.5E58956032o65245N0697M72336j48811K67448k06909R0599n91049m23394r12628
$$ 558956032 558290787 558341484 558813820 558665009 558932457 558725548 558816147 558225098 557801704 556889076
3298.2E56889076q46138j65748m09050L75366m97780k03400k54669K38877M99114q75053
$$ 556889076 556042938 555877190 555468140 555843506 555345726 555142326 554887657 555126534 555625648 554750595
3307.8E54750595q66623p42607K78778o94122m32625J62354P6942N35164q42972l51677
$$ 554750595 553883972 553141365 553420143 552726021 552293396 552455750 552532692 553067856 552224884 551873207
3317.4E51873207o22139m93927m76532n32112K9831m27475J87836n47715J26801M4212
$$ 551873207 551251068 550757141 550280609 549748497 549778328 549350853 549538689 548990974 549117775 549161987
3327.1E49161987k85835k15492q80394j1482r99680m45518m03939n27801K99759j35765
$$ 549161987 548876152 548660660 547780266 547768784 546769104 546323586 545919647 545391846 545691605 545555840
3336.7E45555840p744o09513j86195k01416J51672o66313j530495o55670p14111J01433
$$ 545555840 545548096 544938583 544752388 544550972 544702644 544036331 542505836 541850166 541136055 541237488
3346.4E41237488l83721J72043J97487o55289m81414n51796k14844n67780M14353q94547
$$ 541237488 540853767 541025810 541223297 540568008 540086594 539534798 539319954 538752174 539166527 538271980
3356E38271980j040535N46608Q2970O2828o67953k40555j131592l28827M90608j155052
$$ 538271980 537231445 537778053 537861023 537923851 537255898 537015343 535883751 535554924 536045532 534890480
3365.7E34890480p16553l78418O52275r6702o25572l84636o91147k95906l92800l66783
$$ 534890480 534173927 533795509 534447784 534351082 533725510 533340874 532649727 532353821 531961021 531594238
3375.3E31594238r87739l33596q27293n24330K05727o35300L05405J61018M08211j87035
$$ 531594238 530606499 530272903 529445610 528921280 529127007 528491707 528797112 528958130 529366341 529179306
3384.9E29179306p13539o61850l93028K94685j129799m48494K40975J22337n81970
$$ 529179306 528465767 527803917 527410889 527705574 526575775 526127281 526368256 526490593 525908623
3393.6E25908623m63257O57692m14543q86460j126060m19617l85437M616K95944m86107
$$ 525908623 525445366 526103058 525688515 524802055 523675995 523256378 522870941 522875557 523171501 522685394
3403.3E22685394K57988j59950k1667n17540l24135j44463j036568l64189k78015j17912
$$ 522685394 522943382 522783432 522761765 522244225 521920090 521775627 520739059 520374870 520096855 519978943
3412.9E19978943n18189L69187P4997o74858n92118n21431J268692r20715j429710
$$ 519978943 519460754 519829941 519904938 519230080 518637962 518116531 519385223 518464508 517034798
3421.6E17034798J0948k47345P8277J66588J069794K80495m07486l66822L66021n20134
$$ 517034798 517045746 516798401 516876678 517043266 518113060 518393555 517986069 517619247 517985268 517465134
3431.2E17465134j506996n33753r86977L19405N74570K85797j12229j76887K07481
$$ 517465134 515958138 515424385 514437408 514756813 515331383 515617180 515504951 515328064 515535545
3439.9E15535545j28555O92749j378784n55954M73518J50452K63634j883660J61705
$$ 515535545 515406990 516099739 514720955 514165001 514638519 514788971 515052605 513168945 513330650
3448.6E13330650O29235M62265L16658l93792o4582n47295k21786o41327j46637m64745
$$ 513330650 513959885 514422150 514738808 514345016 514280434 513733139 513511353 512870026 512723389 512258644
3458.2E12258644K85416J140671m0970J04637n31159L11242N3710l06434j36986m52843
$$ 512258644 512544060 513684731 513643761 513748398 513217239 513528481 513582191 513275757 513138771 512685928
3467.9E12685928L52898p1678K30980p1717r2544j3466J05591L39088j4839K55623
$$ 512685928 513038826 512967148 513198128 513126411 513033867 513020401 513125992 513465080 513450241 513705864
3477.5E13705864m84581J52817j73111j00937K25716k72332O73294J13259O19545O714
$$ 513705864 513221283 513374100 513200989 513100052 513325768 513053436 513726730 513839989 514459534 514466248
3487.2E14466248j004906r46121K79045J260414j97106K82288J42288N79071K35672
$$ 514466248 513461342 512515221 512794266 514054680 513857574 514139862 514282150 514861221 515096893
3495.8E15096893j010360j95847j61095L14103K40860N53054o43692j124153J50414
$$ 515096893 514086533 513890686 513729591 514043694 514284554 514837608 514193916 513069763 513220177
3504.5E13220177M86068J012078M21600J177025n45120j682625K0294K89078M37698
$$ 513220177 513706245 514718323 515139923 516316948 515771828 514089203 514109497 514398575 514836273
3513.2E14836273q5602L73688j77154M02183L71018k93122n2528k04621J471329l74183
$$ 514836273 514750671 515124359 514947205 515349388 515720406 515427284 515374756 515170135 516641464 516267281
3522.9E16267281j785202l18375Q34732J050644m1428M08325q85581J51557P10717
$$ 516267281 514482079 514163704 514998436 516049080 516007652 516415977 515530396 515681953 516392670
3531.5E16392670M68025L10783o41632P23763o62003j108284Q2207Q73909J103706
$$ 516392670 516860695 517171478 516529846 517253609 516591606 515483322 515565529 516439438 517543144
3540.2E17543144o2790M72565N27458Q50182j014748m23889P81288k126388N39741
$$ 517543144 517480354 517952919 518480377 519330559 518315811 517891922 518673210 516546822 517086563
3548.9E17086563J377907J198692Q15201k511597l45192Q70476O46095R48716q95996
$$ 517086563 518464470 519663162 520478363 517966766 517621574 518492050 519138145 520086861 519190865
3557.6E19190865l44J156960l32756n47295R90830r0447j015205K896309J89857k838402
$$ 519190865 519190521 520347481 520014725 519467430 520458260 520367813 519352608 522248917 522438774 519600372
3567.2E19600372j402549k775307L348732K066040J03874J487122R842Q9035r8114
$$ 519600372 518197823 515422516 518771248 520837288 520941162 522428284 522438126 522527161 522429047
3575.9E22429047O10466r40857N10063J186981j137199L87535k34909O48002L28484
$$ 522429047 523039513 522098656 522608719 523795700 522658501 523046036 522811127 523459129 523787613
3584.6E23787613K847824J559525m518662L47214l499909R20220J976051J276093N76133
$$ 523787613 526635437 528194962 523676300 524023514 520523605 521443825 523419876 524695969 525272102
3593.2E25272102j515503K440987k523842O37093K141456r84382J605987j099739q10432
$$ 525272102 523756599 526197586 523673744 524310837 526452293 525467911 527073898 525974159 525163727
3601.9E25163727J2398Q17794N17960K206192K171898l589974K236443k303238k371674
$$ 525163727 525176125 525993919 526511879 528718071 530889969 527299995 529536438 527233200 524861526
3610.6E24861526N909615m00391m392738J928482j946220J542892L766060k471161
$$ 524861526 530771141 530370750 525978012 527906494 525960274 527503166 531269226 528798065
3618.3E28798065N11055j352043j420555J366692L47175J476250R07936N29327k62489
$$ 528798065 529309120 527957077 526536522 527903214 528250389 529726639 530634575 531163902 530901413
3627E30901413N076332J763344j5109100J904869L092308M742469O11306l450547L59459
$$ 530901413 535977745 537741089 522631989 524536858 527629166 532371635 532982941 529532394 529891853
3635.7E29891853Q21915P06940j052399J338463J189728R67369m92440j428337J451264
$$ 529891853 530713768 531420708 530368309 531706772 532896500 533863869 533371429 531943092 533394356
3644.4E33394356J389122M796333j421013m779548L186607k217484m219856l814735
$$ 533394356 534783478 539579811 538158798 533379250 536565857 534348373 530128517 526313782
3652.1E26313782L567047K651939L245812N006447q251877j985588K927055M14810
$$ 526313782 529880829 532532768 535778580 540785027 532533150 530547562 533474617 533889427
3659.8E33889427K26021O74362N42450j75285N47180M37508j297036J417733K725906
$$ 533889427 534115448 534789810 535332260 535156975 535704155 536141663 534844627 536262360 538988266
3668.5E38988266q48770P72476q057404j355400O929474P943344L451691j9000702
$$ 538988266 538139496 538911972 530854568 529499168 536428642 544371986 547823677 528822975
3676.2E28822975m59366N410691L384208j582565j467628K012825M88166M41513n33523
$$ 528822975 528363609 533774300 537158508 535575943 534108315 536121140 536609306 537050819 536517296
3684.9E36517296m72260K585945N082169n303497p273445O192855m106407j550216
$$ 536517296 536045036 538630981 543713150 538409653 531136208 537329063 533222656 531672440
3692.6E31672440M146690J92871Q18558o05088K976M75731o51322J229172L129578
$$ 531672440 535819130 536012001 536830559 536225471 536228447 536704178 536052856 537282028 540411606
3701.3E40411606l646279m966964L084259J207084L88871k65236J461563L666687o944885
$$ 540411606 536765327 531798363 534882622 536089706 536478577 536213341 537674904 541341591 534396706
3709.9E34396706K353134M444084j0391579O30226L194466P84569N56564J792069N02052
$$ 534396706 536749840 541193924 530802345 531432571 534627037 535411606 535968170 537760239 538262291
3718.6E38262291k531776q54302M493294k561302n716477L679085K30598j53541l416252
$$ 538262291 535730515 534876213 539369507 536808205 531091728 534770813 535001411 534847870 531431618
3727.3E31431618o25496L707847J164513M693298k282676p168122N805970J752586
$$ 531431618 530806122 534513969 535678482 540371780 538089104 530920982 536726952 538479538
3735E38479538q960190N79643K433625j245842J819496K900276k141991P38488R960441
$$ 538479538 529519348 530098991 532532616 531286774 533106270 536006546 533864555 534603043 544563484
3743.7E44563484l021583j8711205O383591L430595N149117k375412j0156136Q870392
$$ 544563484 541541901 522830696 529214287 532644882 537793999 535418587 525262451 534132843
3751.4E34132843p10525p332764K865143L588333K550125l053627J46255M002648m737015
$$ 534132843 533422318 526089554 528954697 532543030 535093155 532039528 532185783 536188431 531451416
3760.1E31451416k244987L215827L84789L40233K722854j378402m979821P45926L884392
$$ 531451416 529206429 532422256 532807045 533147278 535870132 534491730 529511909 530257835 534142227
3768.8E34142227J075783n939179p32116K642822K93007K91176J88675j10932M5319
$$ 534142227 535218010 529278831 528546715 531189537 531482544 531773720 531962395 531851463 531896782
3777.4E31896782J345940J049041n988197J046982J246795p82012J862945k952690
$$ 531896782 533242722 534291763 528303566 529350548 530597343 529815331 531678276 528725586
3785.2E28725586m42925J371766O80160O60400o52427K51922j307602J13221L05J195679
$$ 528725586 528282661 529654427 530334587 530994987 530342560 530594482 529286880 529400101 529400406 530596085
3794.8E30596085L312416l443299m151916P76214L778763M760895l440819r934501
$$ 530596085 533908501 530465202 526313286 527089500 530868263 535629158 532188339 522253838
3802.5E22253838O12373K038765L190498N559197o880150m211998L369293K242394
$$ 522253838 522866211 524904976 528095474 533654671 526774521 522562523 525931816 528174210
3810.2E28174210P25441l71437M0054k64435L978043o10123j1963310K323646L874817
$$ 528174210 528899651 528528214 528568268 528303833 532281876 531671753 519708443 522032089 525906906
3818.9E25906906M589882K749023j1735038j500473M175949J459465Q59299M2572l475304
$$ 525906906 530496788 533245811 521510773 520010300 524186249 525645714 526505013 526547585 523072281
3827.6E23072281O51398J195335L029327J988869p860260P49130N900803l264885k180519
$$ 523072281 523723679 524919014 527948341 529937210 522076950 522826080 528726883 525461998 523281479
3836.3E23281479Q860626m889679q258018N816841m285279l62358O104012p98950m894753
$$ 523281479 532142105 527252426 518994408 524811249 520525970 520163612 526267624 525468674 520573921
3844.9E20573921J553040J986999k26936N67207j901207J943054N344697l364945J076851
$$ 520573921 522126961 524113960 523887024 524454231 522553024 524496078 529840775 526475830 527552681
3853.6E27552681j1538811j991272P655487J55297k670632J922493J487503J940155
$$ 527552681 516013870 514022598 521678085 521833382 519162750 521085243 522572746 524512901
3861.3E24512901l985748q66890O266136o055641m378281L370781L834954O437912
$$ 524512901 520527153 519660263 525926399 519870758 515492477 518863258 522698212 529136124
3869.1E29136124l922425j0131530L48167M964485L639260o685410j109810K595482
$$ 529136124 525213699 515082169 515430336 520394821 524034081 517348671 516238861 518834343
3876.8E18834343M48112J211930M249077m278183p411042L748017J525192J640587
$$ 518834343 519282455 520494385 524743462 520465279 513054237 516802254 518327446 519968033
3884.5E19968033N163193r239502k237625M017066P91054L094826N16930p445832N78881
$$ 519968033 525131226 515891724 513654099 517671165 518462219 521557045 522073975 514628143 515207024
3893.2E15207024K183570q63761K78587O77872K490654K867698q791351J081352K946472
$$ 515207024 517390594 516526833 516805420 517483292 519973946 522841644 514050293 515131645 518078117
3901.8E18078117n386657L373184j274185j586418Q86306O8856J648521q50868M51660
$$ 518078117 512691460 516064644 514790459 513204041 514090347 514159203 515807724 514956856 515408516
3910.5E15408516L88832p4348p02286r88922J681518J263962j784477l091278L712158
$$ 515408516 515797348 515723000 515020714 514031792 515713310 516977272 515192795 512101517 515813675
3919.2E15813675P90062m314919J788369R69925J043472j733628l103294P73087J031837
$$ 515813675 516603737 512288818 514077187 515047112 516090584 514356956 511253662 512026749 513058586
3927.9E13058586J178780j095963j28135J220588j912880j592064J182633M44488r7885
$$ 513058586 514237366 513141403 513013268 514233856 512320976 510728912 511911545 512356033 512258148
3936.6E12258148L01094n72052R5139p97157J577262J882668l505249q71582P9918
$$ 512258148 512559242 511987190 512082329 511285172 512862434 514745102 511239853 510368271 510448189
3945.2E10448189P14226J225967j573410N2452P9079k789650M53567J822014k07367
$$ 510448189 511162415 512388382 510814972 510867424 510946503 508156853 508610420 510432434 510225067
3953.9E10225067N6648o36520K15378K71835k02904l03726o76231R12933j030388j71852
$$ 510225067 510281715 509645195 509860573 510132408 509929504 509625778 508949547 509862480 508832092 508660240
3963.6E08660240L20664n65186O32286m40101M06799p8354l94440k67372o24580j49880
$$ 508660240 508980904 508415718 509048004 508607903 509014702 508936348 508541908 508274536 507649956 507500076
3973.2E07500076m17099L63503n53169J69220K35214m15192J34812J98593O34079r31511
$$ 507500076 507082977 507446480 506893311 507062531 507297745 506882553 507017365 507215958 507850037 506918526
3982.8E06918526o46363J35956M09050p8010k73362N68200n40314m31862o66809j3008
$$ 506918526 506272163 506408119 506817169 506739159 506465797 507033997 506493683 506061821 505395012 505382004
3992.5E05382004J6594k88964J01853j63727Q65822m97589n90210q3504
$$ 505382004 505398598 505109634 505211487 505047760 505913582 505415993 504825783 504742279
4000.2E04742279
$$ 504742279
##END=$$ End of the data block
