##TITLE=$$ Begin of the data block
##JCAMP-DX=5.00 $$ ACD/SpecManager v 10.08
##SPECTROMETER/DATA SYSTEM=Varian
##DATE=04 Dec 2012 14:36:42
##DATA TYPE=INFRARED SPECTRUM
##DATA CLASS=XYDATA
##ORIGIN=
##OWNER=
##NPOINTS=3735
##FIRSTX=399.26403809
##LASTX=4000.35498047
##MAXX=4000.35498047
##MINX=399.26403809
##MAXY=87.30023193
##MINY=51.16624451
##XFACTOR=1.0000000000
##YFACTOR=0.000000100000000
##FIRSTY=82.99089813
##DELTAX=0.96440572
##XUNITS=1/CM
##YUNITS=TRANSMITTANCE
##XYDATA=(X++(Y..Y))
399.3H29908981L7474594l239440Q858184l0948410R93042j8416748k1383972m548492
$$ 829908981 867383575 864144135 873002319 842053909 843046951 824630203 803246231 798697739
407G98697739j4149170J7656402o167144J0909881J7867279J6878052n450058k4530792
$$ 798697739 784548569 802204971 796037827 806947708 824814987 841693039 836242981 811712189
414.7H11712189k970963j1356354J7615433m031982J6551819k882843k1031571P559891
$$ 811712189 808741226 797384872 815000305 810968323 827520142 824637299 803605728 811165619
422.4H11165619J391449R596939j6995850k456741K779083L749390J0633011j3026276
$$ 811165619 812557068 822154007 805158157 802701416 805480499 809229889 819862900 806836624
430.1H06836624Q468628M339905N067444n08576K254410J22528k1989059K238846L778610
$$ 806836624 815305252 819645157 824712601 824204025 826458435 826580963 804591904 806830750 810609360
438.8H10609360Q136291n070877l137817k67182R537J6106873o58493L022461j1934815
$$ 810609360 818745651 813674774 810536957 810269775 810279312 826386185 825727692 828750153 816815338
447.5H16815338k439651l922272n429535Q284607l20816P875061p578735M471969k420730
$$ 816815338 814375687 810453415 805023880 813308487 812987671 820862732 813283997 817755966 815335236
456.2H15335236j0553589l304749j714096J9593277p717895m490052j271820q26416
$$ 815335236 804781647 801476898 799762802 819356079 811638184 807148132 805876312 805049896
463.9H05049896O343689K419281J2680741j1682358o544876m828339O319199N775528
$$ 805049896 811393585 813812866 826493607 814811249 808266373 803438034 809757233 815532761
471.6H15532761k0787735M149398Q814698J4014206l928299O59332l594055j1850434
$$ 815532761 794745026 798894424 807709122 821723328 817795029 818454361 814860306 803009872
479.3H03009872L607941o96411J1614838j801834m407349M125824O203918J89362j2174759
$$ 803009872 806617813 805921402 817536240 815734406 811327057 815452881 821656799 821846161 809671402
488H09671402L161545j965027K60849l615036j980820L470307k31095O339798J513672
$$ 809671402 812832947 810867920 811128769 807513733 805532913 809003220 808772125 815111923 816625595
496.7H16625595M759216o651916l147888J745376l199081J361618j548004M152298
$$ 816625595 821384811 814732895 811585007 813330383 810131302 811492920 809944916 814097214
504.4H14097214k384110J98593n226211q54035M034119m785080M133835j281738m91791
$$ 814097214 811713104 811911697 806685486 805831451 809865570 805080490 809214325 807932587 807440796
513.1H07440796m243546K497712Q134613r11560M074325l049927J032868l491516m297943
$$ 807440796 803197250 805694962 813829575 812918015 816992340 813942413 814975281 811483765 807185822
521.7H07185822l233796k673187J784592j100846O841279l240586p67822K840500J954956
$$ 807185822 803952026 801278839 803063431 801962585 808803864 805563278 804795456 807635956 809590912
530.4H09590912J971741l473587K067871n426407k145920j969681L3722N189819K83432
$$ 809590912 811562653 808089066 810156937 804730530 802584610 800614929 800648651 805838470 806121902
539.1H06121902N755768k743911o9123K870941k984619l700561k701264J297989k393570
$$ 806121902 811877670 809133759 809064636 811935577 808950958 805250397 802549133 803847122 801453552
547.8H01453552K940445J798935L647385L009186j21232L013840m669266j911087j780777
$$ 801453552 804393997 806192932 809840317 812849503 812728271 815742111 811072845 809161758 807380981
556.5H07380981j704788k773666r4299M455184J240921O230469R50547j160279l219604
$$ 807380981 805676193 802902527 802808228 807263412 808504333 814734802 815685349 814525070 811305466
565.1H11305466m074707l788452m498673J823349k049255K924881N125961L337707
$$ 811305466 807230759 803442307 798943634 800766983 798717728 801642609 806768570 810106277
572.9H10106277J744233P7591J144561o231308j774444k893830l908081j427383K519531
$$ 810106277 811850510 811928101 813072662 806841354 805066910 802173080 798264999 796837616 799357147
581.5G99357147N892029L470917N735092J32217N17350k077332m939499m329529o115493
$$ 799357147 805249176 808720093 814455185 814587402 815104752 813027420 808087921 803758392 797642899
590.2G97642899O88934o23627J889725K365875L797684O854553K921982r18198n522155
$$ 797642899 798331833 797708206 799597931 801963806 805761490 812616043 815538025 814619827 809097672
598.9H09097672k328797o134109l546372O89926k88925M200287M291306M732971J482086
$$ 809097672 806768875 800634766 797088394 797778320 797489395 801689682 805980988 810713959 812196045
607.6H12196045J271515k974091m172516k396316o466293j946106n8823K743072J642380
$$ 812196045 813467560 810493469 806320953 803924637 797458344 795512238 795453415 798196487 799838867
616.3G99838867M310837N145035J33133J585617l214646j596374l441391l405838k330017
$$ 799838867 804149704 809294739 809427872 811013489 807798843 806202469 802761078 799355240 797025223
624.9G97025223j439591O203614K333068K847443L756790K637711k88696l548813l732910
$$ 797025223 795585632 801789246 804122314 806969757 810726547 813364258 813075562 809526749 805793839
633.6H05793839n292588j519012j829529K204895L094940K919083M494705J347351
$$ 805793839 800501251 798982239 797152710 799357605 802452545 805371628 809866333 811213684
641.3H11213684K152329k795411k239151l298568l772888p74613l40042P72018o25610
$$ 811213684 813366013 810570602 808331451 805032883 801259995 800485382 800145340 800917358 800291748
650H00291748N357437K732544J678772J653900m599762l123092j788407P41501k380218
$$ 800291748 805649185 808381729 810060501 811714401 807114639 803991547 802203140 802944641 800564423
658.7H00564423N84182K887268K164917M330521P58057K39029j263428J704483l744888
$$ 800564423 801148605 804035873 806200790 810531311 811289368 811528397 810264969 811969452 808224564
667.4H08224564k4372788R296875P075119L871918l2120K390289K704316K360839j134872
$$ 808224564 783851776 793148651 800223770 804095688 804063568 806453857 809158173 811519012 810384140
676.1H10384140k804413J615524k071228m28695k204285j143188J046905J248016L268433
$$ 810384140 807579727 809195251 807124023 806695328 804491043 803347855 804394760 805642776 808911209
684.7H08911209n50156J253434j457749n79605R1019j720734J86920j294937J328659
$$ 808911209 808361053 809614487 808156738 807577133 807668152 805947418 806134338 804839401 806168060
693.4H06168060J064453J678544j64261J035919K416687j907120j239624l065872j2436
$$ 806168060 807232513 808911057 808746796 809782715 812199402 810292282 809052658 805986786 805974350
702.1H05974350M97513M32586Q86536n59540K594681O83823m33808j817932J9379l09982
$$ 805974350 806471863 806904449 807790985 807231445 809826126 810509949 810076141 808258209 808277588 807967606
711.7H07967606j385193J367111k78397J404496R34295J188431j272202k304992l64228
$$ 807967606 806582413 807949524 807671127 809075623 810009918 811198349 809926147 807621155 807256927
720.4H07256927k743911j81656O15387J923675J419449K058640J046219r19342J955261
$$ 807256927 804513016 804331360 804946747 806870422 808289871 810348511 811394730 810475388 812430649
729.1H12430649p96738m63943k190705k041549J5411J73264J765670r89837M81414
$$ 812430649 811633911 811169968 808979263 806937714 806953125 807126389 808892059 807902222 808383636
737.8H08383636P98264K239914K131500m52575k271348m459075j80512k41318J52512
$$ 808383636 809181900 811421814 813553314 813100739 810829391 806370316 806189804 805948486 806100998
746.5H06100998J071777K408829L137131P14645J681214q66471j698913k651749k316055
$$ 806100998 807172775 809581604 812718735 813433380 815114594 814248123 812549210 809897461 807581406
755.1H07581406k141343j739196L63998L37067M956207L442535J545182N61828j379928
$$ 807581406 805440063 803700867 804064865 804401932 809358139 812800674 814345856 814907684 813527756
763.8H13527756j654663l351746j650314l276978P8201L150559L093262K556762Q79593
$$ 813527756 811873093 808521347 806871033 803594055 803672256 806822815 809916077 812472839 813352432
772.5H13352432J863785j789398j67465j316300m050445k545319j250992J576615J262512
$$ 813352432 815216217 813426819 813259354 811943054 807892609 805347290 804096298 805672913 806935425
781.2H06935425L598785K099381J713791Q78906j688538j096115l466568j564636j602783
$$ 806935425 810534210 812633591 814347382 815226288 813537750 812441635 808975067 807410431 805807648
789.9H05807648M28848J086960M08630L007431L136902M501267M54406j850128l079376
$$ 805807648 806236496 807323456 807732086 810739517 813876419 818377686 818832092 816981964 813902588
798.5H13902588l768463l134232j106643K325897N76935K858734K141418K508316J631470
$$ 813902588 810134125 806999893 805893250 808219147 808796082 811654816 813796234 816304550 817936020
807.2H17936020j102295N52368k508621k400971k827835k11334l5705j388855K559585
$$ 817936020 816833725 817386093 814877472 812476501 809648666 809437332 809401627 808012772 810572357
815.9H10572357L025818L668823M60129o05545j691208k441788j568451j537170L70483
$$ 810572357 813598175 817266998 817727127 817121582 815430374 812988586 811420135 809882965 810253448
824.6H10253448o10656K033767J243287Q40835J521835J067658N82581k616044k51998
$$ 810253448 809642792 811676559 812919846 813760681 815282516 816350174 816932755 814316711 814064713
833.3H14064713k369614j722565j172180j200409K692642K466278L980484l5781q44193
$$ 814064713 811695099 809972534 808800354 807599945 810292587 812758865 816739349 816703568 815859375
841.9H15859375j465836k311019n36118k643204j029129j070099J796418J498413J530990
$$ 815859375 814393539 812082520 811546402 808903198 807874069 806803970 808600388 810098801 811629791
850.6H11629791L197861J084442J212540j946488j338653k861099j831284N94330P6
$$ 811629791 814827652 815912094 817124634 815178146 813839493 810978394 809147110 809741440 809741516
859.3H09741516K402496p9879Q09631K078095J178131j118775n20706J167603k170334
$$ 809741516 812144012 812064133 812873764 814951859 816129990 815011215 814490509 815658112 813487778
868H13487778j887970k138825l76587J79901J980057K561035L24784R84497j655579
$$ 813487778 811599808 809460983 809084396 809264297 811244354 813805389 814130173 815114670 813459091
876.7H13459091Q50983q05588j975479J078720j84936m00315j154632J764145J363449
$$ 813459091 814310074 813504486 811529007 812607727 812422791 812022476 810867844 812631989 813995438
885.3H13995438M35943k17514j193466l12805r27200Q78982j783600j147919J012574
$$ 813995438 814431381 814213867 813020401 812707596 811780396 812659378 810875778 809727859 810740433
894H10740433J29318m61884m65698J137772r36737j26877k0752L22800l40119j633606
$$ 810740433 810869751 810407867 809942169 811079941 810143204 810016327 809995575 810318375 809978256 808344650
903.7H08344650J128388O03943L53851p82013J106720O52389j242599m15955k434539
$$ 808344650 809473038 810076981 810430832 809648819 810755539 811407928 810165329 809749374 807314835
912.3H07314835K52761J378098P75223n07279K70386N82047j616822N31693j173172
$$ 807314835 807567596 808945694 809720917 809213638 809484024 810066071 808449249 808980942 807807770
921H07807770j230545r06067O3934J413193J45492J071930k07901N17884n18952j133346
$$ 807807770 806577225 805671158 805735092 807148285 807293777 808365707 808157806 808675690 808156738 807023392
930.7H07023392n85251j091919m10614q68225J098938J105652J857757N59387p92236
$$ 807023392 806438141 805346222 804935608 804067383 805166321 806271973 808129730 808689117 807896881
939.3H07896881K7008r43069L79944j189347p36542m10766K84424O25457j053237J454086
$$ 807896881 807923889 806980820 807360764 806171417 805434875 805024109 805308533 805933990 804880753 806334839
949H06334839J141357J482315Q2474j321106j679916k872849p23800k27967J147919
$$ 806334839 807476196 808958511 809040985 807719879 806039963 803167114 802443314 802215347 803363266
957.7H03363266N03769J46942P51267P68585J96609j835785p87506j367416n21317
$$ 803363266 803867035 804013977 804765244 805533829 805730438 803894653 803107147 801739731 801218414
966.3H01218414o94580o68487M98657k95334P77817J29928R68934K15759o31104j317215
$$ 801218414 800523834 799855347 800354004 800058670 800836487 800966415 801935349 802151108 801520004 800202789
976H00202789j632080j12152k244339j453400n37872J210632J408463L17078K99682
$$ 800202789 798570709 798458557 796214218 794760818 794222946 795433578 796842041 797159119 797458801
984.7G97458801j397400r613j649933j775665j472015j174774N30090J54266Q80127
$$ 797458801 796061401 796051788 794401855 792626190 791154175 789979401 790509491 790663757 791543884
993.3G91543884p35321J003113P68662l92914l33710j768112o20423k054214J26114
$$ 791543884 790808563 791811676 792580338 792187424 791853714 790085602 789465179 787410965 787537079
1002G87537079O58417o1036R96476N3024Q12225J7624k57873j212464r31701j541520
$$ 787537079 788195496 788134460 789130936 789183960 789996185 790013809 789755936 788543472 787611771 786070251
1011.7G86070251j139678M89273j001816L88946M73709R36966l42483o44989J26190
$$ 786070251 784930573 785419846 784418030 784806976 785280685 786217651 785875168 785230179 785356369
1020.3G85356369j490555p84988j523590R7122r3079N06363M96063j029510J392746
$$ 785356369 783865814 783080826 781557236 781654358 781561279 782067642 782563705 781534195 782926941
1029G82926941N76095Q06962n04990k07596J8158j124191M90036l56369L35083o59332
$$ 782926941 783503036 784309998 783805008 783597412 783615570 782491379 782981415 782625046 782960129 782300797
1038.7G82300797O52923J262665L13339O17218j113129l47824p48748N59845J01471
$$ 782300797 782953720 784216385 784529724 785146942 784033813 783685989 782937241 783497086 783598557
1047.4G83598557k63138k40174o33316P13349p78580J275558l76586o12412L23486
$$ 783598557 783335419 783095245 782461929 783175278 782396698 783672256 783295670 782683258 783006744
1056G83006744j030960L10364p73163J405869Q69446P17926o9886j497116O80924l0289
$$ 783006744 781975784 782286148 781512985 782918854 783788300 784506226 784436340 782939224 783620148 783589859
1065.7G83589859M92554j036377L74527R88693n21622q1100l23029N03540j159897
$$ 783589859 784082413 783046036 783420563 784409256 783887634 783806534 783483505 783987045 782827148
1074.4G82827148j016006j825562P9117J130295n66406L02810n43060Q17414J38092
$$ 782827148 781811142 779985580 780064697 781194992 780628586 780931396 780388336 781205750 781343842
1083G81343842J116943K04086n04455j34125l059158J020813J214294k5482r5902O14167
$$ 781343842 782460785 782664871 782160416 782026291 778967133 779987946 781202240 781176758 781080856 781695023
1092.7G81695023J538467p66907K50855p45621r25064j569901L30735P05337j808929
$$ 781695023 783233490 782466583 782717438 781971817 781046753 779476852 779807587 780512924 778703995
1101.4G78703995R47189P05185J191711p7896m31976O1493q37097j12763j972198p84226
$$ 778703995 779651184 780356369 781548080 781470184 781038208 781099701 780262604 780149841 778177643 777393417
1111G77393417k57187Q53882O80313J84098J703415L63311K54441n54276R40628l23868
$$ 777393417 777136230 777990112 778670425 778854523 780557938 780921249 781175690 780621414 781562042 781238174
1120.6G81238174k552261j686859j068955J086884J132660K585373J801147O1798k70080
$$ 781238174 778685913 776999054 775930099 777016983 778149643 780735016 782536163 782597961 782327881
1129.3G82327881j67999K34985j818543n95092K07596Q18252O95191M62493O99540
$$ 782327881 782159882 782394867 780576324 779981232 780188828 781007080 781702271 782164764 782864304
1138G82864304P43789J834564p56454k59094m43192j437607j432724j576461J71737
$$ 782864304 783608093 785442657 784686203 784427109 783983917 782546310 781113586 779537125 779708862
1146.7G79708862n87387J149979M96902J61057P29751k75116L83149j137162k14309
$$ 779708862 779121475 780271454 780768356 780929413 781659164 781384048 781767197 780630035 780415726
1155.4G80415726j438294j700897L87116J232070J035843m1351J954803N93567L24936
$$ 780415726 778977432 777276535 777663651 778895721 779931564 779890213 781845016 782438583 782763519
1164G82763519K09122n51758q4076j898269j075058k83661J587829J766587J576309
$$ 782763519 782972641 782420883 782336807 780438538 779363480 779079819 780667648 782434235 784010544
1172.7G84010544J715393L91388J122436l53927j052399j495438p24411k14004j37177
$$ 784010544 785725937 786117325 787239761 786885834 785833435 784337997 783613586 783399582 783262405
1181.4G83262405J622925J492005J744461K48031K43302J82190p59125j109619j454621
$$ 783262405 784885330 786377335 788121796 788369827 788613129 788795319 788036194 786926575 785471954
1190.1G85471954k06909q12759R82818K88391m7683J644592O08368Q39920o92062m69971
$$ 785471954 785265045 784452286 785435104 785723495 785675812 787320404 787928772 788768692 788076630 787606659
1199.7G87606659q08716j388626r16672K04087J452255k64969J132507O85272N3406
$$ 787606659 786797943 785409317 784492645 784696732 786148987 785884018 787016525 787701797 787755203
1208.4G87755203L67203k92282q4992j105804j66016l90625L35770L31268k17971L85971
$$ 787755203 788122406 787830124 787745132 786639328 786473312 786082687 786418457 786749725 786531754 786917725
1218G86917725L67965J561280o1875k32010q81424j336364j11008j11694N79223n00412
$$ 786917725 787285690 788846970 788785095 788553085 787671661 786335297 786224289 786112595 786691818 786191406
1227.7G86191406K78321O80542N53741R6130p12738l69568j259918k21252j23444L30200
$$ 786191406 786469727 787150269 787704010 787800140 787087402 786717834 785457916 785236664 785113220 785443420
1237.3G85443420M7379j15051R14001J71280O00357o40030n82504m50287o31638m72641
$$ 785443420 785490799 785375748 786289749 786461029 787061386 786421356 785838852 785388565 784756927 784284286
1247G84284286m77676J158371q469N05829Q50220K11639l128p78427p1640p79800p12433
$$ 784284286 783806610 784964981 784956512 785462341 786312561 786524200 786521072 785742645 785671005 784891205 784178772
1257.6G84178772m41742M04663N01709N66940R32541j51214J92947r01413l45230m55856
$$ 784178772 783737030 784141693 784643402 785210342 786142883 785991669 786184616 785283203 784937973 784482117
1267.2G84482117q10776L76968o1950O08215L10822P89871J11618k23084N1880q58764
$$ 784482117 783671341 784048309 783986359 784594574 784905396 785695267 785806885 785583801 785635681 784776917
1276.9G84776917m69895j174469K7008K62604L30429Q29010N73273R76257j44043P7057
$$ 784776917 784307022 783132553 783159561 783422165 783752594 784581604 785154877 786131134 785987091 786064148
1286.5G86064148p12586j165542j140061p22503J25656l33328Q28094Q36258J597214
$$ 786064148 785351562 784186020 783045959 782323456 782449112 782115784 782943878 783780136 785377350
1295.2G85377350Q47854p16476o53686j384125j330872j480865J29776K04467L19672
$$ 785377350 786225204 785508728 784855042 783470917 782140045 780659180 780788956 780993423 781313095
1303.9G81313095R70154R39484J621933J08413k17590p12128j578522k415466j508636
$$ 781313095 782283249 783222733 784844666 784953079 784735489 784023361 782444839 780029373 778520737
1312.5G78520737K04162j89514J045227P01523J343842J300430K00348k03934p18689
$$ 778520737 778724899 778535385 779580612 780282135 781625977 782926407 783126755 782922821 782204132
1321.2G82204132l22952j992569r16825k75115l65906Q50143J169892J697921Q39768
$$ 782204132 781881180 779888611 778971786 778696671 778330765 779180908 780350800 782048721 782888489
1329.9G82888489Q49457k80076r43985j892318k298355j216965j605911Q99353P95517
$$ 782888489 783737946 783457870 782513885 780621567 778323212 777106247 775500336 776399689 777195206
1338.6G77195206Q87451J728973J387940J366272q63266j048584j535416j278000j088714
$$ 777195206 778082657 779811630 781199570 782565842 781702576 780653992 779118576 777840576 776751862
1347.3G76751862r20945L56369J219178K263565J013641J055527Q316j243897j189193
$$ 776751862 775830917 776187286 777406464 779670029 780683670 781739197 781747513 780503616 779314423
1355.9G79314423j629029j163635j574020L7918j93405N56182J640931O18057K120437
$$ 779314423 777685394 776521759 774947739 774985657 774792252 775348434 776989365 777607422 779727859
1364.6G79727859Q82721p45239j736755k383347j939773j99433K22397n9814J185913
$$ 779727859 780610580 779865341 778128586 775745239 773805466 773606033 773828430 773768616 774954529
1373.3G74954529q6136R98611J753922P39746q01392k352752j637268j723175o15387
$$ 774954529 774868393 775867004 777620926 778360672 777559280 775206528 773569260 771846085 771230698
1382G71230698q43048P92236J909408J281052J372147q77152J572571N20554j695710
$$ 771230698 770387650 771179886 773089294 774370346 775742493 774865341 776437912 776958466 775262756
1390.7G75262756j579361r66949j08490k479477M7760K639618K442779J034623j291504
$$ 775262756 773683395 772716446 772607956 770128479 770176239 772815857 775258636 776293259 775001755
1399.3G75001755M41589L05557j177368j396942l83530k343139K16598K454224J298141
$$ 775001755 775443344 775748901 774571533 773174591 772791061 770447922 770664520 773118744 774416885
1408G74416885J424866M9591p8888n80139j185608j127472j395035k9678p65610K38724
$$ 774416885 775841751 775891342 775812454 775232315 774046707 772919235 771524200 771494522 770728912 770967636
1417.7G70967636k39639k346344L138199L005066Q84323j953507k599258m32587M25034
$$ 770967636 770727997 768381653 771519852 774524918 775409241 773455734 770856476 770423889 770848923
1426.3G70848923q32749j77002K60392l95203J931839J247940K74582r6054O13632
$$ 770848923 770016174 769839172 770099564 769704361 771636200 772884140 773158722 773062668 773676300
1435G73676300r23080p648850Q13522K595978J006241M67987J293793O47125Q19779
$$ 773676300 772753220 765104370 765917892 768513870 769520111 769988098 771281891 771929016 772748795
1443.7G72748795O75888r75800k24380k165451k922898O97785J192245R7122j31836
$$ 772748795 773424683 772448883 772224503 770059052 767136154 767833939 769026184 769123306 768991470
1452.4G68991470J239243P65076M43344l153534p995072J89972L155213K598800K012101
$$ 768991470 770230713 770995789 771439133 768285599 760290527 760480499 763635712 766234512 768246613
1461.1G68246613R21402L35845J773301k156830n38025K510223N23224L79715q06656
$$ 768246613 769168015 769503860 771277161 769120331 768582306 771092529 771615753 771995468 771188812
1469.7G71188812J70822j943054n092163J37100L122559L859787j139755P09991J986771
$$ 771188812 771359634 769416580 764324417 764461517 767584076 771443863 770304108 771014099 773000870
1478.4G73000870M6005n4550j245346n42450p7667L03878N16510P29523j555252q54797
$$ 773000870 773046875 772992325 771746979 771204529 771126862 771430740 771947250 772676773 771121521 770266724
1488.1G70266724K528457k849960k155457K260590J847382K09198Q99429O13785m784928
$$ 770266724 772795181 769945221 767789764 770050354 771897736 772106934 773006363 773620148 768835220
1496.7G68835220K918320P74460p37229K072220K0066o54984k27661J314545J61361
$$ 768835220 771753540 772528000 771790771 773862991 773883057 773228073 773000412 774314957 774476318
1505.4G74476318p336273o985245M686661M360886J120758K585831l31192q92640J729432
$$ 774476318 767140045 760154800 764841461 769202347 770323105 772908936 772577744 771685104 773414536
1514.1G73414536n59083o12335k863464l402710M448090L145980n164489l064576K785645
$$ 773414536 772855453 772243118 769379654 765976944 770425034 773571014 768406525 765341949 768127594
1522.8G68127594L101501K039566l140258n68543N31998j026230Q61206J764374L01285
$$ 768127594 771229095 773268661 770128403 769559860 770091858 769065628 769926834 771691208 771992493
1531.5G71992493m07944k503357l239212L718719J522370O18744O01043p115554o957474
$$ 771992493 771584549 769081192 765841980 769560699 771083069 771701813 772302856 765187302 758229828
1540.1G58229828M397049L523483o97403L130951R32922j118469K097244j02386R1476
$$ 758229828 762626877 766150360 765452957 768583908 769516830 768398361 770495605 770393219 770484695
1548.8G70484695k368087j998291K165680J383514M95071m139328J064454M131698
$$ 770484695 768116608 766118317 768283997 769667511 770162582 766023254 767087708 771219406
1556.5G71219406K047653j5346374j2406540J0644455P300567L925095J004181L78876
$$ 771219406 773267059 757920685 745514145 756158600 763459167 767384262 768388443 768767319
1564.2G68767319j786270P13577J572418L48358n86242o587296K611771K119751j22605
$$ 768767319 766981049 767694626 769267044 769615402 769029160 762441864 765053635 767173386 767050781
1572.9G67050781k09198P65686N89066o895142L138047K298431N43594J6175r70154
$$ 767050781 766841583 767607269 768196335 761301193 764439240 766737671 767281265 767297440 766327286
1581.6G66327286n40695j006318L3799n29099O2866O11267n1651Q1940o14395j36871
$$ 766327286 765786591 764780273 764814072 764284973 764347839 764959106 764907455 764989395 764375000 764238129
1591.2G64238129r03473m84238j176300j255112M6082l52707L77350m66080k0218m12826
$$ 764238129 763334656 762850418 761674118 760419006 760465088 760112381 760489731 760023651 760003433 759590607
1600.9G59590607l62320l96195j340866q8272n57175n17425j255112j47934p98568
$$ 759590607 759228287 758832092 757491226 757402954 756845779 756328354 755073242 754925308 754126740
1609.6G54126740r24225J041488q00094m73023j029358N07737j390458q739166L668060
$$ 754126740 753202515 754244003 753443909 752970886 751941528 752449265 751058807 742319641 745987701
1618.2G45987701K042084L64151p43408L17459j522598l915253K254105J102295L12729
$$ 745987701 748029785 748393936 747650528 747967987 746445389 742530136 744784241 745886536 746199265
1626.9G46199265k927323j232986J647567K32010J40305k28577J065903J044159q580322
$$ 746199265 743271942 742038956 743686523 743918533 744058838 743830261 744896164 745940323 737360001
1635.6G37360001p46689K963943J322022K099838Q42514k79922R60083k59858J188813
$$ 737360001 736613312 739577255 740899277 742999115 743841629 743561707 744521790 744261932 745450745
1644.3G45450745Q55407m167099j849975k73133K615433K841416K656707J686707j3117218
$$ 745450745 746306152 742139053 740289078 740015945 742631378 745472794 748129501 749816208 736698990
1653G36698990p067566J1068420N879670K936706R22012N2414K823m66461L19595k284393
$$ 736698990 729631424 740699844 746579514 749516220 750438232 750490646 750493469 750027008 750346603 748062210
1662.6G48062210j617966L581925K167129Q79212R66339L07999m851075m30984J914749
$$ 748062210 746444244 750026169 752193298 753072510 754038849 754346848 749495773 749064789 750979538
1671.3G50979538n93567K161789K677765j886673l007202L747406K397003O01425j96380
$$ 750979538 750385971 752547760 755225525 753338852 750331650 754079056 756476059 757077484 756881104
1680G56881104k641297J838455K492371l963547j0886001M748535O357727K574386
$$ 756881104 754239807 756078262 758570633 754607086 743721085 748469620 754827347 757401733
1687.7G57401733L04184P18613j34659O64673O59714k19116J098709n99060j0406800
$$ 757401733 757705917 758424530 758289871 758954544 759614258 759395142 760493851 759894791 749487991
1696.4G49487991L196259M580917L366089l149948n310287O684646K860108o60248
$$ 749487991 752684250 757265167 760631256 757481308 752171021 758855667 761715775 761055527
1704.1G61055527k789917n45502o92749J007080L038712L08380l66364P46002Q06351
$$ 761055527 758265610 757720108 757027359 758034439 761073151 761381531 761015167 761761169 762567520
1712.8G62567520O04019k887115j991806J430664j134262o003189M339676L605270
$$ 762567520 763171539 760284424 758292618 759723282 758589020 752585831 756925507 760530777
1720.5G60530777J412277R16596l27530L80707R36660P5684j234512j014176K25525
$$ 760530777 761943054 762859650 762532120 762912827 763849487 763925171 762690659 761676483 761902008
1729.1G61902008k613373n93261K829360J464005m291534k747498M863815K432785
$$ 761902008 759288635 758695374 761524734 762988739 758697205 755949707 760813522 763246307
1736.9G63246307M8752P03736k445069l551712K826920J487579j928177n0049K047882
$$ 763246307 763295059 763998795 761553726 758002014 760828934 762316513 760388336 760338287 762386169
1745.5G62386169J204453n32455r62372j014786J872177k081146k759552K931366R29947
$$ 762386169 763590622 763058167 762095795 761081009 762953186 760872040 758112488 761043854 761973801
1754.2G61973801J078872J076203k044449M73938J164093O01272J67618l819809j641082
$$ 761973801 763052673 764128876 762084427 762558365 763722458 764323730 764491348 760671539 759030457
1762.9G59030457J889267Q16192L95432J378555N67474k184524M48303J490555k012329
$$ 759030457 760919724 761735916 762131348 763509903 764077377 761892853 762341156 763831711 761819382
1771.6G61819382l470002q73107K686309R70536j641083J822128J006012Q67233K59247
$$ 761819382 758349380 757476273 760162582 761133118 759492035 761314163 762320175 763187408 763446655
1780.3G63446655j864319J069642M97436l94745j800842r72214Q15964k85416M27780
$$ 763446655 761582336 762651978 763149414 762754669 760953827 759981613 760797577 760512161 760939941
1788.9G60939941J109085L02430m66919k003250l24173J712722o13250j580582J369705
$$ 760939941 762049026 762351456 761884537 759881287 759557114 761269836 760656586 759076004 760445709
1797.6G60445709J051636r58710j250305J447296M14810N3330J219940m86679k80075
$$ 760445709 761497345 760538635 759288330 760735626 761150436 761203766 762423706 761937027 761656952
1806.3G61656952r30100j192932L43933J17951o47583L41415J485901K64282P3166
$$ 761656952 760726852 759533920 759877853 759995804 759348221 759689636 761175537 761439819 761512985
1815G61512985o9656k43454r78851q66471L91693n86395L37296J26724Q19931J290512
$$ 761512985 761443329 761199875 760221024 759354553 759746246 759159851 759497147 759623871 760443802 761734314
1824.6G61734314k861481j03073J296463L65524k197952m293976J964417K467346P16858
$$ 761734314 758872833 758769760 760066223 760431747 758233795 753939819 755904236 758371582 759088440
1833.3G59088440J16425N38635M57916k37885j010055k84271j78604o61164n75485
$$ 759088440 759204865 759743500 760201416 759963531 758953476 758669205 758490601 757829437 757253952
1842G57253952N06668Q5068l937378J860275K388687m46548k36893P2251L07540p00912
$$ 757253952 757760620 757845688 753908310 755768585 758157272 757710724 757473831 757546082 757853622 757152710
1851.6G57152710m61426m79278k27585J025543J40915N48324J11008R4147n5695r37194
$$ 757152710 756691284 756212006 755984421 757009964 757150879 757699203 757810211 757904358 757848663 756911469
1861.3G56911469r14231q41217r2926l86505M19159P7362K83737J12229j331254J613389
$$ 756911469 755997238 755156021 755063095 754676590 755095749 755173111 755456848 755569077 754237823 755851212
1870.9G55851212N13076n79071p89642q11081k35062k12707N56412L07998P65763M48837
$$ 755851212 756364288 755785217 754995575 754184494 753949432 753736725 754293137 754601135 755366898 755815735
1880.6G55815735K19574k5253p98340r70459j190491j2283l40653O95954L72009r62525
$$ 755815735 756035309 756010056 755211716 754241257 753050766 753038483 752697830 753393784 753765793 752803268
1890.2G52803268J765976R42154l62396o29272j087342j366501k42309Q9340l15018
$$ 752803268 754569244 755511398 755149002 754519730 753432388 752065887 751823578 751912918 751597900
1898.9G51597900M66690M7684P63016Q98285N43365K35443q59069q82035j492767q27713
$$ 751597900 752064590 752112274 752875290 753773575 754316940 754552383 753693314 752811279 751318512 750490799
1908.5G50490799o28281n87616M92401J131440J189956P67212P23267L5553j1902l207092
$$ 750490799 749862518 749274902 749767303 750898743 752088699 752855911 753579178 753614731 753602829 750395737
1918.2G50395737k024842P27311m97284N79681m09012K65656K170715J165085j13831
$$ 750395737 748370895 749098206 748600922 749180603 748771591 749037247 751207962 752373047 752259216
1926.8G52259216o45065k32697j376647j533356n98221j49918k11105N64041J358490
$$ 752259216 751614151 751381454 750004807 748471451 747873230 747723312 747512207 748076248 749434738
1935.5G49434738P57294Q21762j86691j40915q76007j173706j404114k935105O61622
$$ 749434738 750192032 751013794 750827103 750686188 749810181 748636475 747232361 744297256 744958878
1944.2G44958878R52835R64279J301575O03408J122818J02005n79757j258698r82361
$$ 744958878 745911713 746875992 748177567 748780975 749903793 750005798 749426041 748167343 747184982
1952.9G47184982p07168q74558k94952J57089J103287J087494J004028Q8348j40533
$$ 747184982 746477814 745603256 745308304 745465393 746568680 747656174 748660202 748748550 748608017
1961.6G48608017m27780j062317p45087j367874q05435p68356L47366J374588J192779
$$ 748608017 748180237 747117920 746372833 745004959 744199524 743431168 743778534 745153122 746345901
1970.2G46345901J238175J51215j21842q34427j116333j081314q68454l37524j47553
$$ 746345901 747584076 747735291 747613449 746779022 745662689 744581375 743712921 743375397 743227844
1978.9G43227844P06330O02569J116867O31027n2108l23563r22623n62973j181411
$$ 743227844 743934174 744536743 745653610 746284637 746232529 745908966 744986343 744423370 743241959
1987.6G43241959j329117q16651R91822J199875j57242O46515N09796M64096k83814
$$ 743241959 741912842 741096191 742088013 743287888 743130646 743777161 744286957 744751053 744467239
1996.3G44467239r23462j244812j071853j79367j73645M45633L56445N25665N83039
$$ 744467239 743543777 742298965 741227112 741047745 740874100 741319733 741676178 742201843 742784882
2005G42784882L36380j00632p56760o91452j063156o67572p00989M654M52805L62320
$$ 742784882 743121262 743020630 742263870 741572418 740509262 739841690 739140701 739145355 739598160 739960480
2014.6G39960480J031570J26572j15280l30658o01807p21054n66864n71136q49457
$$ 739960480 740992050 741118622 741003342 740672684 740070877 739349823 738782959 738211823 737362366
2023.3G37362366M10232M77982P24563M79813j59607j08414m35485k00882o29120o17676
$$ 737362366 737772598 738250580 738975143 739454956 739295349 739186935 738751450 738550568 737921448 737303772
2032.9G37303772r19724m33654L06701J53275O62308L12042L07541j66321n39856o11191
$$ 737303772 736384048 735950394 736257095 736410370 737072678 737384720 737692261 737525940 736986084 736374893
2042.6G36374893p48672m81034l60870K84424L21121O32019M43573K93961j49155p91931
$$ 736374893 735626221 735145187 734784317 735068741 735389862 736021881 736465454 736759415 736610260 735818329
2052.2G35818329l48129o03104k73895o12336j28326J81427j76773O71844K46659K12250
$$ 735818329 735470200 734867096 734593201 733980865 733852539 734033966 733857193 734529037 734775696 734987946
2061.9G34987946j56174k26898p39518q79058J92184k80609M0207K11944P40815N35202
$$ 734987946 734831772 734604874 733865356 732986298 733178482 732897873 732938080 733150024 733890839 734426041
2071.5G34426041L9596q7204o32248o8969o59638n55420m65851l44009r7046J65634
$$ 734426041 734465637 734378433 733746185 733677216 733017578 732462158 731996307 731652298 731555252 731720886
2081.1G31720886J030655M2114K23618k36511l88871l15475j164169j58921k29721
$$ 731720886 732751541 732793655 733017273 732780762 732391891 732076416 730912247 730753326 730523605
2089.8G30523605n3634L06701P12738N07050j01776L891o22025j82647l30429o62995
$$ 730523605 730469971 730776672 731489410 731996460 731894684 731898575 731276550 731093903 730763474 730100479
2099.5G30100479n42297Q2626J57776o1874R10110M55170M44565k82593p12891o28738
$$ 730100479 729558182 729640808 729798584 729736710 730646820 731101990 731546555 731263962 730551071 729922333
2109.1G29922333q53882l6011o92901j94474K93808L48740N69839M56086N41305n55496
$$ 729922333 729068451 729032440 728339539 728145065 728438873 728787613 729357452 729813538 730354843 729799347
2118.7G29799347o36292p81936o31562l46298j31988K03705j08643O19888N28565M31900
$$ 729799347 729163055 728381119 727749557 727403259 727271271 727474976 727366333 727986221 728514786 728946686
2128.4G28946686J51062k14234n80215r95255l68347k25219k4567n38788K03095P17086
$$ 728946686 729097748 728883514 728303299 727308044 726939697 726714478 726689911 726151123 726354218 727071304
2138G27071304K20871L68347l585K63443q43201j036606p07245n56869J53808J70822
$$ 727071304 727292175 727660522 727656937 727920380 727077179 726040573 725333328 724776459 724930267 725101089
2147.7G25101089R43528J21612J22376L75366J35269k4261j304932q49380n35050l07465
$$ 725101089 726044617 726166229 726288605 726663971 726799240 726774979 725470047 724620667 724085617 723778152
2157.3G23778152k29415J00631O77185Q99887R59168l82385p0649j08947p06330p46307
$$ 723778152 723548737 723649368 724326553 725226440 726185608 725803223 725732574 725623627 724917297 724170990
2167G24170990o30951j08566l38211L70865Q40225P86438l510j03531p7362r44976
$$ 724170990 723540039 723431473 723093262 723464127 724304352 725090790 725087280 724983749 724906387 723961411
2176.6G23961411n64728o35834L9368K3498j23825J94016P5378P92313K71759J70288
$$ 723961411 723396683 722760849 722800217 722823715 722699890 722893906 722969284 723761597 724033356 724203644
2186.3G24203644j20545n07888p34406p29904J2894q4839K49176J27182M88434M72412
$$ 724203644 724083099 723575211 722840805 722110901 722123795 722038956 722288132 722415314 722903748 723376160
2195.9G23376160K50549O6452o36978k58713o26755m03976p75299k33154P95822K33841
$$ 723376160 723626709 723693161 723056183 722797470 722170715 721766739 720991440 720758286 721554108 721787949
2205.5G21787949O50558J84708J08490l46299l02810j03760p32574l31040o53457K11639
$$ 721787949 722438507 722623215 722731705 722385406 722082596 721978836 721246262 720915222 720261765 720473404
2215.2G20473404N71670M43650L38211k22550p9116k59476J21384l88947p23877q46405
$$ 720473404 721045074 721488724 721826935 721604385 721525269 721265793 721387177 720998230 720274353 719427948
2224.8G19427948l47977M81873K05536P26013O00815J82342p58362n00946K14768l60718
$$ 719427948 719079971 719561844 719767380 720493393 721094208 721276550 720518188 720017242 720232010 719871292
2234.5G19871292n42984p44629K40936L20664J20087k3346J01699O12107j32752j5106
$$ 719871292 719328308 718583679 718824615 719145279 719265366 719242020 719343719 719955826 719823074 719807968
2244.1G19807968p26089o42853k57950l82843J39160M6921L10821j373K55051L81j80053
$$ 719807968 719081879 718439026 718181076 717798233 717937393 717984314 718295135 718293762 718548813 718549194 718369141
2254.7G18369141k76642q75702l37753l48206K56042J43815L07083N72128L3035k31628
$$ 718369141 718092499 717216797 716879044 716530838 716786880 716930695 717237778 717809906 717842941 717611313
2264.4G17611313r49249p3624P6l54156o43235l50646N27343J18714N06897K58712
$$ 717611313 716662064 716588440 716588516 716234360 715591125 715240479 715767822 715886536 716393433 716652145
2274G16652145N1880j15204N3711m08706j253510j91040r3613J59913J60217L46527
$$ 716652145 716704025 716588821 716642532 716233826 714980316 714789276 714695663 714855576 715015793 715362320
2283.7G15362320K14157k19269K09122m39911m47311o40488j63422l37066n50766J01928
$$ 715362320 715576477 715357208 715566330 715126419 714679108 714038620 713875198 713538132 712987366 713089294
2293.3G13089294j14822K53143j03759L56521k76413k05688j64871j807938p04193
$$ 713089294 712974472 713227615 713123856 713480377 713203964 712998276 712833405 711025467 710321274
2302G10321274m32129L8528M6692L50647K38266n15518M24423m47616k64435j254273
$$ 710321274 709889145 709927673 709974365 710325012 710563278 710047760 710472183 710024567 709760132 708505859
2311.6G08505859j078872m19846l40423O82220p40585n0125q66929j81198L37448l18450
$$ 708505859 707426987 707007141 706666718 707348938 706608353 706558228 705691299 705510101 705847549 705529099
2321.3G05529099Q6898k715377j557923p48062J072311K39869p24793R11484j102142
$$ 705529099 705615997 702900620 701342697 700594635 701666946 701906815 701182022 702093506 700991364
2329.9G00991364l26539j271057M35486Q5678j20315M34265k587052J88141Q42667
$$ 700991364 700664825 699393768 699829254 699914932 699794617 700228882 697641830 697829971 698672638
2338.6F98672638N00717j013183K76641N28412n69076P1487k090607J391526M05426
$$ 698672638 699173355 698160172 698436813 698965225 698396149 698467636 696377029 697768555 698173981
2347.3F98173981J216049K032394l83835l71933j395339l98179j806030j514816J5869
$$ 698173981 699390030 701422424 701038589 700666656 699271317 698873138 697067108 695552292 695568161
2356F95568161j378632j645279m131317O6986R53904J957245J179428k98691K36969
$$ 695568161 694189529 692544250 688412933 688479919 689433823 691391068 692570496 692271805 692508774
2364.7F92508774q07343J316071J19858R94339J42135P553L08228P23114J940765K594
$$ 692508774 691701431 693017502 693137360 694131699 694273834 694281387 694589615 695312729 697253494 697256088
2374.3F97256088J400910J204605N77621J08567j21003O65589O3781P92389L84140
$$ 697256088 698656998 699861603 700439224 700547791 700426788 701092377 701156158 701948547 702332687
2383G02332687N15747O03486M52804O92749l31268l78800l87954r919n25589m72717
$$ 702332687 702848434 703451920 703904724 704597473 704266205 703887405 703499451 703489532 702963943 702491226
2392.6G02491226O2103j29547N06745K19879M22821k91519m25034N6458l82538n18189
$$ 702491226 702553329 702423782 702930527 703150406 703573227 703281708 702856674 702913132 702530594 702012405
2402.3G02012405q12606J05896n8747j66626O0196K41547L07007k08893J68533o63223
$$ 702012405 701199799 701305695 701246948 701080322 701140518 701382065 701689072 701480179 701648712 700985489
2411.9G00985489n50766n00259k59781M68444j96151p1945j94397L30734O6604m06494
$$ 700985489 700434723 699934464 699674683 700143127 699946976 699875031 699680634 700011368 700077972 699671478
2421.6F99671478n5771l24783m34799l82919j48392n65415J90812J20086k03018L58048
$$ 699671478 699615707 699290924 698856125 698473206 698324814 697759399 697950211 698070297 697867279 698225327
2431.2F98225327l5706p0038n99823j03760l63235m10690Q3770l74527L95813J55259
$$ 698225327 698189621 698119583 697519760 697416000 697052765 696642075 696725845 696351318 696747131 696902390
2440.8F96902390M7149l39889j32904K15072o15997m75388n33142p1640k57492k0447
$$ 696902390 696949539 696609650 696476746 696691818 696075821 695600433 695067291 694995651 694738159 694717712
2450.5F94717712K60239P9422L03726k66113o0501m06037o22558q05817m82940J44043
$$ 694717712 694977951 695057373 695361099 695094986 695034485 694628448 694005890 693200073 692717133 692861176
2460.1F92861176L7994L80936K1057M13360J13678j26724j71585n60684l86811j061248
$$ 692861176 692899170 693280106 693301163 693714523 693828201 693701477 693529892 692969208 692582397 691521149
2469.8F91521149m66462r6893M64707N94329R6741K27432j30004K76184l69950n28717
$$ 691521149 691054687 690957794 691422501 692016830 692113571 692341003 692210999 692487183 692117233 691588516
2479.4F91588516o61011o75277k91519m80118N76324N35584M89578J33514L3799l45383
$$ 691588516 690927505 690252228 689960709 689480591 690056915 690592499 691082077 691215591 691249390 690904007
2489.1F90904007j004715l42178j033936n21240k62528Q40P52334N00183N33142J45035
$$ 690904007 689899292 689557114 688523178 688001938 687739410 687740250 688492584 688992767 689525909 689670944
2498.7F89670944J27793n45273j71967p29675j305542L9825j34887L10974L43780M50211
$$ 689670944 689798737 689253464 689081497 688351822 687046280 687086105 686951218 687262192 687605972 688056183
2508.3F88056183K77405k14463j48544o39572n74951p95670l31192m18472j44730L65830
$$ 688056183 688333588 688119125 687970581 687331009 686756058 685960388 685629196 685210724 685065994 685431824
2518F85431824L22113P52411J98898J34430l86582l37829o40793r79462l61023m41665
$$ 685431824 685753937 686506348 686705246 686839676 686453094 686115265 685474472 684495010 684133987 683692322
2527.6F83692322M56009L16620N05371K98919k02713J19171m52804n66483r17892m58298
$$ 683692322 684148331 684464951 684970322 685269241 685066528 685185699 684732895 684166412 683248520 682790222
2537.3F82790222n06973j85623K56576K13623P80106m1962K49329l204p11670r56269
$$ 682790222 682283249 682097626 682354202 682567825 683347931 683305969 683555298 683552094 682840424 681884155
2546.9F81884155m58984J87302m67530J53351n0735M78363N31158J15509J09100j148147
$$ 681884155 681425171 681612473 681144943 681298294 681247559 681725922 682257080 682372589 682481689 681333542
2556.6F81333542m91638l15934j48620n35126n82046L79715K92053N84335l52249j29318
$$ 681333542 680841904 680525970 680377350 679842224 679260178 679639893 679931946 680516281 680164032 680034714
2566.2F80034714L50799Q2779p32803r72595m6692o04401J56174K26135K63138K87476
$$ 680034714 680385513 680468292 679735489 678762894 678716202 678111801 678267975 678494110 678757248 679044724
2575.9F79044724j41831L56293l22647j52741m67376m63868n86548n91888J80206Q8425
$$ 679044724 678902893 679259186 678936539 678783798 678316422 677852554 677266006 676674118 676854324 676942749
2585.5F76942749N01633n8060J00861j80130j32218j66702j071777k38572o46057p6370
$$ 676942749 677444382 677386322 677487183 677307053 677174835 677008133 675936356 675697784 675051727 674975357
2595.1F74975357L70941L34244L22037N5160P11594m15573o47888o94962o48499l57284
$$ 674975357 675346298 675680542 676002579 676057739 676769333 676353760 675705872 675010910 674362411 674005127
2604.8F74005127l86505L97186L76206L61328K8991K36969j46713l63922l74756r41391
$$ 674005127 673618622 674015808 674392014 674753342 674782333 675019302 674872589 674508667 674133911 673192520
2614.4F73192520l35312m85534p0191m9820K02103M23431m9438O5841k54821R7198
$$ 673192520 672857208 672371674 672301483 672251663 672453766 672877197 672827759 672893600 672638779 672735977
2624.1F72735977j038971j008987L2043K57950L2044n48783P95441N18265L52783k49176
$$ 672735977 671697006 670688019 670720062 670978012 671010056 670461273 671256714 671774979 672127762 671878586
2633.7F71878586p59964j30997o42013j7853o54526k70843m2801n00718N52292N88150
$$ 671878586 671118622 670987625 670345612 670327759 669673233 669402390 669359589 668858871 669411163 669999313
2643.4F69999313K94876o77795m05045n06439p84836l10440k90298J72424K11945O44455
$$ 669999313 670294189 669616394 669211349 668704910 667920074 667609634 667319336 667491760 667703705 668348160
2653F68348160q1101k38342Q5526j43357l64074p96280j31684n62515l31879K7314
$$ 668348160 668267059 668028717 668114243 667970886 667606812 666810532 666678848 666116333 665784454 665811768
2662.6F65811768L38134M65699J5945L74680n83802k59857o24161j028061k06451j94321
$$ 665811768 666149902 666615601 666631546 667006226 666422424 666162567 665538406 664510345 664303894 664109573
2672.3F64109573K55432L1815K87552j5488K65427M13895m30985o97555p44782K3804
$$ 664109573 664365005 664396820 664684372 664668884 664934311 665348206 664917221 664219666 663474884 663498688
2681.9F63498688m37088n493o2714k62451L84140J24512M87289j68839k8076o38580
$$ 663498688 663061600 663056107 662993393 662730942 663115082 663239594 663726883 663558044 663529968 662891388
2691.6F62891388r08279l66898n34973K29645j04218O56738O37436L78113k6093r03244
$$ 662891388 661983109 661616211 661081238 661310883 661206665 661863403 662500839 662878952 662852859 661949615
2701.2F61949615k26440p67441n70755q45108m52728L23639J91727M99877K51618O08063
$$ 661949615 661723175 660955734 660384979 659539871 659087143 659410782 659602509 660102386 660354004 660962067
2710.9F60962067l55912k42233j61590o49338k42920o60782r1782k95486m2496L48435
$$ 660962067 660606155 660363922 660202332 659552994 659310074 658649292 658557510 658262024 658219528 658567963
2720.5F58567963O13021M45862j54953j9226j190719q73795q89358m65851M86679J54495
$$ 658567963 659180984 659626846 659471893 659452667 658261948 657388153 656498795 656032944 656519623 656674118
2730.2F56674118O16531L78495M90570j04294l13110l81470o76651l81546r92432m35180
$$ 656674118 657290649 657669144 658159714 658055420 657742310 657360840 656684189 656302643 655310211 654875031
2739.8F54875031j8616N30929N73349K11029L21122P8964o7444p20139l79104p32346
$$ 654875031 654856415 655387344 655960693 656171722 656492844 656571808 656504364 655784225 655405121 654672775
2749.4F54672775o01654j21994m24881O8436M39834P92084r7885J9989K2049m08478
$$ 654672775 654071121 653949127 653524246 653592682 654032516 654824600 654726715 654746704 654768753 654360275
2759.1F54360275n17120j040802l53699o11343K15149P24945M35409K29798j62888
$$ 654360275 653843155 652802353 652448654 651837311 652052460 652777405 653212814 653442612 653279724
2767.8F53279724M08020n60379o24466p22198l92533N0965k97699M07181m4632K84805
$$ 653279724 653687744 653127365 652502899 651780701 651388168 651439133 651141434 651548615 651503983 651788788
2777.4F51788788J31607J15890j79443r61380n75714q72116n9204l15399k83127N77621
$$ 651788788 651920395 652036285 651856842 650895462 650319748 649447632 649388428 649073029 648789902 649367523
2787F49367523P16095O53382J92489J36871o87027m38766q07114p59735j64413k71225
$$ 649367523 650083618 650737000 650929489 651066360 650379333 649940567 649133453 648373718 648209305 647938080
2796.7F47938080M61960j32675N12466N00259k33459k93427m16031r15q18939r42307
$$ 647938080 648400040 648267365 648779831 649280090 649046631 648753204 648337173 648336258 647517319 646575012
2806.3F46575012q76388P400N65033M52881M70505j79825K51160j68534k02942p78579
$$ 646575012 645698624 645706024 646271057 646723938 647194443 647014618 647265778 647097244 646894302 646115723
2816F46115723r50470k37427n84412K12632L55682K76565j39083K7694N8594l14102
$$ 646115723 645165253 644927826 644343414 644556046 644911728 645188293 645049210 645076904 645135498 644821396
2825.6F44821396j2360o57425n50079q38623j66092j33896k11487Q83484L79257K07444
$$ 644821396 644809036 644151611 643601532 642762909 642596817 642462921 642251434 643134918 643514175 643721619
2835.3F43721619n78156j72729o63681j036835j69983p71790Q7662O104K60009K59095
$$ 643721619 643143463 642970734 642307053 641270218 641100235 640328445 640416107 640422211 640682220 640941315
2844.9F40941315J07803J04752p62787m88281j447220r63860m02985l03688l7498J02653
$$ 640941315 641049118 641153870 640391083 639902802 638455582 637491722 637088737 636785049 636747551 636850204
2854.6F36850204P09000N4131N59730J81885J88560k6130p07093o70204j101532J52016
$$ 636850204 637559204 637613335 638173065 638354950 638543510 638517380 637810287 637140083 636038551 636190567
2864.2F36190567K48489O17485M06380l1051J21688n63163l5973p46689o01387n01556
$$ 636190567 636439056 637056541 637462921 637431870 637553558 636990395 636954422 636207733 635606346 635104790
2873.8F35104790k88391j1826l29170P86972M68407L58963n37835q58879j32827j51978
$$ 635104790 634816399 634804573 634475403 635262375 635730782 636089745 635551910 634693031 634560204 634408226
2883.5F34408226l69987j079064k87743k18658J28365n684J79443R37157k01340j87035
$$ 634408226 634038239 632959175 632671432 632452774 632581139 632575455 632754898 633692055 633490715 633303680
2893.1F33303680l94210j49269o69137r32693k38075k92092L76969J07994L40385p0686
$$ 633303680 632909470 632760201 632091064 631158371 630920296 630628204 631005173 631113167 631453552 631382866
2902.8F31382866j28746k54860o06804k13890q51173m7837k69165j05095K7886k46811
$$ 631382866 631254120 630999260 630392456 630178566 629327393 629279556 629010391 628905296 628933182 628686371
2912.4F28686371o9389o43197K26975m27971n36690r06105r21058j70403m79889O29082
$$ 628686371 628616982 627973785 628200760 627772789 627236099 626329994 625408936 625238533 624758644 625387726
2922.1F25387726j79177k15415J88560O10275N65033j94816M25033n87768r90639r35097
$$ 625387726 625208549 624993134 625181694 625791969 626357002 626162186 626587219 625999451 625008812 624073715
2931.7F24073715N27001O67114J48048Q01277l81546P5798m42771m11759O9771P2060
$$ 624073715 624600716 625267830 625415878 626217155 625835609 625911407 625468636 625056877 625126648 625198708
2941.3F25198708O16798k77557J20926L01513K39105k06489J85852O1302r54895J65558
$$ 625198708 625815506 625537949 625658875 625960388 626199493 625993004 626178856 626240158 625285263 625450821
2951F25450821l58086q73756n00069L32642J62353Q0796N95016l58429K11029p9651
$$ 625450821 625092735 624218979 623718910 624051552 624213905 624294701 624889717 624531288 624742317 624662666
2960.6F24662666j945l16277m03862L01934p35474j07422K75917O11687K19803K1858
$$ 624662666 624660721 624344444 623940582 624242516 623507042 623399620 623675537 624287224 624507027 624528885
2970.3F24528885J81274n10215m35067q24318K07673j65024k70996M55093L42255R05990
$$ 624528885 624710159 624199944 623764877 622940559 623148232 622983208 622712212 623167305 623509560 624415550
2979.9F24415550j15967q8081k36816m97780m22287k62299L72010O0691N2452o27441
$$ 624415550 624299583 624211502 623974686 623476906 623054619 622792320 623164330 623225021 623277473 622650032
2989.6F22650032L47519Q90846O2905n84069q96377J5335l20320q7700n59311l49121
$$ 622650032 622997551 623888397 623951302 623367233 622470856 622486191 622165871 622078171 621518860 621169739
2999.2F21169739L84636J46560M00963l88489k0752j07536Q1330m32663q73909M07981
$$ 621169739 621554375 621700935 622101898 621713409 621692657 621585121 621666451 621233788 620359879 620767860
3008.8F20767860j23252J51519K19384J22070k74582j94397J04332o31332k15340n26276
$$ 620767860 620644608 620796127 621015511 621137581 620862999 620668602 620772934 620141602 619926262 619399986
3018.5F19399986l06473p59010L9864P09762m66766R5596j22451M70962o6490p10488
$$ 619399986 619093513 618334503 618374367 619084129 618617363 618712959 618590508 619061470 618994980 618284492
3028.1F18284492n11207n64652j20391o30951M47540M52461N14450J87111n46036j12915
$$ 618284492 617773285 617208633 617088242 616457291 616904831 617357292 617871742 618058853 617512817 617399902
3037.8F17399902p22656j88675l13034j42174k28920k10571K16103k78054J05324k24113
$$ 617399902 616677246 616488571 616175537 616033363 615804443 615593872 615809975 615531921 615637245 615413132
3047.4F15413132J92451l83682n48172k58102o43006m13055p14493O58607L59192p4997
$$ 615413132 615605583 615221901 614673729 614415627 613772621 613359566 612645073 613303680 613662872 613587875
3057.1F13587875n2604J449L14751q27293j93520l07922n6267o03981o79245K45323
$$ 613587875 613535271 613536720 613851471 613024178 612830658 612522736 612466469 611862488 611183243 611428566
3066.7F11428566n43633L10212L76243Q01773k74276r06258j83830o95916J92986m99763
$$ 611428566 610884933 611195145 611571388 612373161 612098885 611192627 611008797 610312881 610505867 610006104
3076.4F10006104k49291O8092J7739P5416j11999L00979n94139l14598j235351o43769
$$ 610006104 609756813 609824905 609842644 609918060 609806061 610107040 609512901 609198303 607962952 607319183
3086F07319183K96288l83225K62299K41280M84008k73513L0288k82402j89590K46315
$$ 607319183 607615471 607232246 607494545 607735825 608219833 607946320 607976608 607694206 607504616 607750931
3095.6F07750931j125450j22795m64135j11503j61476m90380K27204k85683L46069
$$ 607750931 606625481 606502686 606038551 605927048 605765572 605275192 605502396 605216713 605562782
3104.3F05562782l34892p5836k70119p81441l96728l72048N02587k8038R7427J00823
$$ 605562782 605227890 605152054 604881935 604100494 603703766 603331718 603834305 603806267 603903694 604004517
3114F04004517L42636q8921o98738j00975q72955o12450o53114r2163J37138k70615
$$ 604004517 604347153 604258232 603559494 603458519 602585564 601973114 601320000 601227837 601364975 601094360
3123.6F01094360L9444m4479K21214k95868L8796m47235p10259o21681l77960O14700
$$ 601094360 601133804 601089325 601310539 601014671 601053467 600606232 599895973 599274292 598896332 599511032
3133.3E99511032n18989j79062L64608L15133l62282n27458J04484q03413n82199m23661
$$ 599511032 598992043 598812981 599177589 599492722 599130440 598602982 598707466 597904053 597321854 596898193
3142.9E96898193q1710m95186j12000O17714K3041N16815j55983p61261j401405k42577
$$ 596898193 596816483 596321297 596209297 596827011 596850052 597366867 597210884 596449623 595048218 594805641
3152.5E94805641J91727p89147n0201k60887P34825K64664l07885j79443r4452J87073
$$ 594805641 594997368 594208221 594158020 593897133 594631958 594896622 594588737 594409294 594314842 594501915
3162.2E94501915r45625j82724p46804p77359j50451L3149M54407k43225K31476m70924
$$ 594501915 593556290 593373566 592626762 591849403 591698952 591732101 592186508 591943283 592174759 591703835
3171.8E91703835k57569m68941r96666n17044l79943N35011k38419K31819K79808l18908
$$ 591703835 591446266 590977325 589980659 589463615 589083672 589618683 589380264 589612083 589891891 589572983
3181.5E89572983l27530l69644m9897j178283j040383n72242M26635M3450m29192P67861
$$ 589572983 589245453 588875809 588825912 587647629 586607246 586035004 586461639 586505089 586075897 586843758
3191.1E86843758K63824j96495j136055n11856j70174l48396j64528k69165L05748
$$ 586843758 587107582 586911087 585775032 585263176 585093002 584744606 584580078 584310913 584616661
3199.8E84616661q11272k33078p8010k64855R8114l53927o78215r94339N51948l40538
$$ 584616661 583805389 583572311 583494301 583229446 583327560 582973633 582295418 581301079 581853027 581512489
3209.4E81512489m93087Q1024k86942O54526j05743o8741l75977l46374m76647p03964
$$ 581512489 581019402 581100426 580813484 581468010 581362267 581293526 580917549 580571175 580094528 579390564
3219.1E79390564n91087j298104m17556k50016O35643M29116j47171P8468k38190J06812
$$ 579390564 578799477 577501373 577083817 576833801 577469444 577898560 577751389 577829857 577591667 577698479
3228.7E77698479r04312p96891o06231l07808n23949j69907J021614o9084J00289l17459
$$ 577698479 576794167 575997276 575391045 575083237 574559288 574389381 575410995 575341911 575442200 575124741
3238.4E75124741l09945n84716q48885j96915l75595K00768p69730q4686J70364K65656
$$ 575124741 574814796 574230080 573381195 573184280 572808685 573009453 572239723 572155037 572325401 572591057
3248E72591057M97093r62486j87378l32146n82008r94797l89786Q6098m50401M24728
$$ 572591057 573088150 572125664 571938286 571606140 571024132 570029335 569639549 569725647 569275246 569699974
3257.7E69699974J60217M24500n58548p01943m11644j07231O00968q26226n88455q54835
$$ 569699974 569860191 570284691 569726143 569024200 568612556 568505325 569106293 568280067 567691612 566836777
3267.3E66836777J0643N78308j90811l05977m73442M68597q62312n27764R8954p93190
$$ 566836777 566847420 567425728 567234917 566928940 566455498 566924095 566061783 565534019 565632973 564839783
3276.9E64839783n97611k77176J01395k24190N94368K58637K60086j40610j062546
$$ 564839783 564242172 563964996 564066391 563842201 564436569 564695206 564955292 564814682 563752136
3285.6E63752136r59053j110267K74124m18053k29225R8801j55983Q10432J97296m01687
$$ 563752136 562793083 561682816 561956940 561538887 561309662 561408463 561252480 562062912 562260208 561858521
3295.3E61858521j244355k82440o59180m36248M84695q00858j91383k08282K82707
$$ 561858521 560614166 560331726 559672546 559236298 559720993 558920135 558728752 558520470 558803177
3303.9E58803177l81203p79877K80800k1705q48351j486702M9744o3439k3841k3652
$$ 558803177 558421974 557642097 557922897 557901192 557052841 555566139 555615883 555552444 555528603 555504951
3313.6E55504951j22985O5536q33244J05095m68712l60260p96814p75452J09864n46761
$$ 555504951 555381966 555447502 554614258 554719353 554250641 553890381 553093567 552318115 552427979 551881218
3323.2E51881218M81300l11584j89743j17684n5427m7722j264076n45960r51690l08648
$$ 551881218 552362518 552050934 551861191 551743507 551688080 551640358 550376282 549830322 548878632 548569984
3332.9E48569984o11038m82063K71530m71268J77765j71318j14021k84576K41737n71213
$$ 548569984 547958946 547476883 547748413 547277145 547454910 547283592 547169571 546884995 547126732 546555519
3342.5E46555519j813812p14874l02887K97660l16238j32561k25448n33829n33943
$$ 546555519 544741707 544026833 543723946 544021606 543705368 543572807 543347359 542813530 542279587
3351.2E42279587p84035j92947n03846R8801j163711p01943N00908l63235M6844n73807
$$ 542279587 541495552 541302605 540798759 540897560 539733849 539031906 539532814 539169579 539216423 538642616
3360.8E38642616l55148r00993k31896L23639o46858r13391j183243M31595r4605k67601
$$ 538642616 538287468 537386475 537154579 537478218 536831360 535917969 534734726 535166321 535071716 534804115
3370.5E34804115m69131q17833K67715j81160l09524p13120l57017r48487o13098j42250
$$ 534804115 534334984 533517151 533784866 533603706 533294182 532581062 532224045 531275558 530662460 530520210
3380.1E30520210q06198L80974K98004L10631m01154o71920j241188j152039L34549
$$ 530520210 529714012 530094986 530392990 530703621 530302467 529630547 528389359 527237320 527571869
3388.8E27571869m11987P6332j71128o01997m63982O7749k1019o43997j46370j359710
$$ 527571869 527159882 527236214 527065086 526463089 525999107 526066856 526045837 525401840 525255470 523895760
3398.4E23895760o04401l27988L33176O70242q17375j30005j70326J99776o12641n53016
$$ 523895760 523291359 522963371 523296547 523966789 523149414 523019409 522849083 523048859 522436218 521883202
3408.1E21883202k29493k07100J75553j089668j57319n76095J96876M69704o92024
$$ 521883202 521653709 521446609 521622162 520532494 520375175 519799080 519995956 520465660 519773636
3416.8E19773636k06604l18108M36516j209640q14324J44539k27356j83563m83284
$$ 519773636 519567032 519248924 519685440 518475800 517661476 517806015 517578659 517395096 516911812
3425.5E16911812R55353L0326l03955R3689J25046q67653j383629M1428k59132L92875
$$ 516911812 517867165 517897491 517593536 517687225 517812271 516944618 515560989 515602417 515343285 515736160
3435.1E15736160k74772j73874l82118l46718P07206j80587N38711j340408p87201
$$ 515736160 515461388 515287514 514905396 514558678 515265884 515085297 515624008 514283600 513496399
3443.8E13496399L19137N10026J245956j863136l70522O54297K95868L31345J13639
$$ 513496399 513815536 514325562 515571518 513708382 513337860 513992157 514288025 514619370 514733009
3452.5E14733009J48850n57976k09923r17778p8621l13453k64168Q98666M57459L50609
$$ 514733009 514881859 514323883 514113960 513196182 513117561 512804108 512539940 513438606 513896065 514246674
3462.1E14246674p16439M03557O49490J3199q62350q93212P74422K32659J2931k62069
$$ 514246674 513530235 513933792 514583282 514596481 513734131 512840919 513615341 513848000 513860931 513598862
3471.7E13598862J005935P70493o90193o18286p29180k09427n98068J46408j16730
$$ 513598862 514604797 515375290 514685097 514066811 513337631 513128204 512530136 512676544 512559814
3480.4E12559814M62075K35138p51458J349946N05332J94092M5700j65214n58357l40538
$$ 512559814 513021889 513257027 512505569 513855515 514360847 514554939 514600639 514435425 513877068 513536530
3490.1E13536530Q59565l41644L36647L44429P79305L72276r65080l7079k11067J63726
$$ 513536530 514396095 514054451 514391098 514735527 515514832 515887108 514922028 514884949 514673882 514837608
3499.7E14837608k13127O75469M75349r18198p50198j74713J174011Q65746J496582
$$ 514837608 514624481 515299950 515775299 514857101 514106903 513932190 515106201 515971947 517468529
3508.4E17468529q60214j751671P92694k899J40533J88866M52423J98974P53785Q63380
$$ 517468529 516608315 514856644 515649338 515646439 515786972 515975838 516428261 516627235 517381020 518244400
3518E18244400l84674r20868q22830J288338O04476p09266p06749l0174L63807k86979
$$ 518244400 517859726 516938858 516116028 517404366 518008842 517299576 516592827 516562653 516926460 516639481
3527.7E16639481P61032Q8195J060906L52745k68936M83551m67644O61659o90689r22699
$$ 516639481 517400513 517488708 518549614 518902359 518633423 519116974 518649330 519310989 518620300 517697601
3537.3E17697601O00624L52402K34566K74200O19316k5749Q59604n00183p78122O57692
$$ 517697601 518298225 518650627 518885193 519159393 519778709 519752960 520612564 520112381 519334259 519991951
3547E19991951j384850R9106R70688J729469J505661k069931p60879Q81843N23530
$$ 519991951 518607101 518706207 519676895 521406364 522912025 520842094 520081215 520963058 521486588
3555.6E21486588M19731p11975p2899J107673K25907l50533P76863K69623l55835K710152
$$ 521486588 521906319 521194344 521121445 522229118 522455025 522104492 522881355 523150978 522795143 525505295
3565.3E25505295l68462l346939o46248j925544K677879J395912Q3885J578903j32141
$$ 525505295 525136833 521789894 521143646 519218102 521895981 523291893 523375778 524954681 524822540
3574E24822540j83944l77884P17544K4796J158676O63795j993217O75888O21910N64117
$$ 524822540 524638596 524260712 524978256 525003052 526161728 526825523 524832306 525508194 526130104 526694221
3583.6E26694221j69944L276520J701126n337105O98776k875061K007256K504043N85518
$$ 526694221 526524277 529800797 531501923 526164818 526863594 523988533 525995789 528499832 529085350
3592.3E29085350Q6975k080002K487984j783867J232453K081336j992683J170082j561470
$$ 529085350 529172325 527092323 529580307 527796440 529028893 531110229 529117546 530287628 528726158
3601E28726158k74162Q66852O34384M33960J707382J650276k987671K556801k557373
$$ 528726158 528451996 529318848 529953232 530387192 532094574 533744850 530757179 533313980 530756607
3609.6E30756607k110977O716919J74103n517121J627426j105232J218987M061737
$$ 530756607 528645630 535362549 535536652 530019531 531646957 530541725 531760712 535822449
3617.4E35822449r41048K53601k478332j836853J716156Q57620J409721J01242M70887
$$ 535822449 534881401 535135002 532656670 530819817 532535973 533393593 534803314 534904556 535375443
3626E35375443J004600N033493l41492j5228042K783203L637047N428238R82971m149590
$$ 535375443 536380043 541413536 541072044 525844002 528627205 532264252 537692490 538675461 534525871
3634.7E34525871J57280J183968J399803j185188N55839J322785J098976m88777j425515
$$ 534525871 534683151 535867119 537266922 536081734 536637573 537960358 539059334 538570557 537145042
3643.4E37145042J562462J559716L930778k695122m715461L441886j826896l970452
$$ 537145042 538707504 540267220 544197998 541502876 536787415 540229301 538402405 534431953
3651.1E34431953k966728M149513K851181L032837L828392q470954p38373L052139
$$ 534431953 531465225 535614738 538465919 541498756 545327148 536856194 536117821 539169960
3658.8E39169960K90642K25868K06909L93677K79388O24886L50761n58471J498947
$$ 539169960 539460602 539686470 539893379 540287056 540566444 541191330 541542091 540983620 542482567
3667.5E42482567J700172j392479J133652o270866j493378N586166N798302P41539
$$ 542482567 544182739 542790260 543923912 537653046 536159668 541745834 547544136 548285675
3675.2E48285675j5513115N81017N152740L439980j336098j228867J821709O38428
$$ 548285675 532772560 533353577 538506317 541946297 540610199 539381332 541203041 541841469
3682.9E41841469J114540l4790m77905K831344N745812o397591p534523P254066m586105
$$ 541841469 542956009 542921219 542443314 545274658 551020470 544622879 537088356 544342422 539756317
3691.6E39756317k192383L900147j00174J207962k3842j18065j80893k64282K266006
$$ 539756317 537563934 541464081 541363907 542571869 542548027 542429962 542249069 541984787 544250793
3700.3E44250793K725411l910332m659920K672501J194420M84428m63409R53216L491555
$$ 544250793 546976204 543065872 538405952 541078453 542272873 542757301 542293892 543247108 546738663
3709E46738663o462746K316399N115776r706841N91927K646332m93164J30271K104645
$$ 546738663 540275917 542592316 547708092 538001251 538593178 541239510 540746346 540876617 542981262
3717.7E42981262Q87337k319679p12662M908562k058716o257591L421516J069031J14174
$$ 542981262 543868599 541548920 540836258 545744820 543686104 537428513 540850029 541919060 542033234
3726.3E42033234l250656l45688K939567M42200N008354j816559p330284O423836K154846
$$ 542033234 538782578 538436890 541376457 541818657 546827011 545010452 537680168 544104004 546258850
3735E46258850j0807762q88519K356071J04065K308731K182427k771836J192475J0762176
$$ 546258850 535451088 534562569 536918640 537022705 539331436 541513863 538742027 539934502 550696678
3743.7E50696678n660972j8253708Q290214M218636N685730j813507q696022Q649139
$$ 550696678 545035706 526781998 535072212 539290848 544976578 543163071 534467049 543116188
3751.4E43116188l348579q204079K580032M022484L351174l497048j76010M461670
$$ 543116188 539767609 531563530 534143562 538166046 541517220 538020172 537844162 542305832
3759.1E42305832m740753k799416L861351Q74672l84140K244301j152191m359741J039390
$$ 542305832 537565079 534765663 538627014 539501686 539117546 541361847 540209656 535849915 536889305
3767.8E36889305M011421R58062o571618n23719K659225l6316L84522K38876J39427
$$ 536889305 540900726 541858788 535287170 534763451 537422676 537386360 537770882 538009758 538149185
3776.5E38149185O58455J335030M65622o633950O93016J581879m03328J919670k191009
$$ 538149185 538807640 540142670 540608292 533974342 534667358 536249237 535845909 537765579 535574570
3785.2E35574570j84136Q50678M52690O02722o22444N90172r80263n7602m90189Q01964
$$ 535574570 535390434 536241112 536693802 537296524 536674080 537264252 536283989 536226387 535736198 536538162
3794.8E36538162L140221k995873l679580O42738L572006M613037l692169r437637
$$ 536538162 539678383 536682510 533002930 533645668 537217674 541830711 538138542 528700905
3802.5E28700905J025505J636772L154564O401558p927704m679031M243278J680107
$$ 528700905 529726410 531363182 534517746 540919304 532991600 528312569 532555847 534235954
3810.2E34235954J73455o8856K2126L34014M677430j263008j2718277K674598M401894
$$ 534235954 534409409 534340553 534362679 534696693 539374123 538111115 525392838 528067436 532469330
3818.9E32469330N144729L638764j1894150k593651L503609J456947J646805K79656
$$ 532469330 537614059 541252823 529358673 526765022 530268631 531725578 533372383 533652039
3826.6E33652039m308052J23023J134377K976379J454506o968918K140084N675201
$$ 533652039 529343987 529467010 530601387 533577766 535032272 528063354 530203438 535878639
3834.3E35878639m042358k500801P178535n678024o144142O505356m343377r34219
$$ 535878639 531836281 529335480 536514015 530835991 524691849 531197205 526853828 525919609
3842.1E25919609N685387J6403l644486J269951J390229j71357Q45757j636391J334801
$$ 525919609 531604996 531621399 527976913 529246864 530637093 530465736 531311493 529675102 531009903
3850.7E31009903M524879l380165Q59032j1132431k080116P516708K74506k207299
$$ 531009903 535534782 532154617 533013649 521881218 519801102 527317810 527592316 525385017
3858.4E25385017K382393J639900K690239l851699k413407N354004n681076l945465
$$ 525385017 527767410 529407310 532097549 528245850 525832443 531186447 525505371 521559906
3866.2E21559906L580742L905105N038872n355453p509117J182060M938927M028244
$$ 521559906 525140648 529045753 534084625 528729172 521220055 522402115 527341042 531369286
3873.9E31369286p145119j412468L166389M43459R45930M571038m467545q319053L652305
$$ 531369286 524224167 522811699 525978088 526421547 527367477 531938515 527470970 519151917 522804222
3882.6E22804222J970291J751862M777565r141121j958351L809433N46188L442497
$$ 522804222 524774513 526526375 531303940 522162819 520204468 524013901 524560089 528002586
3890.3E28002586J430588p793579m25262K973594J06430k91176N32074K202378J620025
$$ 528002586 529433174 521639595 521214333 524187927 524294357 524003181 524535255 526737633 528357658
3898.9E28357658q749199J943284L157806n088615M206657j650086k131729P99828
$$ 528357658 519608459 521551743 524709549 519620934 523827591 522177505 520045776 520845604
3906.7E20845604j03989J643982j113472P03507M91485n72M08363p87010J178589J316223
$$ 520845604 520741615 522385597 521272125 521975632 522467117 522466545 522874908 522087898 523266487 524582710
3916.3E24582710k466202m664573K963714J479950l428726J505547R81102J826362
$$ 524582710 522116508 517451935 520415649 521895599 518466873 519972420 520953522 522779884
3924E22779884r34906k886238K49443P4044P53784j93367L15933O84700j509285j323891
$$ 522779884 521844978 518958740 519208183 519282227 520036011 519842644 520158577 520843277 519333992 518010101
3933.7E18010101O74935k17781j09215J347961l34091l93562j055603J385307K214089
$$ 518010101 518685036 518467255 518358040 519706001 519371910 518978348 517922745 519308052 521522141
3942.3E21522141l494568j113167K85225P76520J281585j553764k30751L47061j884232
$$ 521522141 518027573 516914406 517199631 517976151 519257736 517703972 517473221 517820282 515936050
3951E15936050P02439R31930j547165J53733P83691K99835j147613l31993R68437j03989
$$ 515936050 516638489 517570419 516023254 516176987 516960678 517260513 516112900 515780907 516749344 516645355
3960.7E16645355L82881j950378o03294R09233m5395K77748k90108Q38852o32591p96280
$$ 516645355 517028236 515077858 514474564 515383797 515338402 515616150 515326042 516164894 515532303 514736023
3970.3E14736023j11885n26543K41165L7232K75917r92890J45035P27082k9526l9826
$$ 514736023 514624138 514097595 514338760 514375992 514651909 513659019 513804054 514531136 514501610 514461784
3980E14461784k64930J41410j066894k632K37770o4621k98767q37288M40521l1738
$$ 514461784 514196854 514338264 513271370 513268738 513506508 513441887 513143120 512305832 512746353 512714615
3989.6E12714615k39830q12340J32828M82902n45196N3825K27776N19981l3569L00522
$$ 512714615 512474785 511662445 511795273 512278175 511732979 511786804 512014580 512534561 512500992 512801514
3999.2E12801514n66941
$$ 512801514 512234573
4000.2E12234573
$$ 512234573
##END=$$ End of the data block
