##TITLE=$$ Begin of the data block
##JCAMP-DX=5.00 $$ ACD/SpecManager v 10.08
##SPECTROMETER/DATA SYSTEM=Varian
##DATE=04 Dec 2012 14:36:30
##DATA TYPE=INFRARED SPECTRUM
##DATA CLASS=XYDATA
##ORIGIN=
##OWNER=
##NPOINTS=3735
##FIRSTX=399.26403809
##LASTX=4000.35498047
##MAXX=4000.35498047
##MINX=399.26403809
##MAXY=83.65268707
##MINY=53.71569824
##XFACTOR=1.0000000000
##YFACTOR=0.000000100000000
##FIRSTY=80.14949799
##DELTAX=0.96440572
##XUNITS=1/CM
##YUNITS=TRANSMITTANCE
##XYDATA=(X++(Y..Y))
399.3H01494980J4984283J6052399L995209k2862397j0806655j1362534j2517242J0376
$$ 801494980 816479263 832531662 836526871 813664474 802857819 791495285 778978043 778988419
407G78988419L259353Q505402l618775J505204K3026352J8703842q938141j8414383
$$ 778988419 782247772 790753174 787134399 788639603 811665955 830369797 821431656 803017273
414.7H03017273n044098n851898n622330j735000L6149139k864914k0951538L66516
$$ 803017273 797973175 792121277 786498947 784763947 820913086 818048172 797096634 797463150
422.4G97463150L968735l536225q923034R5443P549820O863327P172013j0095368k127762
$$ 797463150 801431885 797895660 788972626 789068069 796617889 803481216 810653229 800557861 798430099
431.1G98430099Q097229l055725j813659M922485P68051j5845566m204483Q271943
$$ 798430099 806527328 803471603 801657944 806580429 807348480 791502914 787298431 795570374
438.8G95570374L646850j314010j937485M238434M230880K999878p80639j277390K45743
$$ 795570374 799217224 797903214 795965729 800204163 804435043 807434921 806654282 805376892 805622635
447.5H05622635k878952m630661m613876j50528L547439N879974L372193r37424j457519
$$ 805622635 802743683 798113022 793499146 793348618 796896057 802776031 806148224 805210800 803753281
456.2H03753281l134003j5924149J860581J6475067k726593j5038605p87048O487732
$$ 803753281 800619278 784695129 786555710 803030777 800304184 785265579 784478531 790966263
463.9G90966263N139389L340988Q997955j121444j2742463l110198Q976364J178131
$$ 790966263 796105652 799446640 808444595 807323151 794580688 791470490 800446854 801624985
471.6H01624985k2567749k00043J2556458R747848M547348k604828l304977j0793839
$$ 801624985 779057236 778857193 791413651 801161499 805708847 803104019 799799042 789005203
479.3G89005203k984085N476380N988693O979751m188995q94394P725067j51062q372879
$$ 789005203 786021118 791497498 797486191 804465942 800276947 799382553 807107620 806956558 798583679
488G98583679k783966K382431j638336m412308L23792Q336715M153443j798401J414719
$$ 798583679 795799713 798182144 796543808 792131500 792455292 800792007 804945450 803147049 804561768
496.7H04561768M24652n481568m802093L362350J261673l278198J547699k044144j02310
$$ 804561768 804986420 799504852 794702759 798065109 799326782 796048584 797596283 795552139 795449829
505.3G95449829L573380l144837j970901J187744k310410k631225J382293J089325
$$ 795449829 799023209 795878372 793907471 795095215 792784805 790153580 791535873 792625198
513.1G92625198j33896N027619M632263l083496k118073J791687K61994J530151n89599
$$ 792625198 792491302 797518921 802151184 799067688 796949615 798741302 799003296 800533447 799943848
521.7G99943848o243515l312683m13590J899338L209305k350998j081391L037110M759597
$$ 799943848 793700333 790387650 789974060 791873398 795082703 792731705 791650314 794687424 799447021
530.4G99447021K26136m161148j325913j120453r30786k214126o71540L581848K653122
$$ 799447021 799673157 795512009 794186096 793065643 792134857 789920731 789249191 792831039 795484161
539.1G95484161L415528L993072K217713k926865o301346l150635k77786l0899j445618
$$ 795484161 798899689 802892761 805110474 802183609 795882263 792731628 792453842 792422943 790977325
547.8G90977325P90558M292298M496765J819992l14636P73849j497269l623886k124710
$$ 790977325 791767883 796060181 800556946 802376938 802062302 802836151 801338882 797714996 795590286
556.5G95590286j879349k711486j228104K291870M748535M313813K037658J616059
$$ 795590286 793710937 790999451 789771347 792063217 796811752 801125565 803163223 804779282
564.2H04779282j446762o021958n466385j958465j106339p49740K608413M390869L335267
$$ 804779282 803332520 797310562 791844177 789885712 788779373 788029633 790638046 795028915 798364182
572.9G98364182K818603K721024q92945o393661l848191k009506k714920k285766J861343
$$ 798364182 801182785 803903809 803010864 796617203 792769012 790759506 788044586 785758820 787620163
581.5G87620163N470123M748078M442367J581726k89383L3570k701340n339356n645065
$$ 787620163 793090286 797838364 802280731 803862457 803573074 803606644 800905304 795565948 789920883
590.2G89920883k319870R7122J290894K725754M244232O764603L628387k334290k417526
$$ 789920883 787601013 787698135 788989029 791714783 795959015 802723618 806352005 804017715 801600189
598.9H01600189k961654o941681m410172N14679J059799K219162M760132L499527J533051
$$ 801600189 798638535 791696854 787286682 787801361 788861160 791080322 795840454 799339981 800873032
607.6H00873032L46984k223205k161484k939148m695205k862092j046829M21219J864090
$$ 800873032 801220016 798996811 796835327 793896179 789200974 786338882 785292053 785713272 787577362
616.3G87577362O018143O280899K288360J357956k415695l143158l558273m711380
$$ 787577362 793595505 799876404 802164764 803522720 801107025 797963867 794405594 789694214
624G89694214j932526J0376L099594L388367K837219M650955L433991L62778l543320
$$ 789694214 787761688 787772064 790871658 794260025 797097244 801748199 805182190 805544968 802001648
632.7H02001648m608231l350982m150162l258438J560974N928192N183487J584168
$$ 802001648 797393417 794042435 789892273 786633835 788194809 794123001 799306488 800890656
640.4H00890656J804733K720108j370316l366775l096619l811645k551499K85721O90842
$$ 800890656 802695389 805415497 804045181 800678406 797581787 793770142 791218643 791504364 792195206
649G92195206R50164L981781L076859J935043J968003k561341m075622k066879r78623
$$ 792195206 793145370 797127151 800204010 802139053 804107056 801545715 797470093 795403214 794424591
657.7G94424591n75104J071472J152344Q82340K700348J878891K69394J435928L029938
$$ 794424591 793849487 794920959 796073303 796955643 799655991 801534882 801804276 803240204 806270142
666.4H06270142l819886k7227478P119217P502136L803864K732773K093811K796478
$$ 806270142 802450256 775222778 782341995 789844131 793647995 796380768 798474579 801271057
674.1H01271057K043152j08261j383820n21011n86395k091523k731018p39822R71146
$$ 801271057 803314209 803205948 801822128 801301117 800714722 798623199 795892181 795152359 796123505
682.8G96123505J052627K139969K099609O40946j353989q27179J68762k05307j79290
$$ 796123505 797176132 799316101 801415710 802056656 800702667 799875488 800044250 799838943 799659653
691.5G99659653j582566J46180J786270N28030J445007K150803J046677m85916j438446
$$ 799659653 798077087 798223267 800009537 800537567 801982574 804133377 805180054 804694138 803255692
700.2H03255692k034760j203842J65405P98798L07235p2708J910401J140976k051545
$$ 803255692 801220932 800017090 800182495 800981293 801288528 801215820 803126221 804267197 802215652
708.8H02215652j760406N25055M19235n75867L7995K80914J357346K362442J088104
$$ 802215652 800455246 800980301 801399536 800823669 800861664 801142578 802499924 804862366 805950470
717.5H05950470j166000j968766p06558n23071m48303Q88519P94678l0518J219559
$$ 805950470 804784470 802815704 802109146 801586075 801137772 802026291 802820969 802790451 804010010
726.2H04010010Q45260m47921J124725J193848J49078r43375k213897k190705j411209
$$ 804010010 804855270 804407349 805532074 806725922 806875000 805931625 803717728 801527023 800115814
734.9H00115814N24597K652359K492066J35803L3188Q13217j01471j422729k281952
$$ 800115814 800640411 803292770 805784836 805920639 805953827 806767044 806665573 805242844 802960892
743.6H02960892m21601K78626q4458J574555K308350J818771J618729J257934n36117
$$ 802960892 802539291 802817917 802733459 804308014 806616364 808435135 810053864 811311798 810775681
752.2H10775681k540970l106537k387238k045593k25906L67431p60574K677460M031906
$$ 810775681 808234711 805128174 802740936 800695343 800469437 800836868 800076294 802753754 806785660
760.9H06785660L111572K341080j704102l132324k282639k128906j889725r002J527328
$$ 806785660 809897232 812238312 810534210 807401886 805119247 802990341 801100616 801091614 802618942
769.6H02618942J638947K646942K767334J662140K48642k97394k146759l176422j228333
$$ 802618942 804257889 806904831 809672165 811334305 811582947 811285553 809138794 805962372 804734039
778.3H04734039j294708r27277J066971K780228L162308K180023J205673l14102j984100
$$ 804734039 803439331 802512054 803579025 806359253 809521561 811701584 812907257 812593155 810609055
787H10609055k951050j775513j659851j537857J043854K698211K719040K651749L721161
$$ 810609055 807658005 805882492 804222641 802684784 803728638 806426849 809145889 811797638 815518799
795.6H15518799J391449k723313k633209k392731l392944j176300J771546J882247
$$ 815518799 816910248 814186935 811553726 809160995 805768051 804591751 806363297 808245544
803.4H08245544K096253K124252K437821J689987L35083M54635j927490k712402k681122
$$ 808245544 810341797 812466049 814903870 816593857 816928940 817383575 815456085 812743683 810062561
812H10062561k179947k89841n06744J744080M363479L368759O03409j335525j200943
$$ 810062561 807882614 807592773 807086029 808830109 813193588 816562347 817165756 815830231 814629288
820.7H14629288j218415j769943j651687j212616o56052J999206K449646P33567J566238
$$ 814629288 813410873 811640930 809989243 808776627 808120575 810119781 812569427 813302994 814869232
829.4H14869232J499710k91900j023178o58417j515808j862107k093429r93347K521667
$$ 814869232 816368942 816077042 815053864 814395447 812879639 811017532 808924103 807930756 810452423
838.1H10452423L797684L187485k75956j716690n27267j803971j686706j304932p04574
$$ 810452423 814250107 817437592 817161636 815444946 814917679 813113708 811427002 810122070 809417496
846.8H09417496J03302K81906O28815J608276K855225J520233N51681L91770j240845
$$ 809417496 809520798 809802704 810431519 812039795 814895020 816415253 816966934 817358704 816117859
855.4H16117859k826157j503143k98767o10962R86938R03092J165924J610870r5291
$$ 816117859 813291702 811788559 811489792 810878830 811865768 812768860 813934784 815545654 815450363
864.1H15450363Q84552J271362r19876k237548k140503j135941p55310k83813K643966
$$ 815450363 816334915 817606277 816686401 814448853 812308350 811172409 810417099 810133286 812777252
872.8H12777252K201538J98822J038819j05820K54364j053467k861786J1521P57751
$$ 812777252 814978790 815177612 816216431 816110611 816364975 815311508 812449722 812461243 813218994
881.5H13218994N08270N17044R68476J124039o2256p63245r50012o6376j30157k24457
$$ 813218994 813727264 814244308 815212784 816336823 816274567 815511322 814561310 814494934 814364777 814140320
891.1H14140320j278000j353455J257630J316299J49155o20270n12543K01416l4790
$$ 814140320 812862320 811508865 812766495 814082794 814231949 813611679 813099136 813300552 813265762
899.8H13265762j63269K61383k29187j023330n9662M85992l91998j135483Q6289J096267
$$ 813265762 813102493 813363876 813134689 812111359 812051697 812537689 812145691 811010208 811096497 812192764
909.4H12192764J90506m67987p98874M09165J145706K48413o55060l70941J35269j003647
$$ 812192764 812383270 811915283 811116409 811525574 812671280 812919693 812264633 811893692 812028961 811025314
919.1H11025314q41369p50046m65469L29132K53372Q55942N09796M24881K64892K00577
$$ 811025314 810183945 809433899 808968430 809297562 809550934 810406876 810916672 811341553 811606445 811807022
928.7H11807022K21176j518860j649780o59637m28543j83716N11093J290207J432190
$$ 811807022 812028198 810509338 808859558 808199921 807771378 807587662 808098755 809388962 810821152
937.4H10821152Q70437p4386n07813k64435j41601q83637j055374o78558J53122J30920
$$ 810821152 811691589 811617203 811109390 810844955 810703354 809819717 808764343 808085785 808238907 808369827
947.1H08369827m98123J327591J909103J106034M91638j172714k590256k706680p19605
$$ 808369827 807871704 809199295 811108398 812214432 812706070 811533356 808943100 806236420 805516815
955.7H05516815J98822K64435Q22144M65545L66593Q10318J047058n33905j866761
$$ 805516815 805715637 805980072 806802216 807267761 807634354 808444672 809491730 808957825 807091064
964.4H07091064j190033n74569j321488j738662M76074J390686N38177R23233N07355
$$ 807091064 805901031 805326462 804004974 802266312 802742386 804133072 804671249 805594482 806101837
973.1H06101837r1171q17566k277298j507492n55496j425934j170120q5221O62155
$$ 806101837 806010666 805193100 802915802 801408310 800852814 799426880 798256760 798171539 798833694
981.8G98833694Q04673O47430M80423k00348r82971j118622q30307j620483j335526
$$ 798833694 799638367 800285797 800766220 800565872 799582901 798464279 797633972 796013489 794677963
990.5G94677963k12784m15954K0904Q96302J619262J113739n37796j689376j843567
$$ 794677963 794465179 794049225 794070129 794966431 796585693 797699432 797161636 795472260 793628693
999.1G93628693j247177q61664L60260K34604k66571J147308Q94928k78931m00314
$$ 793628693 792381516 791519852 791880112 792114716 791848145 792995453 793890381 793611450 793211136
1007.8G93211136L10669N20096j142578k444153j013031K39105o33087k00119P56836
$$ 793211136 793521805 794041901 792899323 790455170 789442139 789681244 789048157 788848038 789604874
1016.5G89604874K88543J25733L12118q00552j302872o12182j285324n87159O97937
$$ 789604874 789893417 790019150 790331268 789530716 788227844 787615662 786330338 785743179 786441116
1025.2G86441116L10669m41360m63791J377640J330108m14428k93198M91257L1128
$$ 786441116 786751785 786310425 785846634 787224274 788554382 788139954 787846756 788338013 788369141
1033.8G88369141j116333m04053K79465P6217K02942J79291N45349L10288m52042l75595
$$ 788369141 787252808 786848755 787128220 787204437 787407379 787586670 788132019 788442307 787990265 787614670
1043.5G87614670J99890J20010n37719l5248M29916m42428J38168K89307p86896L95279
$$ 787614670 787814560 787934570 787396851 787361603 787791519 787349091 787487259 787776566 786989670 787384949
1053.1G87384949M93240j66397K17133k84958l77426l84675M74701J292801J88217
$$ 787384949 787878189 787711792 787928925 787643967 787266541 786881866 787356567 788649368 788837585
1061.8G88837585m46701j4190K64206J55487l85895j040039K39639J263275j60217
$$ 788837585 788390884 788376694 788640900 788796387 788410492 787370453 787610092 788873367 788713150
1070.5G88713150q60672O87K91748l29132m84925o89850j05667K59171k55661J32446
$$ 788713150 787852478 787853165 788144913 787815781 787330856 786641006 786535339 786794510 786538849 786671295
1080.1G86671295l93677l37600R29031Q21991n61218o97632r3308r98611m61960J73798
$$ 786671295 786277618 785940018 786869049 787691040 787129822 786432190 786338882 785340271 784878311 785052109
1089.8G85052109P9117Q74252R69849P85675j32294m72489N3330l96423p34940l65219
$$ 785052109 785131226 786005478 786975327 787761002 787628708 787156219 787209549 786813126 786078186 785712967
1099.4G85712967o63605q04443L87878L00751K66800R25903q6441o53610l72849p32574
$$ 785712967 785049362 784244919 784632797 784933548 785200348 786126251 786039810 785386200 785013351 784280777
1109.1G84280777j530151j073151M07333P10984N29480J205902J801758R20333l39279
$$ 784280777 782750626 781677475 782084808 782795792 783325272 784531174 786332932 787253265 786913986
1117.7G86913986j71737o4393q86917j034774j337662j120758K42462N95703J744537
$$ 786913986 786742249 786677856 785790939 784756165 783418503 782297745 782540207 783135910 784880447
1126.4G84880447K650528J139069M6005k81677n55496p65000p16324j87911K38418
$$ 784880447 787530975 788670044 788716049 788434372 787878876 787113876 786397552 786209641 786448059
1135.1G86448059j74026O1340J369629J857681J382141k24151j058197n88990r19876
$$ 786448059 786274033 786335373 787705002 789562683 790944824 790720673 789662476 789073486 788153610
1143.8G88153610j095352q71277q38470o97708J43890J077957J277237R06372M60129
$$ 788153610 787058258 786186981 785348511 784650803 784794693 785872650 787149887 788056259 788516388
1152.5G88516388P1258o86111j212997j829148j647339j97830J172791J594085O92292
$$ 788516388 788587646 787901535 786688538 784859390 783212051 783014221 784187012 785781097 786473389
1161.1G86473389O72455J243133O11038J03226n9509o83213j303787p18002l38135
$$ 786473389 787145844 788388977 789000015 789103241 789043732 788360519 787056732 786338730 786000595
1169.8G86000595M53720K024231J810150J498490J477432L93753o36826j186142j093978
$$ 786000595 786454315 788478546 790288696 791787186 793264618 793658371 793021545 791835403 790741425
1178.5G90741425n09415n98602k66419J401138J899262J449432Q60672r1781j46561
$$ 790741425 790232010 789633408 789366989 790768127 792667389 794116821 794977493 794885712 794739151
1187.2G94739151n89142r17129m55017q66776n42374K53525k00653O96564J524811
$$ 794739151 794150009 793232880 792777863 791911087 791368713 791622238 791421585 792118149 793642960
1195.9G93642960O93206P37458J52893j141053j102752r99756r35059K45514Q20008
$$ 793642960 794336166 795073624 795226517 794085464 792982712 791982956 791047897 791293411 792113419
1204.5G92113419M17175R54590J062088L69110R0790j61133j58005m59824j006240
$$ 792113419 792530594 793485184 794547272 794916382 795007172 794846039 794688034 794228210 793221970
1213.2G93221970p15256J05820K99072K79846R44672J216888M43344J05362m3259q96759
$$ 793221970 792506714 792612534 792911606 793191452 794136124 795353012 795796356 795901718 795858459 794961700
1222.9G94961700j059188q58765l91693K04620m7149L90548J065903N80826j23902
$$ 794961700 793902512 793043747 792652054 792856674 792809525 793200073 794265976 794846802 794722900
1231.5G94722900l32107p00073p35169l23410l42026k47726j56326M75006P38144O34994
$$ 794722900 794390793 793690720 792955551 792632141 792290115 792042389 791886063 792361069 793099213 793734207
1241.2G93734207M61121m60358l50342k23846j67771l25622o13480J84174J29852J11923
$$ 793734207 794195328 793734970 793384628 793160782 792993011 792667389 792053909 792238083 792367935 792479858
1250.8G92479858N31083N86547J37635k94953l61328r64355j003952l03421Q44955
$$ 792479858 793010941 793597488 793735123 793440170 793078842 792114487 791110535 790807114 791652069
1259.5G91652069Q49991L64227L71247r9411L13110n2872q00857p14341l95050N570
$$ 791652069 792502060 792866287 793237534 793138123 793451233 793398361 792597504 791883163 791488113 791493683
1269.2G91493683m7836M19235N60913N56869M92859J56632k71683j072006o53839k96860
$$ 791493683 791445847 791865082 792425995 792982864 793475723 793632355 793360672 792288666 791634827 791337967
1278.8G91337967l34320J02234K14538L93448R64966R89227N92118K71453o77261j283111
$$ 791337967 791003647 791105881 791320419 791713867 792678833 793668060 794260178 794531631 793854370 792571259
1288.4G92571259j305085p84378j99737j27411N73196J088410J342849P75757j16501
$$ 792571259 791266174 790481796 790282059 790154648 790727844 791816254 793159103 793934860 793818359
1297.1G93818359m45327r67484j456985j700669m33426K46277L15476P62100J029510
$$ 793818359 793373032 792405548 790948563 789247894 788814468 789060745 789376221 790138321 791167831
1305.8G91167831J579514N36270n44128n85862j459808k078705j127319j07269j38550
$$ 791167831 792747345 793283615 792739487 792153625 790693817 788615112 787487793 787380524 787241974
1314.5G87241974M72412Q97217J179809J096344L86124p4310n11093q80890j523056
$$ 787241974 787714386 788611603 789791412 790887756 791273880 791199570 790688477 789807587 788284531
1323.2G88284531j200562l11279K27814Q39920J181182J109162J010437P45315j97372
$$ 788284531 787083969 786772690 787000504 787840424 789021606 790130768 791141205 791886520 791689148
1331.8G91689148o58646j615143k058639j339874j196442K52457R61227R27582J297073
$$ 791689148 791030502 789415359 787356720 786016846 784820404 785072861 786034088 786961670 788258743
1340.5G88258743J682358J409454k86026j048965j349411j619721j431503j064834
$$ 788258743 789941101 791350555 791064529 790015564 788666153 787046432 785614929 784550095
1348.2G84550095j65329J380233K292939J452789R44290K26822j204834j640167j030274
$$ 784550095 784384766 785764999 788057938 789510727 790455017 790681839 789477005 787836838 786806564
1356.9G86806564j007156j406555p4463j92032N05829J434250L67965K124100J772080
$$ 786806564 785799408 784392853 784318390 784126358 784632187 786066437 786434402 788558502 790330582
1365.6G90330582p72248j947860k488633j960678l25775K82211M13056N61447m63715
$$ 790330582 789558334 787610474 785121841 783161163 782835388 783117599 783530655 784092102 783628387
1374.3G83628387R26285K435990J255035p69043j948624j533813j777115j405258r38797
$$ 783628387 784554672 786990662 788245697 787476654 785528030 783994217 782217102 780811844 779873047
1382.9G79873047N33218J637802J823349J557465k63519J329345N03922j660309j567078
$$ 779873047 780406265 782044067 783867416 785424881 785161362 786490707 786994629 785334320 783767242
1391.6G83767242q61892M29764k111283j675186K797470K440491R40323j336212O34765
$$ 783767242 782905350 783335114 781223831 779548645 782346115 784786606 785726929 784390717 785025482
1400.3G85025482J036225j363144j479950o96564k404175J602K469559J540298J226578
$$ 785025482 786061707 784698563 783218613 782522049 780117874 780119476 782589035 784129333 785355911
1409G85355911N92270k4109m75616j279450r94949j176147l74833q45337M7608R03091
$$ 785355911 785948181 785924072 785448456 784169006 783174057 781997910 781623077 780777740 780825348 781728439
1418.6G81728439k923126K156754L072204J105805j211472k646408k56576n1804j069412
$$ 781728439 778805313 780962067 784034271 785140076 783928604 781282196 781025620 780973816 779904404
1427.3G79904404l8147M73480q20236Q14590J976395P42874J05820R52148K15836o846924
$$ 779904404 779866257 780339737 779519501 780334091 782310486 783053360 783159180 784111328 784327164 777480240
1437G77480240j049881K264252O64215P19528J231995Q68530R21860K72827m14048
$$ 777480240 776430359 778694611 779358826 780078354 781310349 782178879 783100739 783373566 782959518
1445.6G82959518K02027j578522l620148L34931J111603K9068K36511J107178J127014
$$ 782959518 783161545 781583023 777962875 778297806 779409409 779438477 779674988 780782166 781909180
1454.3G81909180K61993j781311o648788j581116K611160J734772J962433O81762N69993
$$ 781909180 782171173 780389862 773741074 772159958 774771118 776505890 778468323 779150085 779720078
1463G79720078J586990j887283k46048K326889J055908m9744n22842M29153j510467
$$ 779720078 781307068 779419785 779173737 781500626 782556534 782506790 781983948 782413101 780902634
1471.7G80902634m556809j385269L131256L944397m60892J34125J620636j9150J61133
$$ 780902634 776345825 774960556 778091812 782036209 781575317 781709442 783330078 783310928 783472061
1480.3G83472061q33893m49142P45163j0529o5078P83920n93567o65207J692963k231217
$$ 783472061 782638168 782189026 782934189 782923660 782858582 783642502 783048935 782383728 784076691 781845474
1490G81845474k876358K205277J838913L89175R00726K20642m634094K264710J099243
$$ 781845474 778969116 781174393 783013306 783402481 784303207 784523849 779889755 782154465 783253708
1498.7G83253708p72705K100525j37024p89108J49688J430893J174927q231049n706482
$$ 783253708 782481003 784581528 784444504 783655396 783805084 785235977 786410904 778179855 772473373
1507.3G72473373K802201L940582K254562K586975L47367j576233J718216n34210q88825
$$ 772473373 775275574 779216156 781470718 784057693 784405060 782828827 784547043 784012833 783124008
1516G83124008k270279l993072M715728L188859l270874l047181J120377K591247J324463
$$ 783124008 780853729 776860657 781576385 784765244 781494370 778447189 779567566 782158813 783483276
1524.7G83483276k829971k02026P47528j662750J246566K491837Q22601n4016k489243
$$ 783483276 780653305 780451279 781198807 779536057 780782623 783274460 784097061 784043045 781553802
1533.4G81553802l633270K500763J557541R59930K579194q43964j0833588J995011
$$ 781553802 777920532 780421295 781978836 782938766 785517960 784673996 773840408 775835419
1541.1G75835419J297531n12467L445130R91974j529236K174988K71835l60107j915436
$$ 775835419 777132950 776620483 780065613 781057587 779528351 781703339 781975174 781615067 779699631
1549.8G79699631k377625K203369J660538N04074l868408O02264M566651K329178j1014862
$$ 779699631 777322006 779525375 781185913 781689987 777821579 778423843 782990494 785319672 774304810
1558.5G74304810j3128434O132126P154846L960801J249847O6605p04575O50558J285325
$$ 774304810 761176376 767308502 774463348 778424149 779673996 779740601 779036026 779686584 780971909
1567.1G80971909L69262j71127n616150O24542K010346J85623J80588P35550K52685
$$ 780971909 781341171 781170044 775553894 776178436 778188782 778374405 778554993 779290543 779543228
1575.8G79543228o953735K242813L093643O76499q164r76562m26255p43332o87179
$$ 779543228 772589493 774832306 777925949 778602448 778594284 777617722 777191467 776448135 775760956
1584.5G75760956n14908K44827O77490o75964l26385o69556m99420r83887n72815o36215
$$ 775760956 775246048 775490875 776168365 775492401 775166016 774496460 773997040 773013153 772440338 771804123
1594.1G71804123j761932l31421n59082K46124M8752k39792k72217q10471q98590k034912
$$ 771804123 770042191 769710770 769151688 769397812 769446564 769206772 768934555 768124084 767225494 765190582
1603.8G65190582n97992n66787q90503r31626l75137q56705j329193O30570p85370
$$ 765190582 764592590 764025803 763135300 762203674 761828537 760971832 759642639 760273209 759487839
1612.5G59487839p33414j186905l6926j099548r917145L247070K080078J98899n84565
$$ 759487839 758754425 757567520 757530594 756431046 746513901 749760971 751841049 752039948 751455383
1621.1G51455383L80402q81271n554429J775589J163178L21884k548523k226333J560745
$$ 751455383 751835785 750954514 745400085 747175674 748338852 748660736 746112213 743885880 745446625
1629.8G45446625J08795L25775K10495J238327J877289p645798j656036J960907J050873
$$ 745446625 745555420 745881195 746091690 747330017 749207306 741561508 739905472 741866379 742917252
1638.5G42917252J714477P41120k28882J040497M63714J659775K210388l029175k329712
$$ 742917252 744631729 745372849 745143967 746184464 746648178 748307953 750518341 747489166 745159454
1647.2G45159454q55713J867066K947388K701187L428268m971695j2446976P870636
$$ 745159454 744303741 746170807 749118195 751819382 755247650 750275955 737828979 745699615
1654.9G45699615N858307L234787R56192M71573K69165R8648Q30078j982421j961899
$$ 745699615 751557922 754792709 755748901 756220474 756489639 756588287 757418365 755435944 753474045
1663.6G53474045L487778K668609J058273J754303J690369l615036j540604J475831
$$ 753474045 756961823 759630432 760688705 762443008 764133377 760518341 758977737 760453568
1671.3G60453568j38245J861954K891845k254028k700119M445801K871628R70306q8882
$$ 760453568 760315323 762177277 765069122 762815094 760114975 764560776 767432404 768402710 768313828
1680G68313828j649247J707001K505951j949158r973678J731414N418244L180542N98297
$$ 768313828 766664581 768371582 770877533 768928375 758954697 760686111 766104355 769284897 769883194
1688.6G69883194R39941j22909Q49228R68399k15149J757736J250458r872894J000976
$$ 769883194 770823135 770700226 771549454 772517853 772302704 774060440 775310898 765438004 766438980
1697.3G66438980M981766N040130O67191j0308762N119782L927460J17035k526703
$$ 766438980 771420746 776460876 777128067 766819305 771939087 775866547 775983582 773456879
1705G73456879j493836r81293J267396K580719M83474l87573J757736J524735P31430
$$ 773456879 771963043 770981750 772249146 774829865 775313339 774925766 776683502 778208237 778939667
1713.7G78939667k279816k402649J914215l63922o804123K795105L528061J551590
$$ 778939667 776659851 774257202 776171417 775807495 769003372 771798477 775326538 776878128
1721.4G76878128J467209M13513k49710J063614K81601o89621o38199L42178k336349
$$ 776878128 778345337 778758850 778509140 779572754 779854355 779164734 778526535 778868713 776532364
1730.1G76532364j512451K644119J504593k245102m551544M019394L081665J76620
$$ 776532364 775019913 777664032 779168625 776923523 772371979 776391373 779473038 779649658
1737.8G79649658J163254k284470l626937K081680J370392j402893o6910K278747O62766
$$ 779649658 780812912 778528442 774901505 776983185 778353577 776950684 776883774 779162521 779825287
1746.5G79825287j7243p61566j167679K106247j839523k705994K147751R64737R63974
$$ 779825287 779808044 779046478 777878799 779985046 778145523 775439529 777587280 778552017 779515991
1755.2G79515991J478806j287384M33426J084213L51868O49337m315262j651687K074432
$$ 779515991 780994797 779707413 780140839 781225052 781576920 782226257 777910995 776259308 778333740
1763.9G78333740N89447R9106J190643J260147k128677P61948J839447j317597l758468
$$ 778333740 778923187 779022293 780212936 781473083 779344406 780106354 781945801 780628204 776869736
1772.5G76869736k071228L061142J091842j439590J205749Q25653J028824O53534j191940
$$ 776869736 774798508 777859650 778951492 777511902 778717651 779543304 780572128 781225662 780033722
1781.2G80033722L09753Q14362J32904j810532j464080N60073n5160M84161J630783
$$ 780033722 780343475 781157837 781290741 779480209 778016129 778576202 778521042 779005203 780635986
1789.9G80635986O59333L0822k319870o71768J675873o97861j808090O42166K033310
$$ 780635986 781295319 781326141 779006271 778334503 780010376 779312515 777504425 778146591 780179901
1798.6G80179901k43301k141342R07669N73196N55725J168366q1864m38385r57565
$$ 780179901 779936600 777795258 778702927 779276123 779831848 781000214 780918350 780479965 779522400
1807.3G79522400j311722M13742O65054j289978J50986J229630O18515Q27789J24435
$$ 779522400 778210678 778624420 779289474 777999496 778150482 779380112 779998627 780826416 780950851
1815.9G80950851n66482j306152n07508M43955l82386j3809j52359Q50830J306382
$$ 780950851 780384369 779078217 778570709 779014664 778632278 778618469 778466110 779316940 780623322
1824.6G80623322k398072l49807J557083L74527k007981m258804J695480K457733M06037
$$ 780623322 778225250 777875443 779432526 779807053 777799072 773540268 775235748 777693481 778099518
1833.3G78099518M04663N46112N83572m18167j032562j08414l80249k37655o72379
$$ 778099518 778504181 779050293 779633865 779215698 778183136 778074722 777694473 777456818 776784439
1842G76784439P56455N35354m269638J445389K451095P8278m00848K47650p553q11539
$$ 776784439 777540894 778076248 773806610 775251999 777703094 777781372 777380524 777628174 777620621 776809082
1851.6G76809082k46887k61841m33884K22092P53784P14112p706J61133K72598n26505
$$ 776809082 776562195 776300354 775866470 776088562 776842346 777556458 777548752 777709885 777982483 777455978
1861.3G77455978j151504n26199m26865m79431J95694K3498J172867k28729j594620
$$ 777455978 776304474 775778275 775351410 774871979 775067673 775091171 776264038 776035309 774440689
1869.9G74440689J637344J089325n51071j192474j021881l22876Q7967L79409M12980
$$ 774440689 776078033 777167358 776616287 775423813 774401932 774079056 774167023 774546432 774959412
1878.6G74959412N71441N23529N29633K10953k76566j112976j582947n74112j57776
$$ 774959412 775530853 776054382 776584015 776794968 776518402 775405426 773822479 773248367 773090591
1887.3G73090591R32465O75888r34753J038818J284943J44653k5024j074448j617127
$$ 773090591 774023056 774698944 773764191 774803009 776087952 776232605 776207581 775133133 773516006
1896G73516006m46701m75921o02951J44653O10504Q61588P08160O75202M30984m12140
$$ 773516006 773069305 772593384 771990433 772135086 772745590 773607178 774315338 774990540 775421524 775009384
1905.6G75009384r96857j440887r65576o06613r15604M02985J479263Q18176Q75015
$$ 775009384 774012527 772571640 771606064 770999451 770083847 770486832 771966095 772784271 773659286
1914.3G73659286Q29850J88522J60675k725983k122802L25927k63519J60217m04586
$$ 773659286 774489136 774677658 774838333 772112350 769989548 770315475 770051956 770212173 769807587
1923G69807587P1182J907349J555252M20913l39889m88205j013031j697617j017227
$$ 769807587 769878769 771786118 773341370 773762283 773422394 772934189 771921158 770223541 769206314
1931.7G69206314j72882m8370N99899J095962J134644Q67462M0131q4763q35418p81403
$$ 769206314 769033432 768985062 769584961 770680923 771815567 772683029 772723160 772638397 771802979 771021576
1941.3G71021576j559448l213272L91464J104736M83856J201249J221160J292344K21557
$$ 771021576 769462128 766248856 766640320 767745056 768228912 769430161 770651321 771943665 772165222
1950G72165222m86145p66983j115341r45587j270676o11572L41644P44553J064529
$$ 772165222 771679077 770912094 769796753 768851166 767580490 766968918 767310562 768055115 769119644
1958.7G69119644J129685M14886r5749j20468q57086j297302j109848o38123p20825
$$ 769119644 770249329 770664215 770568466 770447998 769590912 768293610 767183762 766545639 765824814
1967.3G65824814J95389J306533R69620J068726P56759j6174p59506j218567j080093
$$ 765824814 766020203 767326736 768296356 769365082 770121841 770105667 769346161 768127594 767047501
1976G67047501r29566l36151j02615L04184N69305P26395Q40378L45993M2800p69271
$$ 767047501 766117935 765781784 765679169 765983353 766552658 767279053 768119431 768465424 768508224 767738953
1985.7G67738953r98078q63647j231537p24335P29065J030655k22549O06308J112518
$$ 767738953 766740875 765877228 764645691 763921356 764650421 765681076 765458527 766064835 767177353
1994.3G67177353M63180M2038p57675j095428j175843p82394o29425m5929P69577N74494
$$ 767177353 767640533 767682571 766924896 765829468 764653625 763871231 763241806 763195877 763965454 764539948
2004G64539948O54220M21906L02658q2093r23767j003647p68508m69361k30102r766
$$ 764539948 765194168 765616074 765918732 765836639 764912872 763909225 763140717 762671356 762441254 762431488
2013.6G62431488J68304R30024O91070l04565O6452k60163q22677p92465o67725n70068
$$ 762431488 762599792 763529816 764220886 763916321 763982773 763722610 762899933 762107468 761439743 760869675
2023.3G60869675j03150O99463P74307N40848o0806k65732M9896j79290o44379q15582
$$ 760869675 760766525 761465988 762240295 762781143 762720337 762454605 762504501 762325211 761680832 760865250
2032.9G60865250o37741n11628p9269L09219N05371L68653J84402O5689o47735l84293
$$ 760865250 760227509 759715881 759636612 759945831 760451202 760819855 761004257 761069946 760422211 760037918
2042.6G60037918j50757n30777k86178j26953J10015L29056N74036N89981P6370l63006
$$ 760037918 759887161 759356384 759070206 758943253 759053268 759382324 759956360 760546341 760622711 760259705
2052.2G60259705m87290k22397l82003o85502k3727K24609p9193L34091Q8807k58866
$$ 760259705 759772415 759550018 759168015 758482513 758458786 758683395 758604202 758938293 759027100 758768234
2061.9G58768234R9564J92795p8659q02231n62134l72391k30179N67856K55203J29471
$$ 758768234 758867798 759060593 758981934 758179703 757617569 757245178 757014999 757582855 757838058 757967529
2071.5G57967529K42234J50222K6245l08456k09122l25546l42865m84161j75705P92618
$$ 757967529 758209763 758359985 758386230 758077774 757868652 757543106 757200241 756716080 756540375 757332993
2081.1G57332993N75332M4861R8953o5384l14941m36096o99387m54788k87552j94397
$$ 757332993 757908325 757953186 758052139 757986755 757671814 757235718 756536331 756081543 755793991 755599594
2090.8G55599594J98517k899M67605O46134R689j36642l83301o21872p59354j09253
$$ 755599594 755798111 755795212 756262817 756908951 756918640 756781998 756398697 755776825 755017471 754908218
2100.4G54908218L60108k62070j99737N91430O74362J47782J49688j9073n36346o87943
$$ 754908218 755268326 755006256 754806519 755397949 756072311 756220093 756369781 756350708 755814362 755126419
2110.1G55126419m33655k57797l43857K47956M92095M67530N11932m4021j94855k96173
$$ 755126419 754692764 754434967 754091110 754339066 754831161 755298691 755810623 755766602 755571747 755275574
2119.7G55275574n74570n60226m09089l49121j22375L66440N44357L83835K14538M90189
$$ 755275574 754701004 754140778 753731689 753382568 753260193 753626633 754170990 754554825 754769363 755259552
2129.4G55259552P1411o47583n77392p29447m40216k66876n73502O1035J000824Q92411
$$ 755259552 755330963 754683380 754105988 753376541 752936325 752669449 752095947 752156982 753157806 754050217
2139G54050217J62353P4539m9514o18821q11004m51126k89231m26330K17666P66831
$$ 754050217 754212570 754287109 754237595 753618774 752807770 752356644 752067413 751641083 751858749 752625580
2148.6G52625580L85437R9945M05731M75006j34353p53479r19190p03125o48727j58539
$$ 752625580 753011017 753110962 753516693 753991699 753857346 753103867 752184677 751481552 750832825 750674286
2158.3G50674286L18298L91159J122132Q13217k17972k0523q4457p94907p36084k38113
$$ 750674286 750992584 751383743 752505875 753319092 753101120 753080597 752996140 752201233 751465149 751227036
2167.9G51227036k29569k68021q7585N40619R65729N04684J42899k37275n66787n78461
$$ 751227036 750997467 750729446 750641861 751182480 752148209 752652893 752795792 752558517 751991730 751413269
2177.6G51413269n52063l43018k3727J54495L6850M89807Q05664L20817J79672j42060
$$ 751413269 750861206 750518188 750494461 750648956 750685806 751175613 751981277 752302094 752481766 752339706
2187.2G52339706m75311p09915r46884m22516P2937K86407M30603L92991O32095N20096
$$ 752339706 751864395 751154480 750207596 749785080 749858017 750144424 750575027 750968018 751600113 752120209
2196.9G52120209l19214l84903J4038m84085p93686n35202j31531K89002L11737L95431
$$ 752120209 751800995 751416092 751430130 750946045 750152359 749617157 749485626 749774628 750086365 750481796
2206.5G50481796O18439N64346j86538q52280m01459n5618k69013k03475p248J22680
$$ 750481796 751100235 751664581 751478043 750625763 750224304 750168686 749899673 749696198 749688950 749811630
2216.1G49811630L43323L75824K07367J35422j5412k59247m44030n14527o00509k19040
$$ 749811630 750154953 750530777 750738144 750873566 750858154 750598907 750154877 749640350 749039841 748820801
2225.8G48820801L30124N3940J02844N14221L61252J6250l08456k12326j5030m62875
$$ 748820801 749150925 749204865 749307709 749821930 750183182 750199432 749890976 749678650 749663620 749200745
2235.4G49200745q77533k22245M34800K13775K2583J68762M20075J45264k4949l56979
$$ 749200745 748323212 748100967 748535767 748749542 748772125 748940887 749360962 749506226 749481277 749124298
2245.1G49124298q73413m1809N6763m87366K3346M39987L48358N2338J18179r8648
$$ 749124298 748250885 748209076 748265839 747778473 747801819 748241806 748590164 748642502 748760681 748662033
2254.7G48662033l99094n02853l36456K27661k41470j63727L54004J25656K1362j67465
$$ 748662033 748262939 747760086 747423630 747651291 747409821 747246094 747600098 747725754 747747116 747579651
2264.4G47579651P7057M7836k06299l04031n12619l03421N0049K89611j754J30081
$$ 747579651 747656708 747704544 747498245 747194214 746681595 746378174 746428223 746717834 746716080 746846161
2274G46846161K96249P7515n7526m48303k00577k98462k94952J77078J53351R9487
$$ 746846161 747142410 747219925 747162399 746714096 746513519 746215057 745920105 746097183 746250534 746350021
2283.7G46350021J92795M04358k13547k69470r1095l14407k56195q85086n05219j41220
$$ 746350021 746542816 746947174 746733627 746464157 746373062 746058655 745802460 744917374 744412155 744270935
2293.3G44270935O5689L6850k17209L77503k06147j19552l38898r07364o83975q03680
$$ 744270935 744336624 744373474 744156265 744533768 744327621 744208069 743869171 742961807 742277832 741474152
2302.9G41474152p6600l65142J0376L03268k27203J71661k18353m10156p67823n81283
$$ 741474152 741397552 741032410 741042786 741346054 741118851 741290512 741072159 740662003 739894180 739312897
2312.6G39312897r00574o68640M36401m40140l71398k41395r994p10068q91495J64872
$$ 739312897 738412323 737743683 738180084 737739944 737368546 737127151 737117157 736407089 735515594 735680466
2322.2G35680466j162796r74579j471100j052475J99509O6681N14679l64151p05338
$$ 735680466 734517670 733543091 732071991 731019516 731219025 731285706 731800385 731436234 730730896
2330.9G30730896q64029P19833O93665r44138m66537j277008n83267J41601L11203
$$ 730730896 729866867 730586700 731280365 730336227 729869690 728592682 728009415 728151016 728462219
2339.6G28462219M11911M89578R1553o20804N88761l91693r2774J054535J591873J585770
$$ 728462219 728874130 729363708 729455261 728834457 729423218 729031525 728938751 729993286 731585159 733170929
2349.2G33170929l88489j304474j830978j385574m6311j748123r86099r21707k652283
$$ 733170929 732782440 731477966 729646988 728261414 728215103 726466980 725480881 724559174 721906891
2357.9G21906891l113632j928559J510849J995163P48291J511002M65317l91159Q64791
$$ 721906891 718793259 716864700 718375549 720370712 721119003 722630005 723095322 722704163 723568954
2366.6G23568954J80970M30450J412430J022720M47693P88498J588059J034240Q57086
$$ 723568954 723749924 724180374 725592804 726615524 727063217 727851715 729439774 730474014 731331100
2375.3G31331100Q47168Q69599J015854J73034p1792M97131P29141O35376P41349N95855
$$ 731331100 732178268 733047867 734063721 734236755 734164963 734662094 735391235 736026611 736767960 737363815
2384.9G37363815L41263L46832K33460K29111j33820l65906m75006m06113L8758j51444
$$ 737363815 737705078 738051910 738285370 738514481 738380661 738014755 737539749 737133636 737172394 737020950
2394.6G37020950J31150M86374M41589M4556n99823M7225J07956p88650p50198l05787
$$ 737020950 737152100 737638474 738080063 738124619 737524796 737572021 737679977 736891327 736141129 735835342
2404.2G35835342R537o4239N874O38199M40369k19879j23597k95333n04761n68466
$$ 735835342 735844879 735780640 735786514 736424713 736865082 736645203 736521606 736226273 735721512 735153046
2413.8G35153046n66635P6217K51389L25546L96042j51978k13012m4098k44293m40751
$$ 735153046 734586411 734662628 734914017 735239563 735635605 735483627 735270615 735226517 734982224 734541473
2423.5G34541473n25131j15661Q9874l76358j09101J22452j6174K88162L19443O7901
$$ 734541473 734016342 733900681 733990555 733614197 733505096 733627548 733611374 733899536 734218979 734286880
2433.1G34286880n42678o87104k84347q0032j54038l49808J81656L09067P3929j2131
$$ 734286880 733744202 733057098 732772751 732692719 732538681 732188873 732370529 732679596 732753525 732741394
2442.8G32741394J755K15072n12847q56400m05960j84555k51999k21329J80359K71912
$$ 732741394 732743149 732958221 732445374 731588974 731183014 730998459 730746460 730525131 730705490 730977402
2452.4G30977402L67202J44806j88217k80456m74243n02091m02298N7678P1793J37405
$$ 730977402 731344604 731489410 731301193 731020737 730546494 730044403 729642105 729699783 729771576 729908981
2462.1G29908981L58887j15738J2665J85242q927j56326p22885q38165m37241k49405
$$ 729908981 730267868 730152130 730164795 730350037 730341110 730184784 729461899 728623734 728186493 727937088
2471.7G27937088P9498N23682O83594M76150J3657l93753n77088l20587k35214n23224
$$ 727937088 728016586 728540268 729223862 729700012 729713669 729319916 728742828 728422241 728187027 727663803
2481.3G27663803n74341l44925K67792N90363M29840K49481J58386j95923o90765m89731
$$ 727663803 727089462 726744537 727012329 727602692 728032532 728282013 728440399 728244476 727553711 727063980
2491G27063980m68368m79279j50299r8038J11771L45840N21164M98276P3624l71247
$$ 727063980 726595612 726116333 725966034 725867996 725979767 726325607 726846771 727345047 727418671 727047424
2500.6G27047424l17382n35279r13238l65525k82516L7384P45392K56881j68685J30157
$$ 727047424 726730042 726194763 725281525 724916000 724633484 724670868 725416260 725673141 725504456 725634613
2510.3G25634613O92749L3493j092987o50787m71421o34536p0572L77807O44379N91888
$$ 725634613 726327362 726360855 725267868 724617081 724145660 723511124 723440552 723818359 724462738 725054626
2519.9G25054626M01764o4392o84051m28086m39987q75244p03735n9967L38134Q0491
$$ 725054626 725456390 725391998 724707947 724279861 723839874 722964630 722260895 722200928 722539062 722619553
2529.6G22619553M34723O66427J37024k03552j52359L738o19964q27332n00412l01742
$$ 722619553 723054276 723720703 723857727 723654175 723501816 723505554 722885590 722058258 721557846 721256104
2539.2G21256104r6894J19705P69883O17828K71378L7002n27267o68259o77490m15497
$$ 721256104 721159210 721278915 722048798 722666626 722938004 722975006 722447739 721779480 721101990 720686493
2548.9G20686493l21274k34070J28327M41360M42276L72772J41602n73807k70920k79464
$$ 720686493 720365219 720131149 720259476 720700836 721143112 721515884 721657486 721083679 720812759 720533295
2558.5G20533295o53992k46658k03781J71661N01938L68652m5624k90603j41220L8528
$$ 720533295 719879303 719632645 719428864 719600525 720102463 720471115 720425491 720134888 719993668 720032196
2568.1G20032196n4550p31354n95932m30069l24402M53720O13327K18583N2032L29056
$$ 720032196 719977646 719246292 718650360 718220291 717895889 718349609 718962936 719181519 719233551 719562607
2577.8G19562607r8190l91160k54821m99420p62482r54819l6163M91714L94669M65393
$$ 719562607 719464417 719073257 718818436 718319016 717556534 716601715 716565552 717057266 717451935 717917328
2587.4G17917328K2201J75858M67606j39161r83047q69217n81436l16315M17938L92609
$$ 717917328 717939529 718115387 718582993 718443832 717460785 716591568 716010132 715693817 716111755 716504364
2597.1G16504364o6910J17264R13391J30539j032333n36728k88468j48544k46200k33536
$$ 716504364 716437454 716554718 717468109 717598648 716566315 716029587 715741119 715592575 715346375 715112839
2606.7G15112839J35269K79159L77808j62659j62963l510l19672l54232l53775k29416
$$ 715112839 715248108 715527267 715905075 715742416 715579453 715575943 715256271 714902039 714548264 714318848
2616.4G14318848l04795j6937K35367o4316J62125K15072j06201l84140o40564m52881
$$ 714318848 714014053 713997116 714232483 714168167 714330292 714545364 714439163 714055023 713414459 712961578
2626G12961578j18026J61438p3700m14200j00479K89306O59027K52610j01471j42823
$$ 712961578 712843552 713004990 712931290 712517090 712416611 712705917 713364944 713617554 713516083 713373260
2635.6G13373260p83615o04782o21185n16892J52054K10038L73001N0125L4866Q4229
$$ 713373260 712589645 711984863 711363678 710846786 710998840 711208878 711581879 711632004 711666870 711751099
2645.3G11751099k01569k20337o82678o40106l64685L0212J76086P3166N30167K68936
$$ 711751099 711549530 711329193 710646515 710006409 709641724 709671936 709848022 709921188 710451355 710720291
2654.9G10720291p6218j72958n65109q97370o12792r5673k99912Q5297O19812L49121
$$ 710720291 710644073 710471115 709906006 709008636 708395844 708300171 708000259 708085556 708705368 709054489
2664.6G09054489J65405K05002K52533k09274r02863p61184k6627q6975l11050K44369
$$ 709054489 709219894 709424896 709677429 709468155 708565292 707804108 707777481 707690506 707379456 707623825
2674.2G07623825M28772L02811K75650J13144o7826n23071q13827n61600n95780o65741
$$ 707623825 708052597 708355408 708631058 708744202 708676376 708153305 707339478 706777878 706182098 705516357
2683.9G05516357k24762K50626Q31146Q36411M58k27890j14670m08707n74722o16608
$$ 705516357 705291595 705542221 706373367 707209778 707210236 706982346 706867676 706458969 705884247 705267639
2693.5G05267639m60205k6855K65121J84860K69928P96585M26026l83606m82102m71115
$$ 705267639 704807434 704780579 705045700 705230560 705500488 706297073 706723099 706339493 705857391 705386276
2703.1G05386276o23321r38492n73349R6969K29035L99322N69382L52707k38419j45721
$$ 705386276 704762955 703824463 703251114 703348083 703577118 703976440 704545822 704898529 704660110 704514389
2712.8G04514389o3858m86145m69513n41916k67334n3558l59879J99280J140060N82047
$$ 704514389 704450531 703964386 703494873 702952957 702685623 702632065 702272186 702471466 703611526 704193573
2722.4G04193573l12805j29776m53568p41195o83747p37610l12728N0430M33426N38254
$$ 704193573 703880768 703750992 703297424 702556229 701872482 701134872 700822144 700872574 701306000 701844254
2732.1G01844254M53414L41034J5412j79367m00238o97708q73261l93677j06277r5749
$$ 701844254 702297668 702638702 702654114 702474747 702074509 701376801 700503540 700109863 700003586 699907837
2741.7F99907837L25317N33600N98526L19519r9563k96021l27911n25818r44367p16476
$$ 699907837 700233154 700766754 701365280 701684799 701585236 701289215 700961304 700435486 699491119 698774643
2751.4F98774643j11923K80761M86145O53458M08783M3793q4534m64020o21643p08999
$$ 698774643 698662720 698943481 699429626 700083084 700491867 700535660 700451126 699987106 699365463 698656464
2761F98656464p86057n22537j73340N15518J044770N63430J34125J75476m36020p17926
$$ 698656464 697870407 697347870 697174530 697690048 698734818 699298248 699432373 699607849 699171829 698453903
2770.7F98453903k89001l42942r04998o22559L19443L00445L71781M37927L19595K23465
$$ 698453903 698164902 697821960 696916962 696294403 696613846 696914291 697286072 697723999 698043594 698267059
2780.3F98267059m22668o69327r48791n26963j87072o01807M05655J048202O91681
$$ 698267059 697844391 697175064 696226273 695699310 695512238 694910431 695316086 696364288 697055969
2789F97055969N25208N6686l59039n55267q21610o69785l79867k42767Q3923N722L59650
$$ 697055969 697581177 697637863 697278824 696723557 695901947 695232162 694852295 694609528 694693451 694699173 695058823
2799.6F95058823O68182J72577q6212l02735j90429p25174j202088n63736k59781K83738
$$ 695058823 695727005 695899582 695813370 695510635 695320206 694595032 693392944 692829208 692569427 692853165
2809.2F92853165N85403L87421M31900K27508j44043n38711p62177n67550l07465m25415
$$ 692853165 693438568 693825989 694257889 694485397 694341354 693802643 693040466 692472916 692165451 691740036
2818.9F91740036k18506M02451K08282m6997M82864L80707k93579m78058m75006n90973
$$ 691740036 691521530 691923981 692132263 692085266 692568130 692948837 692655258 692177200 691702194 691111221
2828.5F91111221o03714l41644m11224L0975P37686K61460j08872J2055R3765n52292
$$ 691111221 690507507 690165863 689754639 689785614 690523300 690784760 690675888 690687943 690781708 690229416
2838.2F90229416q63876l01819k65045k17896l40424N0660L04260J63879J63269n80215
$$ 690229416 689365540 689063721 688798676 688580780 688240356 688291016 688595276 688759155 688922424 688342209
2847.8F88342209n90820r97696j075135l51944m27093j30386J10549N37873L96728
$$ 688342209 687751389 686753693 685678558 685326614 684899521 684769135 684879684 685417557 685814285
2856.5F85814285K93579O14319J77613j33057q31452p04803N8746k91977m75540K44675
$$ 685814285 686107864 686722183 686899796 686766739 685935287 685230484 685289230 684997253 684521713 684766388
2866.1F84766388L83758J71052M78057R3995j53046l28903n30014p33490j112442m53568
$$ 684766388 685150146 685321198 685799255 685893250 685740204 685411301 684881287 684147797 683035355 682581787
2875.8F82581787P8964O31867P36999K09503j63574n28793m9362P2479m17404q64182
$$ 682581787 682660751 683292618 684029617 684239120 684075546 683546753 683497391 683569870 683152466 682288284
2885.4F82288284o21566Q6593J66321J0452J44577M48456j48163j90353j09101n02471
$$ 682288284 681666718 681753311 681919632 681930084 682074661 682523117 682374954 682184601 682075500 681573029
2895.1F81573029l28141p74307q65021m42962N07660N59616j15509L37524q3008j21994
$$ 681573029 681244888 680470581 679605560 679162598 679670258 680229874 680114365 680451889 680368881 680246887
2904.7F80246887M4403m12903q01849q55408j43432j49079K060J21994L78189L76740
$$ 680246887 680291290 679878387 679076538 678221130 678077698 677928619 677930679 678052673 678430862 678807602
2914.3F78807602p79724o31714m95606q37173p28912o87485r0714M94996J04141p0572
$$ 678807602 678027878 677396164 676900558 676063385 675334473 674646988 674556274 675051270 675155411 675084839
2924F75084839N52597o5384l86200P9804l32489r4224j2054l10287O3400J81274L20587
$$ 675084839 675637436 675572052 675185852 675265656 674933167 674838943 674826889 674516602 674580002 674761276 675081863
2934.6F75081863N05524K18506P9422M7302R2011j32599o45218L6087M64935K2888
$$ 675081863 675587387 675805893 675885315 675932617 676024628 675892029 675246811 675282898 675747833 675770721
2944.2F75770721O21567Q83942j09635o56433j66168K01721j38626o40640q39539k73590
$$ 675770721 676392288 677276230 677166595 676510162 676343994 676545715 676407089 675766449 674926910 674653320
2953.9F74653320L01285O8359J73569N74112J84479m7989J37405l05175p47681l34854
$$ 674653320 674954605 675022964 675196533 675770645 675955124 675907135 676044540 675739365 674991684 674656830
2963.5F74656830j96686l75214L27912P86285J56555l29284L39813O02951k55203m23432
$$ 674656830 674460144 674084930 674412842 675199127 675355682 675026398 675366211 675969162 675713959 675290527
2973.2F75290527k63824p4387j13449j66244M07104K82288J0223k7771M2496l11356
$$ 675290527 675026703 674952316 674838867 674672623 675079727 675362015 675372238 675344467 675386963 675075607
2982.8F75075607q87909J86539N61981k34756j01319k28500k43835M01840L58200L27606
$$ 675075607 674187698 674374237 674936218 674701462 674600143 674371643 674127808 674529648 674887848 675215454
2992.5F75215454L47824m90494n27343k04239p36313p58667o3171M82940L45841J87454
$$ 675215454 675563278 675072784 674545441 674341202 673604889 672846222 672783051 673265991 673611832 673799286
3002.1F73799286J75323j74484r2621J78833l58658r48333n96924q2550P324K83051
$$ 673799286 673974609 673800125 673707504 673886337 673527679 672579346 671982422 671899872 671907196 672190247
3011.7F72190247O95190L46069j17645o5918l01895k82669j86615p37991r23386p4768
$$ 672190247 672885437 673231506 673113861 673047943 672746048 672463379 672276764 671538773 670615387 670540619
3021.4F70540619N69839J86921K14309J08185m10080J45874J22681p56455p26318m65317
$$ 670540619 671110458 671297379 671511688 671619873 671209793 671355667 671478348 670721893 669995575 669530258
3031F69530258n23681j77384N02319M16489j80511K62527M63715k57340m09698n19257
$$ 669530258 669006577 668829193 669331512 669748001 669567490 669830017 670293732 670036392 669626694 669107437
3040.7F69107437m49524j70746n92651l82309M11911J70059j74865O7901O2180k76871
$$ 669107437 668657913 668487167 667894516 667512207 667924118 668094177 667919312 667987213 668049393 667772522
3050.3F67772522o21872k36435k27890o69403J42059K25373m93012k4719M69589r6435
$$ 667772522 667150650 666914215 666686325 666016922 666158981 666384354 665891342 665866623 666336212 666239777
3060F66239777l24860K9297n43900r32007o24008R0790J23673l30887M48608N83496
$$ 666239777 665914917 665944214 665400314 664468307 663844299 663935089 664058762 663727875 664176483 664759979
3069.6F64759979K09885l44010q91571n02014m68139j99128p4081m10919r0790L92532
$$ 664759979 664969864 664625854 663734283 663232269 662764130 662565002 662490921 662080002 661989212 662381744
3079.2F62381744M57306M30832R9259o67267q70362p28607j89285k28729o48957j71127
$$ 662381744 662839050 663269882 663369141 662701874 661831512 661102905 660913620 660684891 660035934 659864807
3088.9F59864807L89786O96945K7161l01895n22995n54581K04468m95301o58340j70670
$$ 659864807 660254593 660951538 660978699 660676804 660153809 659599228 659803696 659308395 658650055 658479385
3098.5F58479385J4344q7967n73731m5929L79410O46973M43725k50930o64216p84301
$$ 658479385 658493729 658405762 657832031 657786102 658165512 658812485 659256210 659005280 658341064 657556763
3108.2F57556763p19452p86820l9978L21808J05820k670n07889m78745L00446K55356
$$ 657556763 656837311 656050491 656010513 656332321 656438141 656435471 655927582 655448837 655749283 656004639
3117.8F56004639p87430p11823o05392n93338J74026N1499L8833K47803Q0872j02234
$$ 656004639 655217209 654505386 653899994 653306656 653480682 653532181 653571014 653818817 653899689 653797455
3127.5F53797455j37482k14996p01599r22089n26733j73874l12729J91421P38678K26975
$$ 653797455 653659973 653444977 652743378 651821289 651294556 651120682 650807953 650999374 651738052 651965027
3137.1F51965027l54767l64075m22668n52597k38190o51245q55713o83136k48566Q79288
$$ 651965027 651610260 651246185 650823517 650270920 650032730 649381485 648525772 647842636 647594070 648473358
3146.8F48473358N30014L38593L92532p44247j135865o89926p49283q25576n6916K46353
$$ 648473358 649003372 649341965 649734497 648990250 647854385 647164459 646415176 645589600 645532684 645779037
3156.4F45779037L76740J78757l97034j79749j6174r4070p48368j070633o69784j73035
$$ 645779037 646155777 646334534 645937500 645757751 645741577 645647507 644899139 643828506 643158722 642985687
3166F42985687J01319k88468Q7433L45306j26419P2785l05329j346054q42895m40445
$$ 642985687 643087006 642798538 642885971 643231277 643104858 643177643 642872314 641526260 640683365 640242920
3175.7F40242920n87006M8905l58429j64337M54902p400k50321l94211l35044o45943
$$ 640242920 639655914 639704819 639346390 639182053 639636955 639629555 639379234 638985023 638649979 638004036
3185.3F38004036p32803o80848m01763Q6212k63214O904K98157q0338m73480l58429
$$ 638004036 637271233 636590385 636188622 636274834 636011620 636018524 636316681 636236343 635762863 635404434
3195F35404434l30009m13475n79644j063919j85318r8495n21431j68037J05819J91307
$$ 635404434 635074425 634660950 634081306 633017387 632832069 632733574 632212143 632044106 632149925 632341232
3204.6F32341232l99627k15569m07333p05033q69178n80330K71301o60019l95660N1193
$$ 632341232 631941605 631726036 631318703 630613670 629744492 629164162 629435463 628775444 628379784 628430977
3214.3F28430977j62544K94647l5515n29976j007080n16739m96139r27697l69835R5788
$$ 628430977 628268433 628563080 628527565 627997589 626990509 626473770 625977631 625049934 624680099 624775887
3223.9F24775887P1182q9646L94097j36757p10335o76308p99293l25089o97212r25789
$$ 624775887 624847069 624757423 625151520 625014763 624304428 623628120 622828827 622503738 621806526 620880737
3233.5F20880737J2131P59773J85471n47371k35672j89514n64575o69670n90745n07049
$$ 620880737 620892868 621652641 621838112 621290741 621055069 620865555 620300980 619631310 619040565 618533516
3243.2F18533516j36681o37588n31044O37474M44679M1771k36969m35028j182976j311531
$$ 618533516 618396835 617759247 617228203 617865677 618310356 618352127 618115158 617680130 616497154 615185623
3252.8F15185623j18103o8664k52686k75955K07062M69169j8539J23443k23579q43239
$$ 615185623 615067520 614998856 614746170 614470215 614677277 615146446 615127907 615251350 615027771 614184532
3262.5F14184532n64117m16413j253509p99256J87035q6365j59301J14708M80880J35803
$$ 614184532 613620415 613204002 611950493 611151237 611338272 611251907 611092606 611207314 611688194 611823997
3272.1F11823997j09062n78956q87490n13382j293563n86167J54534p97501m44489
$$ 611823997 611714935 611135979 610248489 609735107 608441544 607855377 608009911 607212410 606767921
3280.8F06767921P60308P16171j42174q1711p48405j408577k39410k9793o90766l19633
$$ 606767921 607528229 608244400 608102226 608020515 607272110 605863533 605624123 605594330 604903564 604583931
3290.4F04583931p9384m0474M37355K34184p62m89846j350670j039505l24287j95351
$$ 604583931 604504547 604464073 604901428 605135612 605134850 604645004 603294334 602254829 601930542 601735191
3300.1F01735191n73387l91273j02387l37715m67377o00357p5035L35732n52254j301384
$$ 601735191 601161804 600770531 600668144 600330429 599863052 599262695 599187660 599523392 598971138 597669754
3309.7E97669754p37114l29933l57590j39274o3439j93176l36151r1477n30090j178131
$$ 597669754 596932640 596602707 596245117 596105843 596042404 595849228 595513077 595421600 594891510 593713379
3319.4E93713379j077232n96390k30484p88307n62935O9160J25084r6283l45154k20642
$$ 593713379 592636147 592039757 591809273 591020966 590458031 590527191 590652275 590555992 590210838 589990196
3329E89990196m73327n31655j020889j157265p30591p24983l10516n29633n02128j5374
$$ 589990196 589516869 588985214 587964325 586807060 586076469 585351486 585040970 584511337 584009209 583993835
3338.7E83993835K4529l18031o09627m59786q38127j490783j262589k18239m52118
$$ 583993835 584018364 583700333 583090706 582630920 581792793 580302010 579039421 578821182 578369064
3347.3E78369064n79528j1101j28517k35482r26971o85730o86531p78809l24936r44519
$$ 578369064 577789536 577778435 577649918 577414436 576487465 575801735 575115204 574336395 574011459 573066940
3357E73066940m45862j60331m7951k23808j086121q07037n39246k30217n90019r22775
$$ 573066940 572621078 572460747 572412796 572188988 571102867 570295830 569756584 569526367 568936348 568013573
3366.6E68013573p06024p73659j99013P7477p50123j092414k03629l53126o61431m20685
$$ 568013573 567307549 566533890 566334877 566412354 565662231 564569817 564366188 564013062 563351631 562930946
3376.3E62930946r14993j058044r88083n46799J03111J89476o8092j61171n09911r74044
$$ 562930946 562015953 560957909 559969826 559423027 559526138 559715614 559647522 559486351 558976440 558002396
3385.9E58002396p64313n54733m08173j035461p88613R1362q32748q34694j5755J93291
$$ 558002396 557238083 556683350 556275177 555239716 554451103 554542465 553709717 552875023 552859268 553052559
3395.6E53052559K04506m11110r57222r36852o99424l25356p4768k70309k38228j77155
$$ 553052559 553257065 552845955 551888733 550951881 550252457 549927101 549852333 549582024 549343796 549166641
3405.2E49166641l55453m84391l22723K22740L4333p31392j109581j210823n71633
$$ 549166641 548811188 548326797 548004074 548226814 548261147 547529755 546420174 545209351 544637718
3413.9E44637718N58586r2621q40148k82479K53983N44395q89740j107979l82309n93528
$$ 544637718 545196304 545103683 544263535 543981056 544235039 544779434 543889694 542781715 542399406 541805878
3423.5E41805878j07346m78096L17612Q54263m82597k24800L32069l49731k05193J22604
$$ 541805878 541698532 541220436 541538048 542392311 541909714 541684914 542016983 541667252 541462059 541584663
3433.2E41584663j302681j134796j02424j30883r0446K8992K86445P2251M02145o88934
$$ 541584663 540281982 539147186 539044762 538913879 538823433 538852425 539138870 539211121 539613266 538924332
3442.8E38924332j179695J58424O28052N22575j637001k59705J239586k02827O8741
$$ 538924332 537744637 537903061 538531113 539053688 537416687 537156982 538396568 538193741 538262482
3451.5E38262482J98593K46162l99513o72417K00386K20375L4790j37863L5858M17557
$$ 538262482 538461075 538707237 538307724 537635307 537835693 538056068 538090858 537952995 537988853 538406410
3461.1E38406410R48868j39999n26734L97988J48849Q2131n34821m00047L28712L66707
$$ 538406410 539355278 539215279 538688545 539086533 539235382 539317513 538782692 538382645 538711357 539078064
3470.8E39078064l0556K8534P26776p5531m41894L63426K12173m34303N3749L11051
$$ 539078064 539047508 539076042 539802818 539727287 539285393 539648819 539860992 539426689 539480438 539791489
3480.4E39791489L90243M27551l75175P94373L00331k32506J140175J03531r20678
$$ 539791489 540181732 540609283 540234108 541028481 541328812 541096306 542236481 542340012 541419334
3489.1E41419334k58827P72133K78015K14195N49775j10932L33367J35307N3024J80664
$$ 541419334 541160507 541932640 542210655 542424850 542974625 542863693 543197060 543332367 543385391 543566055
3498.7E43566055L12729J47400K05116Q36411n52673n01976O88972Q08487Q25157J277084
$$ 543566055 543878784 544026184 544231300 545067711 544515038 544013062 544702034 545510521 546335678 547612762
3508.4E47612762O562j370621K29721j9607K58407R41086M32930j22452j95694R24492
$$ 547612762 547619324 546248703 546478424 546458817 546717224 547658310 548091240 547968788 547773094 548697586
3518E48697586P53784L92418L38631J371193M78096j953964J05209R15604N67359k19459
$$ 548697586 549451370 549843788 550182419 551553612 552031708 550077744 550182953 551098557 551665916 551446457
3527.7E51446457l23525N09377J147919J101875j32599K84691k48947N43289M05846
$$ 551446457 551122932 551632309 552780228 553882103 553749504 554034195 553785248 554328537 554734383
3536.4E54734383j104050Q12492P44019L85971L93677R18464P82204J013870P83463
$$ 554734383 553630333 554442825 555186844 555572815 555966492 556884956 557667160 558681030 559464493
3545E59464493j617165j35422o36863J162491J497421M99000J862069j660729k00882
$$ 559464493 557847328 557711906 557075043 558237534 559734955 560233955 562096024 560435295 560234413
3553.7E60234413O05049P61223K203331k31209L10440K71111j41945p91512R73778
$$ 560234413 560839462 561600685 563804016 563572807 563883247 564154358 564012413 563220901 564194679
3562.4E64194679J565628l23486L208733r20182j943245j33628k803612K816314J693001
$$ 564194679 565760307 565436821 568645554 567725372 565782127 565648499 562844887 565661201 567354202
3571.1E67354202Q67043J526336Q39921J63536l97950Q78106m10042J108169Q38051
$$ 567354202 568221245 569747581 570587502 570751038 570353088 571231194 570821152 571929321 572767372
3579.7E72767372p98607P18727O50292N25398K72980L790817R99947l911438J733780
$$ 572767372 571968765 572687492 573337784 573863182 574136162 577926979 578926926 575015488 576749268
3588.4E76749268k156105O76116J887589J388779J6899q92678L172188j923752Q92449
$$ 576749268 574593163 575269279 577156868 578545647 578562546 577669868 580842056 578918304 579810753
3597.1E79810753L103866j331291J111679p19490o02836P50427K3689O44303K467918
$$ 579810753 582914619 581583328 582695007 581975517 581372681 582123108 582146797 582791100 585259018
3605.8E85259018K745781k753296K088585j133652l293190O709442J195870m343491
$$ 585259018 588004799 585251503 587340088 586206436 582913246 589622688 590818558 586475067
3613.5E86475067J908798k044029K156296L762207n59807J538353j903191k269935
$$ 586475067 588383865 586339836 588496132 592258339 591698532 593236885 591333694 589063759
3621.2E89063759J573410J242370J017609J359863L74909J12648N840225K324715j4141922
$$ 589063759 590637169 591879539 592897148 594257011 594631920 594744568 600584793 602909508 588767586
3629.9E88767586J510963L935509M746933J290398l823662O5956J558800P45964n43824
$$ 588767586 590278549 594214058 598960991 600251389 596427727 596493683 598052483 598798447 598254623
3638.6E98254623J198464J513557J176873L34739r81025Q22181K119408N813980j723099
$$ 598254623 599453087 600966644 602143517 602478256 601497231 602319412 604438820 610252800 608529701
3647.3F08529701q023948N200882J320953m027138m037590L089981L217697K727967
$$ 608529701 600505753 605706635 607027588 603000450 598962860 602052841 605270538 607998505
3655F07998505N215492q333130j550674L959655L10974O86913K46963L06016l69950
$$ 607998505 613213997 604880867 603330193 607289848 607600822 608287735 608534698 608840714 608470764
3663.6F08470764J054840Q06351j108818K269325R21402k009048Q04176n977669o87141
$$ 608470764 609525604 610331955 609223137 611492462 612413864 610404816 611208992 605231323 604544182
3672.3F04544182O597557Q947678N067329j5514526m320412M514961L822594j952057
$$ 604544182 611141739 620089417 625156746 609642220 605321808 609836769 613659363 611707306
3680F11707306j489258J040192P56149O57730l32603m58641K829513O002541n168801
$$ 611707306 610218048 611258240 612014389 612672119 612339516 611880875 614710388 620712929 615544128
3688.7F15544128o152572O884270l378525l563042L332024l4752N58471N52445K16675
$$ 615544128 609391556 616275826 612897301 609334259 612666283 612631531 613190002 613742447 613959122
3697.4F13959122Q04481m66003J658745L061981l668938m350853K614594R44023p77016
$$ 613959122 614763603 614297600 615956345 619018326 615349388 610998535 613613129 614557152 613780136
3706.1F13780136l23067J989098M458122p179870J997871O973610j1674385J289406
$$ 613780136 613457069 615446167 619904289 612724419 614722290 621695900 610021515 611310921
3713.8F11310921L919716L51142o77566J117058J298218l327561j55105N016098j736298
$$ 611310921 615230637 615581779 614904213 616021271 617319489 613991928 613836823 618852921 617116623
3722.5F17116623n824852L327827R30825j108628k621345j172714L494339Q39614M824563
$$ 617116623 611291771 614619598 615550423 614441795 611820450 610647736 614142075 614981689 619806252
3731.2F19806252o38810r347076O603699K462310q841018j47095K043800o44645J545562
$$ 619806252 619167442 609820366 616424065 618886375 610045357 609898262 611942062 611297417 612842979
3739.8F12842979L211556l697968J016770J1462364k279892k0997429N951386M582634
$$ 612842979 616054535 612356567 613373337 624835701 622555809 601558380 607509766 612092400
3747.5F12092400O365661J225128j2010879Q888435o64558r306793L230705L406448
$$ 612092400 618458061 619683189 607672310 616560745 615896187 606589394 609820099 613226547
3755.3F13226547L669586m272193l6965N399513n107841l413277K819901J314125j48011
$$ 613226547 616896133 612623940 612586975 617986488 612878647 609465370 612285271 613599396 613451385
3763.9F13451385L447953n49774n186615J022911L975715J833115p825317o25992K746811
$$ 613451385 616899338 616349564 611162949 612185860 616161575 617994690 610169373 609543381 612290192
3772.6F12290192Q73222R33647p74956K63291m2038J614418J739921o140594N52368
$$ 612290192 613163414 614097061 613322105 613585396 613543358 615157776 616897697 610757103 611309471
3781.3F11309471J282730o58378J587562j700325o22101J531067J015053M59251j010437
$$ 611309471 612592201 611933823 613521385 611821060 611198959 612730026 613745079 614204330 613193893
3790F13193893J28479k68096m90494n42641R49783L674164l255272n172500P80220
$$ 613193893 613322372 613054276 612563782 612021141 612970924 616645088 613389816 608217316 608997536
3798.7F08997536L010406N943489k300796r980011Q91418R00307K706184N899086o498031
$$ 608997536 612007942 617951431 615650635 605670624 606562042 607462349 610168533 616067619 609569588
3807.3F09569588n451546M823837K478752n99556O9733m3678j26763N179787J885872
$$ 609569588 604118042 608941879 611420631 610821075 610890808 610847130 610720367 615900154 617786026
3816F17786026j4342308J453209M362564L793526L016929j2172279p13196M270630
$$ 617786026 603443718 604896927 609259491 613053017 616069946 603897667 603184471 607455101
3823.7F07455101K036705K272759M98733m642487o68907O81572K137833L625679p106934
$$ 607455101 609491806 611764565 612263298 607620811 606951904 607633476 609771309 613396988 606290054
3832.4F06290054l2043O699447m056892l057899P785949m299392p438279O492501m509964
$$ 606290054 606258011 612957458 608900566 605842667 613628616 609329224 601890945 608383446 603873482
3841.1F03873482j044846P477913j56326m571648P60613J055488j022949J203804m15993
$$ 603873482 602828636 610306549 610150223 605578575 606339188 607394676 606371727 607575531 607159538
3849.8F07159538M87862M916916l694153M615707j0318908n414772Q362159M04778
$$ 607159538 607647400 612564316 608870163 613485870 603166962 597752190 606114349 606519127
3857.5F06519127k850876J676521K218323K061386m979400j391755O657563m042816
$$ 606519127 603668251 605344772 607563095 609624481 604645081 603253326 609910889 605868073
3865.2F05868073n585251K944336L454971P038917l407859j0540352J029815M680596
$$ 605868073 600282822 603227158 606682129 613721046 610313187 599772835 600802650 605483246
3872.9F05483246M819565q369484j170006L905449M71535Q37707L939438l192101q945007
$$ 605483246 610302811 601933327 600763321 604668770 605140305 605978012 609917450 606725349 597780342
3881.6E97780342M765205J533661N86205O618957r135894k055474K665978N98640L493080
$$ 597780342 602545547 604079208 604665413 611284370 602148476 600093002 602758980 603357620 606850700
3890.3F06850700P53403o670113q3847L102570j383629j48353M11491K173462K944031
$$ 606850700 607604103 600933990 600850143 603952713 602569084 602420731 602832222 605005684 607949715
3898.9F07949715r122887K434464L169822m570045M777641j414947l537522M91600
$$ 607949715 598826828 601261292 604431114 599861069 604638710 603223763 599686241 600177841
3906.7F00177841M38576J667061j85814M3945K73133n03884k4299j19400Q89320J363945
$$ 600177841 600616417 602283478 602097664 602141609 602414742 601910858 601886559 601767159 602656479 604020424
3916.3F04020424l124580l475419L861657J368370m206429J327171J895638P67632
$$ 604020424 600895844 597420425 601282082 602650452 598444023 599771194 601666832 602434464
3924F02434464j669808l552132J064797J677017J254616q62999r71336J378326k682533
$$ 602434464 600764656 597212524 598277321 599954338 601208954 600345955 599374619 600752945 598070412
3932.7E98070412r37844K136460J47819J45073K61231o09932n47982n91201J493835
$$ 598070412 597132568 599269028 599416847 599561920 599823151 599213219 598665237 598074036 599567871
3941.4E99567871J992111l555565r78012J236611N16510J874923j852569m84772L62702
$$ 599567871 601559982 598004417 597026405 598263016 598779526 600654449 598801880 598317108 598679810
3950.1E98679810k395211J209603N80825m13246N66292N9929k30942j011162K82975
$$ 598679810 596284599 597494202 598075027 597661781 598228073 598288002 598057060 597045898 597328873
3958.7E97328873m7036m90303M61083j001473j3237Q03452l51944J33438m7645J63192
$$ 597328873 597281837 596791534 597252617 596251144 596237907 597041359 596689415 596822853 596775208 596938400
3968.4E96938400j27487r05571N49049J17264q36105l69911K19383N05028l47481j58196
$$ 596938400 596810913 595905342 596454391 596571655 595735550 595365639 595585022 596090050 595742569 595584373
3978E95584373l1890j94779j259K2545J31188J02272j23024j190338l95089R04999
$$ 595584373 595552483 595357704 595356445 595378990 595510178 595612450 595489426 594299088 593903999 594808998
3987.7E94808998L98026O1378l88260k97584m22974q12149k68784K93351L39203K41546
$$ 594808998 595207024 595268402 594880142 594582558 594159584 593347435 593078651 593372002 593711205 593952751
3997.3E93952751L03536J83601j47896
$$ 593952751 594256287 594439888 594291992
4000.2E94291992
$$ 594291992
##END=$$ End of the data block
