##TITLE=$$ Begin of the data block
##JCAMP-DX=5.00 $$ ACD/SpecManager v 10.08
##SPECTROMETER/DATA SYSTEM=Varian
##DATE=04 Dec 2012 14:52:30
##DATA TYPE=INFRARED SPECTRUM
##DATA CLASS=XYDATA
##ORIGIN=
##OWNER=
##NPOINTS=3735
##FIRSTX=399.26403809
##LASTX=4000.35498047
##MAXX=4000.35498047
##MINX=399.26403809
##MAXY=70.04226685
##MINY=32.33251190
##XFACTOR=1.0000000000
##YFACTOR=0.000000100000000
##FIRSTY=67.78849792
##DELTAX=0.96440572
##XUNITS=1/CM
##YUNITS=TRANSMITTANCE
##XYDATA=(X++(Y..Y))
$$ plain form
399.3 677884979 687304993 669420547 686730499 678505325 673426361 656693649 651689301 662186813
407 662186813 660970306 673430862 661982803 659845963 660320511 668201294 671836853 663413162 662587357
415.7 662587357 651177673 656588211 641948318 648606186 661018982 660041428 663246384 652676315
423.4 652676315 664561539 665858154 664700928 658874512 656368179 661110840 657825928 662898407
431.1 662898407 657609863 660793076 659998093 660355606 663892670 661601944 666587753 661226273 664457703
439.8 664457703 660408554 655889893 655951691 662040863 672622147 663673706 663999329 662767639 670692215
448.4 670692215 672979050 666919632 667774429 658416901 661966782 664751511 667660980 665114288 663834381
457.1 663834381 670471191 668279572 669958572 663899078 668764343 664006424 661252594 660912704 657851334
$$ packed form
399.3F77884979R420014j7884446J7309952q225174n078964j6732712n004348J0497512
407F62186813j216507J2460556j1448059k136840M74548P880783L635559q423691q25805
415.7F62587357j1409684N410538j4639893O657868J2412796r77554L204956j0570069
423.4F52676315J1885224J296615j157226n826416k506333M742661l284912N072479
431.1F62898407n288544L183213p94983L57513L537064k290726M985809n361480L231430
439.8F64457703m049149m518661O1798O089172J0581284q948441L25623j231690P924576
448.4F70692215K286835o059418Q54797r357528L549881K784729K909469k546692j279907
457.1F63834381O636810k191619J679000o059494M865265m757919k753830l39890l061370
$$ plain form
465.8 657851334 669121170 670024567 670646973 663084717 662174835 660110474 650997620 658496475 659169006
474.5 659169006 663993454 662120972 666589966 666464920 662128525 661406250 658301010 665560074 663248291
483.2 663248291 662937088 657800903 657392273 660876694 656365356 659545746 661172867 667024002 662826767
491.8 662826767 660617676 659802856 656310120 657064438 652047501 658021698 660118332 664458847 666881256
500.5 666881256 664938278 664907455 659877243 664005585 658834763 657390213 658549500 658257065 658457565
509.2 658457565 655970688 661601486 659140549 659963837 658527603 656460037 657237091 655482712 659552460
517.9 659552460 655532532 656857681 658213959 659182510 659101257 657406387 659438553 655032654 654718094
526.6 654718094 653262329 653851013 654228210 653640747 657151108 659390182 663050385 660939941 660537949
$$ packed form
465.8F57851334J1269836R03397O22406p562256r09882k064361r112854P498855O72531
474.5F59169006M824448j872482M468994j25046m336395p22275l105240P259064k311783
483.2F63248291l11203n136185m08630L484421m511338L180390J627121N851135m197235
491.8F62826767k209091q14820l492736P54318n016937N974197K096634M340515K422409
500.5F66881256j942978l0823n030212M128342n170822j444550J159287k92435K00500
509.2F58457565k486877N630798k460937Q23288j436234k067566P77054j754379M069748
517.9F59552460m019928J325149J356278R68551q1253j694870K032166m405899l14560
526.6F54718094j455765N88684L77197n87463L510361K239074L660203k110444m01992
$$ plain form
535.2 660537949 659313278 656813431 656076660 657045975 659242325 657261734 662882843 663495407 663082275
543.9 663082275 665612564 663526840 664322968 661831894 660789108 658459396 659748001 659645691 657468338
552.6 657468338 661119385 661927032 663286209 661093292 661663589 661486053 659133987 658870621 656052628
561.3 656052628 656163254 653929138 654808197 655092850 654524002 656448517 657523193 659206009 654989090
570 654989090 652746658 649521103 648644485 649782410 648959885 651297531 652561111 655573425 655160065
578.6 655160065 654765930 653069077 651289368 653538971 652650681 653721008 653294373 653914490 654959717
587.3 654959717 658073425 661146393 659094849 660079193 658843994 658426590 657152786 656550827 657624054
596 657624054 656626282 657969360 658542099 660015869 658398590 658583145 660019455 659400940 659875259
$$ packed form
535.2F60537949j224671k499847p36771R69315K196350j980591N621109O12564m13132
543.9F63082275K530289k085724P96128k491074j042786k329712J288605j02310k177353
552.6F57468338L651047Q07647J359177k192917N70297j77536k352066k63366k817993
561.3F56052628J10626k234116Q79059K84653n68848J924515J074676J682816m216919
570F54989090k242432l225555q76618J137925q22525K337646J263580L012314m13360
578.6F55160065l94135j696853j779709K249603q88290J070327m26635O20117J045227
587.3F54959717L113708L072968k051544R84344j235199m17404j273804o01959J073227
596F57624054r97772J343078N72739J473770j617279J84555J436310o18515M74319
$$ plain form
604.7 659875259 657811203 656869888 654407806 654700775 656643524 657637100 658444443 657284012 658047409
613.4 658047409 657380219 658174210 657400208 656779327 657294998 657682190 660490112 660849686 663007202
622 663007202 662928085 663943481 665430756 664162903 664632645 662715683 663791122 663579330 663840637
630.7 663840637 665679703 666996002 669591980 669214325 669809723 668248901 667272720 667132874 667321625
639.4 667321625 667690582 666604919 668163452 668025131 668914871 668284454 669315109 671618271 670678329
648.1 670678329 672269135 671084671 669970474 668742218 669082260 669942474 669987411 671956711 671367111
656.8 671367111 672105789 670969543 670482559 670860291 670396347 670614319 669799423 670346222 669440002 671426392
666.4 671426392 671587372 668412094 673267746 672072678 672827530 673366852 673930359 672040405 671053009
$$ packed form
604.7F59875259k064056r41315k462082K92969J942749R93576Q07343j160431P63397
613.4F58047409o67190P93991p74002o20881N15671L87192K807922L59574K157516
622F63007202p9117J015396J487275j267853M69742j916962J075439k11792K61307
630.7F63840637J839066J316299K595978l77655N95398j560822r76181j39846J88751
639.4F67321625L68957j085663J558533j38321Q89740o30417J030655K303162r39942
648.1F70678329J590806j184464j114197j228256L40042Q60214M4937J969300n89600
656.8F71367111P38678j136246m86984L77732m63944K17972q14896N46799r06220J986390
666.4F71426392J60980l175278M855652j195068P54852N39322N63507j889954r87396
$$ plain form
675.1 671053009 671894455 671878510 673858948 673793716 674933777 674565659 674575729 675106812 674200821 674258041
684.7 674258041 672857132 674363174 675239792 674971237 673938370 674104233 675389252 673937149 673921509
693.4 673921509 673841705 674706345 673468094 672224350 673078766 672712555 672412796 671480865 672622299
702.1 672622299 671467438 670022125 669479675 668472595 668462982 666491547 666342926 666834106 668298187
710.8 668298187 668808746 669261322 670705566 669856720 670178223 669905777 671265640 672292252 673532181
719.5 673532181 675058441 674102707 674675293 674362411 675468750 675768814 676138611 677581940 678363113
728.1 678363113 679092178 678856277 681355743 681191177 680386505 680235138 679941788 680548553 680244827 681629639
737.8 681629639 680212402 680332108 681467209 682074661 681661682 679384918 680885391 680266342 679903412
$$ packed form
675.1F71053009Q41446j5945J980438o5232J140061l68118J0070N31083r05991N7220
684.7F74258041j400909J506042Q76618k68555j032867J65863J285019j452103j5640
693.4F73921509p9804Q64640j238251j243744Q54416l66211k99759r31931J141434
702.1F72622299j154861j445313n42450j007080r613j971435j48621M91180J464081
710.8F68298187N10559M52576J444244q48846L21503k72446J359863J026612J239929
719.5F73532181J526260r55734N72586l12882J106339L00064L69797J443329P81173
728.1F78363113P29065k35901K499466j64566q04672j51367k93350O06765l03726J384812
737.8F81629639j417237J19706J135101O07452m12979k276764J500473o19049l62930
$$ plain form
746.5 679903412 678641663 676919327 676630096 677048798 679387512 676829910 676123199 675297775 673631973
755.1 673631973 673759079 671820526 671004715 670291977 672324982 672849808 671664886 671531830 671341705
763.8 671341705 672122192 671858215 672413483 672480850 673572311 674022217 674633636 675312500 674395370 676385956
773.5 676385956 677022858 678156128 679005890 679433365 680107117 679865723 680958710 680578308 682309647
782.1 682309647 683454361 683915100 684578400 685014420 686659164 686167145 687159576 687315140 687673111
790.8 687673111 687767029 687089691 688188324 688346329 689625092 690461731 691784668 692314072 692923279
799.5 692923279 693408661 693454056 694958267 694469376 695458984 694838562 695000000 695785599 695277481 697026367
809.1 697026367 697628174 699150467 698758774 699015961 698980331 698103790 698495102 697388840 698664169
$$ packed form
746.5F79903412j261749j722336k89231M18702K338714k557602p06711q25424j665802
755.1F73631973J27106j938553q15811p12738K033005N24826j184922j33056j90125
763.8F71341705P80487k63977N55268O7367J091461M49906O11419O78864r17130J990586
773.5F76385956O36902J133270Q49762M27475O73752k41394J092987l80402J731339
782.1F82309647J144714M60739O63300M36020J644744m92019R92431J55564L57971
790.8F87673111R3918o77338J098633J58005J278763Q36639J322937N29404O09207
799.5F92923279M85382M5395J504211m88891R89608o20422J61438P85599n08118J748886
809.1F97026367O01807J522293l91693K57187l5630q76541L91312j106262J275329
$$ plain form
817.8 698664169 698180771 698983307 699601212 699012680 700422668 700304642 700254745 698331985 698171616 696929626
827.5 696929626 695056763 695097961 694560776 694769974 693397369 693881302 692877960 691683273 691066818
836.1 691066818 688794632 687566452 685518875 685187988 684320908 684168320 684366684 685209656 686066971
844.8 686066971 684443436 685032196 684513779 684231339 682760620 681509247 682144623 682067719 683607712
853.5 683607712 683658600 684349594 684101181 684565277 685411530 684193573 684271545 683476257 683796005 683223953
863.1 683223953 683930588 686206665 687730713 689063644 689240723 691224365 691641006 691669693 691380844
871.8 691380844 691504898 692375793 692610779 694671249 695585327 697152786 697035828 697123260 698041763 696826401
881.5 696826401 695331497 692419586 691591034 690073318 689807663 690671844 690087891 690185165 689754105
$$ packed form
817.8F98664169m83398Q02536O17905n88532J409988j18026m9897j922760j60369j241990
827.5F96929626j872863M1198n37185K09198j372605M83933j003342j194687o16455
836.1F91066818k272186j228180k047577l30887q67080j52588J98364Q42972Q57315
844.8F86066971j623535N88760n18417k82440j470719j251373O35376p6904J539993
853.5F83607712N0888O90994k48413M64096Q46253j217957P7972p95288L19748n72052
863.1F83223953P06635K276077J524048J332931J77079J983642M16641K8687k88849
871.8F91380844J24054Q70895K34986K060470R14078J567459j16958Q7432R18503j215362
881.5F96826401j494904k911911q28552j517716k65655Q64181n83953R7274m31060
$$ plain form
890.2 689754105 689923477 687718735 686202316 684839783 683630753 683183670 680853348 680837708 681387177
898.8 681387177 682648468 682320786 682318878 683695984 682132034 680078201 677338104 675955124 674852371
907.5 674852371 674259949 673393936 672773819 674636688 675081635 674633255 672789078 671548233 670148926
916.2 670148926 668138885 666418839 664344711 663797684 663031998 663911362 664494324 665186768 665785065
924.9 665785065 664295578 663546371 661861496 660709305 659505234 659174194 659256897 659785309 661820526
933.6 661820526 662574158 664286194 664909515 665062866 664627151 663571014 663297119 662517471 663211746
942.2 663211746 663419876 665204468 668164291 670764313 672207947 671443787 671017609 669662170 668804626
950.9 668804626 666913071 665749817 666023941 666144104 667141647 666369247 665871658 664958725 664015121
$$ packed form
890.2F89754105J69372k204742j516419j362533j209030m47083k330322j5640N49469
898.8F81387177J261291l27682j908J377106j563950k053833k740097j382980j102753
907.5F74852371n92422q66013o20117J862869M44947m48380j844177j240845j399307
916.2F70148926k010041j720046k074128n47027p65686Q79364N82962O92444N98297
924.9F65785065j489487p49207j684875j152191j204071l31040Q2703N28412K035217
933.6F61820526P53632J712036O23321J53351m35715j056137k73895p79648O94275
942.2F63211746K08130J784592K959823K600022J443634p64160m26178j355439q57544
950.9F68804626j891555j163254K74124J20163R97543p72400m97589r12933r43604
$$ plain form
959.6 664015121 661876526 658902206 657342987 654604874 652584991 650695419 650138702 649993286 649725571
968.3 649725571 649357758 647320328 645677872 642816086 640150146 637100792 634540634 633124695 631859627
976.9 631859627 631869850 631450844 631596298 630459099 628674545 626616058 624115562 622098122 620169563
985.6 620169563 619633369 618583298 618648300 618268204 618636436 620432243 619796028 619363365 618410683 617672729
995.3 617672729 616773300 616088066 615810623 614797325 614812737 615151863 616887894 618110580 618627510
1004 618627510 617962456 615984573 614502182 613064079 612616158 611654778 611947098 612084618 612534714
1012.6 612534714 613489647 612468262 612757797 612176170 610596771 608681564 607549706 607303429 607111168
1021.3 607111168 608015938 608580284 610077896 611043396 611843147 611440659 610428391 609919586 608787422
$$ packed form
959.6F64015121k138595k974320j559219k738113k019883j889572n56717j45416k67715
968.3F49725571l67813k037430j642456k861786k665940l049354k560158j415939j265068
976.9F31859627J0223m19006J45454j137199j784554k058487k500496k017440j928559
985.6F20169563n36194j050071O5002l80096L68232J795807o36215m32663r52682p37954
995.3F17672729q99429o85234k77443j013298J5412L39126J736031J222686N16930
1004F18627510o65054j977883j482391j438103m47921r61380K92320J37520M50096
1012.6F12534714R54933j021385K89535n81627j579399j915207j131858k46277j92261
1021.3F07111168R04770N64346J497612R65500P99751m02488j012268n08805j132164
$$ plain form
1030 608787422 609669876 609222984 608849640 608695946 609915924 612631683 612455864 612492447 612298164 612252235
1039.6 612252235 610340919 609021378 609207497 607987595 608464394 608706818 610609970 612420502 613310089
1048.3 613310089 613131332 611796722 611954308 610901146 610784569 610180321 610531158 611361122 611590233
1057 611590233 613168488 614005699 615560226 615443649 616159058 616482582 615565491 615880852 615355911 616040459
1066.6 616040459 616731262 618173676 618331757 618731499 619190674 618089180 617696877 614879112 613366356
1075.3 613366356 611207466 609973488 610791664 611207314 612620316 611958160 612338982 612514725 612539139
1084 612539139 611969528 610912361 611496124 611149483 611873436 611806030 612700043 613501434 613677483 615106583
1093.6 615106583 614960480 614823570 614310608 614805908 614605713 614131088 614447937 614586296 615038834 614209213
$$ packed form
1030F08787422Q82454m46892l73344j53694J219978K715759j75819L6583j94283m5929
1039.6F12252235j911316j319541J86119j219902M76799K42424J903152J810532Q89587
1048.3F13310089j78757j334610J57586j053162j16577o04248L50837Q29964K29111
1057F11590233J578255Q37211J554527j16577P15409L23524r17091L15361n24941O84548
1066.6F16040459O90803J442414J58081L99742M59175j101494l92303k817765j512756
1075.3F13366356k158890j233978Q18176M15650J413002o62156L80822J75743K4414
1084F12539139n69611j057167N83763l46641P23953o7406Q94013Q01391J76049J429100
1093.6F15106583j46103j36910n12962M95300k00195m74625L16849J38359M52538q29621
$$ plain form
1103.3 614209213 614895096 615079803 615136147 615191650 614659233 614222374 612746124 613720703 614574928 615235863
1112.9 615235863 615352936 615304947 616018028 615301208 615696869 615619621 616017036 616234398 616399345 617184906
1122.6 617184906 617145729 618043404 618148003 618874435 619383316 619489670 619399948 618854675 619503708 619472427
1132.2 619472427 619844856 619760323 619860191 620145912 620332222 620996475 620673256 620361099 619153557 618305206
1141.9 618305206 617198143 616266937 615993614 615438614 615514717 615216179 615304604 614364891 613871803 613409882
1151.5 613409882 612481041 612453461 611875534 612006416 611028290 610647774 611075630 611365318 612029305 612091179
1161.1 612091179 612265816 611287231 611985855 613289337 613773460 614071312 614381409 615987778 616725349
1169.8 616725349 618132248 618970184 620176468 622195587 622961311 624388809 625350990 626946983 628410873
$$ packed form
1103.3F14209213O85883J84707N6344N5503n32417m36859j476250R74579Q54225O60935
1112.9F15235863J17073m7989P13081p16820L95661p7248L97415K17362J64947P85561
1122.6F17184906l9177Q97675J04599P26432N08881J06354q9722n45273O49033l1281
1132.2F19472427L72429q4533R9868K85721J86310O64253l23219l12157j207542q48351
1141.9F18305206j107063r31206k73323n55000P6103k98538Q8425r39713m93088m61921
1151.5F13409882r28841k7580n77927J30882r78126l80516M27856K89688O63987O1874
1161.1F12091179J74637r78585O98624J303482M84123K97852L10097J606369P37571
1169.8F16725349J406899Q37936J206284K019119P65724J427498R62181J595993J463890
$$ plain form
1178.5 628410873 629999924 631533279 632267570 633628044 634561272 635521698 635054131 635564079 636970749
1187.2 636970749 637607956 638069572 637949409 639497375 639749985 639156303 639164047 639101944 638859863 638280373
1196.8 638280373 638813820 638680344 638437767 637971725 638260460 639100609 639312210 639885292 639830894 639881897
1206.5 639881897 639003448 639068489 639820290 639792786 639890099 639932976 641198883 641718063 642686539 643310394
1216.1 643310394 643045120 643362885 643147125 643273163 642580643 642629623 642926941 643103180 643348923 642800217
1225.8 642800217 642985916 642776108 642532425 641801071 641740189 641278305 639956665 640104446 640140381 640541000
1235.4 640541000 640498657 640747223 640584641 639916534 640170517 639983788 639817581 639134483 639302673 639362297
1245 639362297 639506226 639924736 639698448 640250015 640280075 640613632 640106125 639963913 640191345 639916458
$$ packed form
1178.5F28410873J589051J533355P34291J360474R33228R60426m67567N09948J406670
1187.2F36970749O37207M61616j20163J547966K52610n93682P744o2103k42081n79490
1196.8F38280373N33447j33476k42577m66042K88735Q40149K11601N73082n4398N1003
1206.5F39881897q78449O5041P51801k7504R7313M2877J265907N19180R68476O23855
1216.1F43310394k65274L17765k15760J26038o92520M8980K97318J76239K45743n48706
1225.8F42800217J85699k09808k43683p31354o0882m61884j321640J47781L5935M00619
1235.4F40541000m2343K48566j62582o68107K53983j86729j66207o83098J68190N9624
1245F39362297J43929M18510k26288N51567L0060L33557n07507j42212K27432k74887
$$ plain form
1254.7 639916458 640728760 640585785 641162109 641260757 641147079 641220322 640742035 641377716 641217804 641457520
1264.3 641457520 641663971 641700134 641518860 641585464 642341003 642074203 642653809 642840424 642776184 642396088
1274 642396088 641985855 642440491 642321854 642573090 642651443 642880783 642481461 642272720 642407150 641934128
1283.6 641934128 641935959 641433716 641558609 641391907 641046982 640615005 640141907 640514145 640202026 640097122
1293.3 640097122 639743919 639845848 639592094 638752289 638347626 637618523 637520790 637127991 637068710 636867905
1302.9 636867905 636792717 636941071 636836205 637240524 636898460 636747704 636170349 635999527 636023521 635786247
1312.5 635786247 635807228 635041466 635563812 635484734 634887505 634451180 633731689 633306999 632644043 632739868
1322.2 632739868 632244186 631910553 631429863 631085701 631246452 630700760 630229530 629125214 628915329
$$ packed form
1254.7F39916458Q12302j42975N76324R8648j13678P3243m78287O35681j59912K39716
1264.3F41457520K06451L6163j81274O6604P55539k66800N79606J86615o4240l80096
1274F42396088m10233M54636j18637K51236P8353K29340l99322k08741J34430m73022
1283.6F41934128J831n02243J24893j66702l44925m31977m73098L72238l12119j04904
1293.3F40097122l53203J01929k53754q39805m04663p29103r7733l92799n9281k00805
1302.9F36867905p5188J48354j04866M04319l42064j50756n77355j70822K3994k37274
1312.5F35786247K0981p65762N22346p9078n97229m36325p19491m24690o62956R5825
1322.2F32739868m95682l33633m80690l44162J60751n45692m71230j104316k09885
$$ plain form
1330.9 628915329 628787193 628258667 627871399 627620010 627784309 627339211 627589455 627642632 627620621 626752205
1340.5 626752205 626149406 626534653 625831909 625616798 625565796 625964584 626123238 625894508 626154060 626014519
1350.2 626014519 625994873 625372162 624972076 624507637 624174500 623775558 623568115 623997231 623303719 623408203
1359.8 623408203 623382645 623513031 623422890 621295624 621336021 621593819 621310501 621244507 621277504 620507622
1369.4 620507622 620220375 620476494 620856171 621343002 620365486 620177116 620290756 621050377 620950775 619969254
1379.1 619969254 620264702 619679565 619583321 619420738 619710045 620392723 621056290 621870689 620419579 620889320
1388.7 620889320 621601295 621921425 621779594 621976738 623604507 622695351 621292801 621740685 622463684
1397.4 622463684 622718773 621171761 620193748 620174675 620305748 620289230 621069603 619833908 618765755
$$ packed form
1330.9F28915329j28136n28526l87268k51389J64299m45098K50244N3177k2011q68416
1340.5F26752205o02799L85247p02744k15111n1002L98788J58654k28730K59552j39541
1350.2F26014519j9646o22711m00086m64439l33137l98942k07443M29116o93512J04484
1359.8F23408203k5558J30386r0141k127266M0397K57798k83318o5994L2997p69882
1369.4F20507622k87247K56119L79677M86831r77516j88370J13640P59621r9602r81521
1379.1F19969254K95448n85137r6244j62583K89307O82678O63567Q14399j451110M69741
1388.7F20889320P11975L20130j41831J97144J627769r09156j402550M47884P22999
1397.4F22463684K55089j547012r78013j9073J31073j6518P80373j235695j068153
$$ plain form
1406.1 618765755 619527016 619493065 619976959 619927521 619560738 618787231 618229446 618456802 618067818 618280525
1415.7 618280525 618237801 618708878 619563866 615502243 614883499 616995392 618216209 618470955 616675529
1424.4 616675529 615812073 616926422 617042580 617779388 618676720 617266998 617048645 617792854 617800865 617235680
1434.1 617235680 618715477 620305290 616058884 615584526 617663956 618677483 618657761 618939171 618803215
1442.7 618803215 618494301 618165398 617522545 617835312 618313293 616996460 616829185 618392105 618740540
1451.4 618740540 617978935 617920570 619183426 620878944 620043144 616205635 614162827 616031570 616282158
1460.1 616282158 617132530 617680702 617943192 620583611 619423790 618342133 619405136 619875450 620888748
1468.8 620888748 621840401 624406929 624919548 623362427 624092865 626927223 630489616 629168968 629060860
$$ packed form
1406.1F18765755P61261l3951M83894m9438l66783p73507n57785K27356l88984K12707
1415.7F18280525m2724M71077Q54988m061623o18744K111893J220817K54746j795426
1424.4F16675529q63456J114349J16158P36808Q97332j409722k18353P44209Q011n65185
1434.1F17235680J479797J589813m246406m74358K079430J013527j9722K81410j35956
1442.7F18803215l08914l28903o42853L12767M77981j316833j67275J562920L48435
1451.4F18740540p61605n8365J262856J695518q35800l837509k042808J868743K50588
1460.1F16282158Q50372N48172K62490K640419j159821j081657J063003M70314J013298
1468.8F20888748R51653K566528N12619j557121P30438K834358L562393j320648j08108
$$ plain form
1477.5 629060860 630958290 632182961 633552132 634319801 634786606 636064682 637543983 638849030 641657867
1486.1 641657867 642584915 641904602 643936996 644006577 641941452 642876205 645319595 646630096 648853378
1494.8 648853378 651234970 647466660 649626923 651185074 649508514 651404800 652687607 652285385
1502.5 652285385 653210068 656611404 660272064 655883484 648654251 652790985 656031647 656582336 658512878
1511.2 658512878 658717194 656552734 658274689 659518814 660510025 660803528 655539017 659464645 664557037
1519.9 664557037 663393250 659461060 657975082 660967712 663860321 661970139 661384354 662614975
1527.6 662614975 661558609 661347961 663314133 664113312 665411072 665442581 660185242 661741409 662927856
1536.3 662927856 664996872 668892593 666170044 657102203 662190933 664538574 662711105 666249466
$$ packed form
1477.5F29060860J897430J224671J369171P67669M66805J278076J479301J305047K808837
1486.1F41657867R27048o80313K032394O9581k065125R34753K443390J310501K223282
1494.8F48853378K381592l768310K160263J558151j676560J896286J282807m02222
1502.5F52285385R24683L401336L660660m388580p229233M136734L240662N50689J930542
1511.2F58512878K04316k164460J721955J244125R91211K93503n264511L925628N092392
1519.9F64557037j163787l932190j485978K992630K892609j890182n85785J230621
1527.6F62614975j056366k10648J966172P99179J297760L1509n257339J556167J186447
1536.3F62927856K069016L895721k722549r067841N088730K347641j827469L538361
$$ plain form
1544 666249466 666389847 662168350 663530960 664550171 666444702 665835190 661923141 663330383 665846786
1552.7 665846786 668023376 664423218 663386230 668484497 673532944 664358215 655628662 656208267
1560.4 656208267 661007233 663902817 665197830 666973953 665261917 664235764 665151367 666810837
1568.1 666810837 668880692 661573257 661582565 663503799 663701859 664610977 667167969 668737869 659094772
1576.8 659094772 660553513 662074738 661618423 661415329 660726776 660722961 660161438 659953613 659336014 659007492
1586.4 659007492 659018326 658566437 658264618 657263489 656921539 655604172 655002441 654473267 653164673
1595.1 653164673 652982559 652366867 652245865 651313171 650747223 649794693 648599854 647855453 645604706
1603.8 645604706 644180603 643438339 643306732 641589966 641002121 640055389 637688179 637529640 636154213
$$ packed form
1544F66249466J40381m221497J362610J019211J894531o09512l912049J407242K516403
1552.7F65846786K176590l600158j036988N098267N048447r174729q729553N79605
1560.4F56208267M798966K895584J295013J776123j712036j026153R15603J659470
1568.1F66810837K069855p307435R308J921234J98060R09118K556992J569900r643097
1576.8F59094772J458741J521225m56315k03094o88553l815n61523k07825o17599l28522
1586.4F59007492J0834m51889l01819j001129l41950j317367o01731n29174j308594
1595.1F53164673j82114o15692j21002r32694n65948r52530j194839p44401k250747
1603.8F45604706j424103p42264j31607j716766n87845r46732k367210j58539j375427
$$ plain form
1612.5 636154213 635599785 634470139 635287933 635695000 625611458 626781654 626994667 626580772 625633430
1621.1 625633430 626499290 626626740 620317612 619969559 619975624 621075058 619031219 616189995 616424141
1629.8 616424141 615640526 615581894 614946899 616445541 619609337 613655701 610907249 612675705 611929054
1638.5 611929054 612128143 612196579 611445694 612547646 612613182 614367180 617079620 615402641 614415054
1647.2 614415054 612573090 612124519 613554573 617168961 622283592 619139824 607489243 612387581
1654.9 612387581 616017456 618140945 618821411 619040184 619826584 620186462 621936150 622217140 618922081
1663.6 618922081 620984383 623029900 624078865 626311417 629265404 626352692 625226173 628053322
1671.3 628053322 627051506 629222336 633735619 633848724 629047203 631631088 634806595 636779137
$$ packed form
1612.5F36154213n54428j129646Q17794M07067j0083542J170196K13013m13895r47342
1621.1F25633430Q65860J27450o309128l48053O065J099434k043839k841224K34146
1629.8F16424141p83615n8632o34995J498642L163796n953636k748452J768456p46651
1638.5F11929054J99089O8436p50885J101952O5536J753998K712440j676979r87587
1647.2F14415054j841964m48571J430054L614388N114631l143768j1650581M898338
1654.9F12387581L629875K123489O80466K18773P86400L59878J749688K80990l295059
1663.6F18922081K062302K045517J048965K232552K953987k912712j126519K827149
1671.3F28053322j001816K170830M513283J13105m801521K583885L175507J972542
$$ plain form
1679 636779137 638144455 636612282 639297180 644548721 644639359 633631020 635922623 641562576 644260178
1687.7 644260178 644110718 645314026 645977707 646929550 647965088 649023132 652822113 655985413 646935272
1696.4 646935272 648926926 654148178 660500412 660113602 645745239 652369690 656531906 658174362
1704.1 658174362 657670746 657461014 656039200 656479111 659212646 659706879 659319382 660057144 661695328
1712.8 661695328 664136581 663300400 661532059 664655762 667673950 659207993 659765396 662739944 664097824
1721.4 664097824 665462875 665637436 664843521 665087814 665817337 665861435 666325073 668449249 667221451
1730.1 667221451 665446701 669138107 673720474 670583801 660936279 664822540 668489609 669448547
1737.8 669448547 671763229 670914536 666146011 669090500 671812668 670832977 669519958 670651169 671933823
$$ packed form
1679F36779137J365318j532173K684898N251541R0638j1008339K291603N639953K697602
1687.7F44260178j49460J203308O63681R51843J035538J058044L798981L163300r050141
1696.4F46935272J991654N221252O352234l86810j4368363O624451M162216J642456
1704.1F58174362n03616k09732j421814M39911K733535M94233l87497P37762J638184
1712.8F61695328K441253q36181j768341L123703L018188q465957N57403K974548J357880
1721.4F64097824J365051J74561p93915K44293P29523M4098M63638K124176j227798
1730.1F67221451j774750L691406M582367l136673r647522L886261L667069R58938
1737.8F69448547K314682q48693m768525K944489K722168r79691j313019J131211J282654
$$ plain form
1746.5 671933823 672154007 671159439 669076614 672495956 671954269 667701340 670374069 670917358 671830978
1755.2 671830978 673919983 671353149 670838623 671963730 673256073 675648346 672677841 669877167
1762.9 669877167 671866989 672451324 672289886 673776627 674823990 671509323 672539673 676341934 676489639
1771.6 676489639 672487183 669632339 673068771 674812775 672061310 672891846 673558502 674539490 675020294
1780.3 675020294 672535629 672418823 673310394 674289322 673178101 672132111 673184052 673099670 673089218
1788.9 673089218 674419861 675260010 675346603 671696701 669575806 672974243 674630127 673112717 673450851
1797.6 673450851 675186310 675135956 672939529 674252014 673785172 672446289 673373337 673034363 673340073
1806.3 673340073 673739090 673137283 673668594 674703827 673305435 672609177 673100891 672463913 672738571
$$ packed form
1746.5F71933823K20184r94568k082825L419342n41687m252929K672729N43289R13620
1755.2F71830978K089005k566834n14526J125107J292343K392273k970505k800674
1762.9F69877167J989822N84335j61438J486741J047363l314667J030350L802261J47705
1771.6F76489639m002456k854844L436432J744004k751465Q30536O66656R80988M80804
1780.3F75020294k484665j16806Q91571R78928j111221j045990J051941q4382j0452
1788.9F73089218J330643Q40149Q6593l649902k120895L398437J655884j517410L38134
1797.6F73450851J735459n0354k196427J312485m66842j338883R27048l38974L05710
1806.3F73340073L99017o01807N31311J035233j398392o96258M91714o36978K74658
$$ plain form
1815 672738571 672766495 673260117 672768402 671852036 672855148 672788925 673016586 672385330 673067169 674946976
1824.6 674946976 671449585 670535049 672369614 674408493 674567184 669344025 669325409 671367798 671710358
1833.3 671710358 671484985 671585312 672143173 671747437 670268402 670303421 670431824 670811920 671316376 672728577
1842.9 672728577 673589706 667345581 668177032 670479431 669850082 669074554 668856049 669331055 668647156
1851.6 668647156 668465424 668383865 668108292 668487930 668246841 668446732 668012772 667785034 667654037 667117081
1861.3 667117081 666614761 666698151 667332382 667186813 667840652 667838135 668481827 667869873 664559097 665193100
1870.9 665193100 665829544 665879135 665466232 665527191 665949173 665594177 665646286 665453644 665585175 665152969
1880.6 665152969 665014420 665124741 664897079 664753494 664235840 664365234 664108353 665367661 665682526
$$ packed form
1815F72738571K7924M93622m91715r16366J003112o6223K27661o31256O81839J879807
1824.6F74946976l497391r14536J834565K038879J58691n223159j8616K042389L42560
1833.3F71710358k25373J00327N57861l95736j479035L5019J28403L80096N04456J412201
1842.9F72728577Q61129o244125Q31451K302399o29349p75528k18505M75006o83899
1851.6F68647156j81732q1559k75573L79638k41089J99891m33960k27738j30997n36956
1861.3F67117081n02320Q3390O34231j45569O53839k517O43692o11954l310776O34003
1870.9F65193100O36444M9591m12903O0959M21982l54996N2109j92642J31531m32206
1880.6F65152969j38549J10321k27662j43585n17654J29394k56881J259308L14865
$$ plain form
1889.2 665682526 662850876 663204498 663687363 663206177 663551483 663560028 662090302 662004089 662497711 662515488
1898.9 662515488 662967987 662693024 662880249 662743225 662395096 662097931 661583557 661844406 661439972 661154099
1908.5 661154099 661014709 660648499 660848999 661496811 661353912 660888672 660527954 660144043 661557541
1917.2 661557541 659671021 657466354 658657684 659205246 660357285 659392700 657929001 658597794 658905182
1925.9 658905182 658470612 657914963 657801971 657213669 657201385 657335434 657366638 657422562 657357941 657423401
1935.5 657423401 657260208 657402420 656834488 656326675 655832214 656538620 656730194 653867645 654862442
1944.2 654862442 656450195 656520004 656124802 655523987 655546417 654974518 654725876 654352417 654032593 654152451
1953.8 654152451 654347916 654556580 654553604 654818573 654523849 654446564 654230423 653749313 653527527 653259430
$$ packed form
1889.2F65682526k831650L53622M82865m81186L45306Q545j469726q6213M93622J7777
1898.9F62515488M52499k74963J87225j37024l48129k97165n14374K60849m04434k85873
1908.5F61154099j39390l66210K00500O47812j42899m65240l60718l83911J413498
1917.2F61557541j886520k204667J191330N47562J152039r64585j463699O68793L07388
1925.9F58905182m34570n55649j12992n88302j2284J34049L1204N5924o4621O5460
1935.5F57423401j63193J42212n67932n07813m94461P06406J91574k862549R94797
1944.2F54862442J587753O9809l95202o00815K2430n71899k48642l73459l19824J19858
1953.8F54152451J95465K08664k976K64969k94724p7285k16141m81110k21786k68097
$$ plain form
1963.5 653259430 653111649 653182449 653995132 653548050 652953491 653371277 653330383 652956467 652430038 652293701
1973.1 652293701 651938782 651636887 651277237 651245804 651729736 651840363 651959991 651678925 651632538 651275253
1982.8 651275253 650682220 650347443 649884338 649967880 650022354 649766617 649469070 650515137 651368408 649995041
1992.4 649995041 649118042 649063568 648808060 648073807 647688217 647487488 647447128 647678070 647689972 647831879
2002.1 647831879 647623444 647327347 646651993 646090012 645795059 645278168 644803696 644179230 644412308 644598770
2011.7 644598770 644444046 644275208 644136505 644574661 644181747 642960587 642225876 642006378 641660156
2020.4 641660156 641510162 641486893 641408997 641406860 641075897 640899658 640286255 639729233 639302864 638842239
2030 638842239 638522072 637673721 637091827 636828117 637064438 637103767 637265625 637349548 636412888 636172676
$$ packed form
1963.5F53259430j47781P0800Q12683m47082n94559M17786m0894l73916n26429j36337
1973.1F52293701l54919l01895l59650l1433M83932J10627J19628k81066m6387l57285
1982.8F51275253n93033l34777m63105Q3542N4474k55737k97547J046067Q53271j373367
1992.4F49995041q76999n4474k55508p34253l85590k00729m0360K30942J1902J41907
2002.1F47831879k08435k96097o75354n61981k94953n16891m74472o24466K33078J86462
2011.7F44598770j54724j68838j38703M38156l92914j221160p34711k19498l46222
2020.4F41660156j49994k3269p7896k137l30963j76239o13403n57022m26369m60625
2030F38842239l20167q48351n81894k63710K36321L9329J61858Q3923r36660k40212
$$ plain form
2039.7 636172676 636021881 635370331 634591408 634545250 634527130 634122314 634188576 633966866 634246407 634004173
2049.3 634004173 633833046 633736038 633112144 633141899 632560463 632409515 632158852 631904182 632208176 632364922
2059 632364922 632674522 632201271 631804199 631313972 631208115 631129189 630515137 630529251 630616264 630874901
2068.6 630874901 630786896 630986214 630962791 630502968 630141258 629659119 629777946 629643288 629644699 629407768
2078.2 629407768 629455528 629749146 629431458 629326706 628860092 629087029 629005814 628355789 628023453 627750816
2087.9 627750816 627987633 627948647 628086166 628038368 628012276 628112526 628087769 627982140 627471657 627248917
2097.5 627248917 626764069 626581764 626336746 626144676 626440544 626474113 626602402 626322174 626226425 625986938
2107.2 625986938 625737190 625669250 625392265 625031509 624525948 624815788 624820061 624789352 624622574 624271202
$$ packed form
2039.7F36172676j50795o51550p78923m6158j8120m04816O6262k21710K79541k42234
2049.3F34004173j71127r7008o23894K9755n81436j50948k50663k54670L03994J56746
2059F32364922L09600m73251l97072m90227j05857p8926o14052J4114Q7013K58637
2068.6F30874901q8005J99318k3423m59823l61710m82139J18827j34658J411k36931
2078.2F29407768M7760K93618l17688j04752m66614K26937q1215o50025l32336k72637
2087.9F27750816K36817l8986J37519m7798k6092J00250k4757j05629n10483k22740
2097.5F27248917m84848j82305k45018j92070K95868L3569J28289k80228r5749k39487
2107.2F25986938k49748o7940k76985l60756n05561K89840M273l0709j66778l51372
$$ plain form
2116.8 624271202 624412842 624211159 624225578 623962708 623814087 623545074 623434639 623617210 623145676 623024483
2126.5 623024483 622641144 622542229 622673073 622495766 621980019 621512222 621473351 620992012 621119728 620968666
2136.1 620968666 621018753 621392479 621113663 621151733 620756073 620598831 620483246 620258369 620107079 619928551
2145.8 619928551 619884224 619632797 619612961 619151955 619047852 619008751 618728027 618638840 618119354 617988548
2155.4 617988548 618162346 618497620 618335419 618100700 618058434 617918587 617977409 617918320 618267326 618001900
2165 618001900 617897568 618096390 617677536 617460327 617330284 617680435 617886238 618020973 618188362 618242111
2174.7 618242111 618320045 618379555 618442154 617996788 617944069 617833138 617687187 617592392 617600365 618104630 618019104
2185.3 618019104 617742310 617436714 617718391 617848129 617511559 617349625 617199898 617646790 617533989 617440033
$$ packed form
2116.8F24271202J41640k01683J4419k62870j48621k69013j10435J82571m71534j21193
2126.5F23024483l83339r8915J30844j77307n15747m67797l8871m81339J27716j51062
2136.1F20968666N0087L73726k78816L8070l95660j57242j15585k24877j51290j78528
2145.8F19928551m4327k51427j9836m61006j04103l9101k80724q9187n19486j30806
2155.4F17988548J73798L35274j62201k34719m2266j39847N8822n9089L49006k65426
2165F18001900j04332J98822m18854k17209j30043L50151K05803J34735J67389N3749
2174.7F18242111P7934N9510O2599m45366n2719j10931j45951r4795P973N04265q5526
2185.3F18019104k76794l05596K81677J29738l36570j61934j49727M46892j12801r3956
$$ plain form
2194.9 617440033 617714119 618077049 617913895 617419624 617824211 617608185 617535095 617554016 617600479 617744598
2204.6 617744598 617516174 617779236 617742767 617986374 617918167 617818832 617997131 617670174 617513962 617208862
2214.2 617208862 617279053 617359581 617450447 617644577 617857208 617778893 617462196 617660561 617279320 617309151
2223.9 617309151 617543449 617471123 617262878 616991119 617295151 617219391 617336349 617315712 617348213 617090530
2233.5 617090530 616434517 616406822 616073990 615994377 615851517 615832939 615758591 615709038 616089134 616040688 615896645
2244.1 615896645 615498276 615703621 615563583 615435219 615558891 615035019 615023346 614791451 615172043 615155029
2253.8 615155029 614675293 614872398 614850388 615089417 615056381 614820480 614328232 614212265 613981743 613918571
2263.4 613918571 614571419 614434357 614425163 614194679 614092674 613757591 613373146 613774109 613781090 613776474 613597412
$$ packed form
2194.9F17440033K74086L62930j63154m94271M04587k16026p3090J8921M6463J44119
2204.6F17744598k28424K63062l6469K43607o8207r9335J78299l26957j56212l05100
2214.2F17208862P0191Q0528R0866J94130K12631p8315l16697J98365l81241K9831
2223.9F17309151K34298p2326k08245k71759L04032p5760J16958k0637L2501k57683
2233.5F17090530o56013k7695l32832p9613j42860j8578p4348m9553L80096m8446j44043
2244.1F15896645l98369K05345j40038j28364J23672n23872j1673k31895L80592j7014
2253.8F15155029m79736J97105k2010K39029l3036k35901m92248j15967k30522o3172
2263.4F13918571O52848j37062r194k30484j02005l35083l84445M00963O981m616j79062
$$ plain form
2274 613597412 613804626 613778534 613955879 614393959 613939438 613464394 612971878 612853966 612372742 612306023
2283.7 612306023 612373123 612335091 612713089 612613907 613070908 612979622 612873306 612588081 612371750 612573662
2293.3 612573662 612097092 612331581 611947327 612299728 612863235 612780800 613040657 612845459 612912025 612267151
2302.9 612267151 612472420 612423706 612166939 612562561 612622147 613607368 613520699 613719330 613839607 614036636
2312.6 614036636 614013023 613121681 613783989 613613739 613861465 613592834 613782883 614516029 613987732 614554367
2322.2 614554367 614415092 615285721 615487366 615854073 615812492 615257645 616556549 615612793 615502052 615367393
2331.9 615367393 615340424 615049553 614798851 616090965 615421257 614608765 613806152 614592781 614053841 613438606
2341.5 613438606 613682175 612470398 613185883 612098923 611230240 609488449 607827339 609212570 610994797
$$ packed form
2274F13597412K07214k6092J77345M38080m54521m75044m92516j17912m81224o6719
2283.7F12306023O7100l8032L77998r9182M57001r1286j06316k85225k16331K01912
2293.3F12573662m76570K34489l84254L52401N63507q2435K59857j95198O6566o44874
2302.9F12267151K05269m8714k56767L95622N9586R85221q6669J98631J20277J97029
2312.6F14036636k3613q91342O62308j70250K47726k68631J90049P33146n28297N66635
2322.2F14554367j39275Q70629K01645L66707m1581n54847J298904r43756j10741j34659
2331.9F15367393k6969k90871k50702J292114o69708q12492q02613P86629n38940o15235
2341.5F13438606K43569j211777P15485j086960q68683j741791j661110J385231J782227
$$ plain form
2350.2 610994797 611395073 611189079 612785225 613624535 613967476 613587914 613335609 614125633 614183922 615320129
2359.8 615320129 614004021 613585472 612155991 610734291 610999527 610078621 610268936 609222298 608703041
2368.5 608703041 607751122 607417488 607055206 605268478 603674927 602038307 601657257 600732231 599940453
2377.2 599940453 599178619 598901787 598962784 597745628 596983681 596308899 595753098 594743958 594285507
2385.9 594285507 594289360 593707237 594062691 594034081 594079399 593978119 593775711 593609962 592781448 592547188
2395.5 592547188 592144127 591863937 591421165 591080170 591060638 591064491 591438828 591253204 590839233 590221672
2405.2 590221672 590166283 589727707 588836021 588705750 588680878 588893204 588674469 588487053 588135262 587824516
2414.8 587824516 587288437 586607971 586692505 586079216 585644646 585361252 585376396 585478249 585264740 585314369
$$ packed form
2350.2F10994797M00276k05994J596146Q39310L42941l79562k52305P90024N8289J136207
2359.8F15320129j316108m18549j429481j421700K65236r20906J90315j046638n19257
2368.5F08703041r51919l33634l62282j786728j593551j636620l81050r25026p91778
2377.2E99940453p61834k76832O0997j217156p61947o74782n55801j009140m58451
2385.9E94285507L853n82123L55454k8610M5318j01280k02408j65749q28514k34260
2395.5E92547188m03061k80190m42772l40995j9532L853L74337j85624m13971o17561
2405.2E90221672n5389m38576q91686j30271k4872K12326k18735j87416l51791l10746
2414.8E87824516n36079o80466Q4534o13289m34570k83394J5144J01853k13509M9629
$$ plain form
2424.5 585314369 584847107 584606972 584224472 584124794 583692093 582941284 582825394 582469673 582224617 581559639
2434.1 581559639 581495018 581494713 581323891 581196251 580331802 579887009 579267616 578881683 578411942 578294029
2443.7 578294029 578545647 578198357 577987747 577776680 578071823 577499657 576685600 576207161 575650482 575437889
2453.4 575437889 574938431 575093727 574771690 574568634 574812469 574503593 574172020 573810921 573699341 573025513
2463 573025513 572571869 572168808 571708183 571398048 571253319 571823387 571805000 571712685 571111298 570553284
2472.7 570553284 570236473 569661026 569547653 568909111 568588104 568542404 568736649 568746529 568624573 568870239
2482.3 568870239 568443298 567916756 567023315 566596909 566431084 566326599 566515388 566303444 566355934 565998154
2492 565998154 565519714 565102005 565223541 565151520 564525757 564187393 563393631 563434906 563532944 563513718 563592224
$$ packed form
2424.5E85314369m67262k40135l82500r9678m32701p50809j15890l55721k45056o64978
2434.1E81559639o4621l05j70822j27640q64449m44793o19393l85933m69741j17913
2443.7E78294029K51618l47290k10610k11067K95143n72166q14057m78439n56679k12593
2453.4E75437889m99458J55296l22037k03056K43835l08876l31573l61099j11580o73828
2463E73025513m53644m03061m60625l10135j44729N70068j8387r2315o01387n58014
2472.7E70553284l16811n75447j13373o38542l21007m5700J94245R880j21956K45666
2482.3E68870239m26941n26542q93441m26406j65825j04485J88789k11944N2490l57780
2492E65998154m78440m17709J21536p2021o25763l38364p93762M1275R8038j9226P8506
$$ plain form
2502.6 563592224 563338280 563254089 562923622 562899246 562457352 562035370 561757584 561644745 561455612 560979500
2512.2 560979500 561294060 561047287 560979652 560730095 560186195 560151367 560006523 559845543 559116707 558927460
2521.9 558927460 558599472 558358765 558517189 558364601 558355675 557776108 557517509 557208824 556972504 556694031
2531.5 556694031 556011314 555577316 555350800 555761833 555764275 555657959 555090332 554615631 554473495 553874550
2541.1 553874550 554059448 553720970 553153534 552884941 552764091 552626457 552480583 552688713 552116470 551601601
2550.8 551601601 551079941 550927811 550781975 550358391 550393600 550207176 550572433 550287285 549400978 548833313
2560.4 548833313 548705406 548747215 548345413 548428879 548448830 548365364 547715912 546993637 546577072 546378822
2570.1 546378822 546602554 546230850 546416359 546344337 545936661 545626526 545335922 545420494 544957848 544705658
$$ packed form
2502.6E63592224k53944q4191l30467k4376m41894m21982k77786j12839j89133m76112
2512.2E60979500L14560k46773o7635k49557n43900l4828j44844j60980p28836j89247
2521.9E58927460l27988k40707J58424j52588q926n79567k58599l08685k36320k78473
2531.5E56694031o82717m33998k26516M11033K442j06316n67627m74701j42136n98945
2541.1E53874550J84898l38478n67436k68593j20850j37634j45874K08130n72243n14869
2550.8E51601601n21660j52130j45836m23584L5209j86424L65257k85148q86307n67665
2560.4E48833313j27907M1809m01802Q3466J9951q3466o49452p22275m16565j98250
2570.1E46378822K23732l71704J85509p2022m07676l10135k90604Q4572m62646k52190
$$ plain form
2579.7 544705658 544187317 543980598 543870621 543705292 544001427 543690720 543382301 542728806 542522812 542233276
2589.4 542233276 541747589 541729355 541417198 541437683 541260834 541264496 541152649 541154900 540790062 539926414 539775734
2600 539775734 539411621 539468307 538878479 538338852 538480873 538217354 538078041 537686348 537772942 537541771
2609.6 537541771 537233658 536842651 536394424 536571388 535861969 535190201 535179062 535167313 534524879 534253006
2619.3 534253006 534175644 533560410 533207436 532697678 532809258 532373695 531541290 531211243 531064987 531177292
2628.9 531177292 530634117 530264015 529818573 529724770 529428062 528635864 528367424 527923927 527966003 527823257
2638.5 527823257 527528687 526768608 525935135 525992317 525739975 525357208 524863701 524652100 524259262 523780632
2648.2 523780632 523281593 522938118 523131561 522764473 522706337 522287750 521546669 520909691 520501633 520484161
$$ packed form
2579.7E44705658n18341k06719j09977j65329K96135l10707l08419o53495k05994k89536
2589.4E42233276m85687j8234l12157K0485j76849L662j11847K251l64838q63648j50680
2600E39775734l64113N6686n89828n39627J42021k63519j39313l91693Q6594k31171
2609.6E37541771l08113l91007m48227J76964p09419o71768j1139j1749o42434k71873
2619.3E34253006p7362o15234l52974n09758J11580m35563q32405l30047j46256J12305
2628.9E31177292n43175l70102m45442r3803k96708p92198k68440m43497M2076j42746
2638.5E27823257k94570p60079q33473N7182k52342l82767m93507k11601l92838m78630
2648.2E23780632m99039l43475J93443l67088n8136m18587p41081o36978m08058j7472
$$ plain form
2657.8 520484161 519847946 519574165 519419861 519476280 519133835 518463402 518330269 518021812 517757645 517216797
2667.5 517216797 517268066 517085762 516359367 516015320 515900764 515941315 515512161 515467834 515218582 514838257
2677.1 514838257 514324875 513753242 513618317 513301430 513562965 513356895 513039856 512610626 511955681 511679039
2686.8 511679039 511475143 511828041 511312904 510645828 510282440 510117416 509925919 509380074 509310837 508895454
2696.4 508895454 508942833 508893890 508640938 508286972 507911491 508019943 507578011 507657318 507142410 506534195
2706 506534195 506474533 506096153 505836029 505290680 505225449 504978981 504797592 504474831 504277725 504350929
2715.7 504350929 503662949 503514442 503255234 503047676 502606697 502240906 502363243 502221146 502338371 501843910
2725.3 501843910 501310997 500641632 500413780 500565796 500219917 499859695 499210243 499163628 498975868 498786964
$$ packed form
2657.8E20484161o36215k73781j54304N6419l42445o70433j33133l08457k64167n40848
2667.5E17216797N1269j82304p26395l44047j14556M0551m29154m4327k49252l80325
2677.1E14838257n13382n71633j34925l16887K61535k06070l17039m29230o54945k76642
2686.8E11679039k03896L52898n15137o67076l63388j65024j91497n45845o9237m15383
2696.4E08895454M7379m8943k52952l53966l75481J08452m41932P9307n14908o08215
2706E06534195n9662l78380k60124n45349o5231k46468j81389l22761j97106P3204
2715.7E04350929o87980j48507k59208k07558m40979l65791J22337j42097J17225m94461
2725.3E01843910n32913o69365k27852J52016l45879l60222o49452m6615j87760j88904
$$ plain form
2735 498786964 498454781 498217621 498323402 497860451 497791176 497100029 496731110 496488228 496045036 496297722
2744.6 496297722 496061935 495841560 495470085 495374374 495260315 495029907 494379044 493442802 493380814 493176727
2754.3 493176727 493405380 493387260 493279686 493102646 492471428 492282600 491980095 492116318 492004623 491833839
2763.9 491833839 491258087 490490150 490445023 490183907 490169983 489904747 489911194 489866142 489472847 489109344
2773.5 489109344 488644218 488390694 488187218 488737679 488412628 487837334 487532768 487124825 487351723 486764374
2783.2 486764374 486498909 486233444 485707512 485511246 485350113 485164261 484456100 484104347 483937836 484080467
2792.8 484080467 483619194 483174553 483418007 482928772 482508621 482186241 481957817 481402702 481078911 480841217
2802.5 480841217 480498810 480574837 480224953 480111351 479619598 479275818 478676910 478023796 477999191 477411308
$$ packed form
2735D98786964l32183k37160J05781m62951o9275o91147l68919k42882m43192K52686
2744.6D96297722k35787k20375l71475r5711j14059k30408o50863r36242o1988k04087
2754.3D93176727K28653j8120j07574j77040o31218j88828l02505J36223j11695j70784
2763.9D91833839n75752p67937m5127k61116j3924k65236O447m5052l93295l63503
2773.5D89109344m65126k53524k03476N50461l25051n75294l04566m07943K26898n87349
2783.2D86764374k65465Tn25932j96266j61133j85852p08161l51753j66511J42631
2792.8D84080467m61273m44641K43454m89235m20151l22380k28424n55115l23791k37694
2802.5D80841217l42407P6027l49884j13602m91753l43780n98908o53114k4605n87883
$$ plain form
2812.1 477411308 477383308 476946144 476445465 475960388 475530968 475490532 474896507 474781761 474223633 473780136
2821.8 473780136 473426285 473219757 473124275 472448540 472330513 471736336 471362343 470773582 470260887 470538368
2831.4 470538368 470374985 469985657 469166298 468890877 468466568 467947769 467726288 467389183 466820030 465883217
2841.1 465883217 465650635 464914474 464233513 463730621 463084068 462577934 461936073 461635513 460632095
2849.7 460632095 460150070 459750862 459229355 458948708 458224525 457810402 457357216 457344971 456857567 456787453
2859.4 456787453 456807404 455886574 455240707 454557991 454412804 453682022 453006821 452523155 451722794 451466217
2869 451466217 451219025 451068306 450251122 449622078 449084587 448675117 448319664 447537613 447064133 446245804
2878.7 446245804 446043129 445672531 445245171 444987717 444531326 444279251 443573074 443500099 443047981 442575684
$$ packed form
2812.1D77411308k8000m37164n00679m85077m29420m0436n94025j14746n58128m43497
2821.8D73780136l53851k06528r5482o75735j18027n94177l73993n88761n12695K77481
2831.4D70538368j63383l89328q19359k75421m24309n18799k21481l37105n69153r36813
2841.1D65883217k32582p36161o80961n02892o46553n06134o41861l00560j003418
2849.7D60632095m82025l99208n21507k80647p24183m14123m53186j2245m87404p0114
2859.4D56787453J9951r20830o45867o82716j45187p30782o75201m83666q00361k56577
2869D51466217k47192j50719q17184o29044n37491m09470l55453p82051m73480q18329
2878.7D46245804k02675l70598m27360k57454m56391k52075p06177p2975m52118m72297
$$ plain form
2888.3 442575684 442027817 441509361 441790123 441270714 441062775 440998688 441190338 441002388 440218620 439820518
2897.9 439820518 439485207 439530525 439175301 439069023 438505821 437911873 437640152 437313843 437342453 436568680
2907.6 436568680 436646461 436526184 435884743 435551682 435409431 435535774 434613571 433989296 433283806 432840271
2917.2 432840271 432281494 431195602 430739403 430263634 430031471 429732780 430096016 429936066 429765091
2925.9 429765091 429845848 429385147 429501953 429018631 429094849 429017792 429056892 429284821 429014854 429416466
2935.6 429416466 429388847 429807739 430042648 430210609 430370331 430731697 431665688 431593094 431521950 431070671
2945.2 431070671 431387901 431990280 431866035 432259331 432746277 433321800 433319778 433334198 433067932 433372307
2954.8 433372307 433682899 433145485 433627548 433735809 433818359 434295578 435040169 435581436 435973663 436286697
$$ packed form
2888.3D42575684n47867n18456K80762n19409k07939o4087J91650j87950p83768l98102
2897.9D39820518l35311M5318l55224j06278n63202n93948k71721l26309K8610p73773
2907.6D36568680P7781j20277o41441l33061j42251J26343r22203o24275p05490m43535
2917.2D32840271n58777j085892m56199m75769k32163k98691L63236j59950j70975
2925.9D29765091Q0757m60701J16806m83322P6218p7057L9100K27929k69967M01612
2935.6D29416466k7619M18892K34909J67961J59722L61366R33991p2594p1144m51279
2945.2D31070671L17230O02379j24245L93296M86946N75523k022J4420k66266L04375
2954.8D33372307L10592n37414M82063J08261Q2550M77219P44591N41267L92227L13034
$$ plain form
2964.5 436286697 435947151 436213455 436190910 436513863 436664886 436557045 436899223 437206421 438156242 438221703
2974.1 438221703 438274498 438297119 438441238 439108696 439437218 439930077 439863091 440446129 440865784 440834236
2983.8 440834236 441110802 441425400 441685295 441440620 441941605 442027817 442211571 442576027 442528152 442614059
2993.4 442614059 442415619 442779198 442563477 442767944 443185234 442868423 442788315 442709541 442995758 443086739
3003.1 443086739 443320389 442857819 442426758 442708664 442466125 442267838 441905899 441800690 441486626 441264191
3012.7 441264191 441329536 441295319 441024132 440771751 441175499 440535507 440123520 440176392 439846878 439212418
3022.4 439212418 438536911 438669357 438325081 438175926 437851524 437587776 437492943 437072067 436880836 435991325
3032 435991325 435598412 435300140 435355949 435275612 434723854 434851074 434511719 434195518 433467369 432865372
$$ packed form
2964.5D36286697l39546K66304k2545L22953J51023j07841L42178L07198R49821O5461
2974.1D38221703N2795K2621J44119O67458L28522M92859o6986N83038M19655l1548
2983.8D40834236K76566L14598K59895k44675N00985Q6212J83754L64456m7875Q5907
2993.4D42614059j98440L63579k15721K04467M17290l16811q0108p8774K86217R0981
3003.1D43086739K33650m62570m31061K81906k42539j98287l61939j05209l14064k22435
3012.7D41264191O5345l4217k71187k52381M03748o39992m11987N2872l29514o34460
3022.4D39212418o75507J32446l44276j49155l24402k63748r4833m20876j91231q89511
3032D35991325l92913k98272N5809q0337n51758J27220l39355l16201p28149o01997
$$ plain form
3041.6 432865372 432504616 432317810 432122269 431271362 431004105 430592003 430507088 430051765 429421043 429048424
3051.3 429048424 428619270 428877831 428548431 428616333 428111572 426767769 425870514 426043625 426928101 426332321
3060.9 426332321 425677757 425135345 424998283 424678078 424322052 424360085 423296394 423138733 422878418 422086525
3070.6 422086525 421362877 421116829 421275558 420758057 420765991 420597115 420397263 419950829 419317169 418674011
3080.2 418674011 418423462 418583565 417813721 417654419 416945114 416533127 416627617 416075058 415987549 415470352
3089.9 415470352 415219498 414781265 414649162 414348869 413787308 413599091 413103371 413438530 412866058 412338829
3099.5 412338829 412074509 411424942 411069641 410509033 410696640 410625267 410348282 409647064 409621620 409940758
3109.1 409940758 409229393 409104080 408735085 408165016 407263870 407124290 407443123 407121124 407058868 406502724
$$ packed form
3041.6D32865372l60756j86806j95541q50907k67257m12102q4915m55323o30722l72619
3051.3D29048424m29154K58561l29400O7902n04761j343803q97255J73111Q84476n95780
3060.9D26332321o54564n42412j37062l20205l56026L8033j063691j57661k60315p91893
3070.6D22086525p23648k46048J58729n17501P934j68876j99852m46434o33660o43158
3080.2D18674011k50549J60103p69844j59302p09305m11987R4490n52559q7509n17197
3089.9D15470352k50854m38233j32103l00293n61561j88217m95720L35159n72472n27229
3099.5D12338829k64320o49567l55301n60608J87607p1373k76985p01218k5444L19138
3109.1D09940758p11365j25313l68995n70069r01146j39580L18833l21999o2256n56144
$$ plain form
3118.8 406502724 406083107 405601044 405513992 404882202 403824310 403939133 403899574 403647232 403326263 403221855
3128.4 403221855 402685776 402581635 402549362 401986122 401542130 400383453 400080833 400033646 400297699 400125732
3138.1 400125732 399503059 399619522 399099236 399063339 398581924 398410721 398496628 397843895 397441292 396716843
3147.7 396716843 396328354 395906868 396049461 395870285 395415268 395241394 394845238 394992332 394531746 394649734
3157.4 394649734 394714355 394563904 394558220 394184189 394109230 393166962 392485428 392064705 391963310 391754265
3167 391754265 391228714 390981178 390601730 390752907 390213814 390282021 390388260 389928246 389748840 389242172
3176.6 389242172 388936157 387989120 387813148 387181625 386462288 386933060 387136574 387428780 386865120 386563339
3186.3 386563339 386047554 385594330 385580177 385234451 385104256 384581070 384697037 384221840 383621635 383480606
$$ packed form
3118.8D06502724m19617m82063q7052o31790j057892J14823l9559k52342l20969j04408
3128.4D03221855n36079j04141l2273n63240m43992j158677l02620m7187K64053j71967
3138.1D00125732o22673J16463n20286l5897m81415j71203Q5907o52733m02603p24449
3147.7C96716843l88489m21486J42593j79176m55017j73874l96156J47094m60586J17988
3157.4C94649734O4621j50451n684l74031p4959r42268o81534m20723j01395k09045
3167C91754265n25551k47536l79448J51177n39093O8207J06239m60014j79406n06668
3176.6C89242172l06015r47037j75972o31523p19337M70772K03514K92206n63660l01781
3186.3C86563339n15785m53224j4153l45726j30195n23186J15967m75197o00205j41029
$$ plain form
3195.9 383480606 383525925 383660507 382976074 382946472 382305984 381942863 382001686 381507416 381031761 380642281
3205.6 380642281 380808640 380441017 380672035 380294380 379637833 379785805 379668655 380032463 379239120 378533974
3215.2 378533974 378293877 377920837 377867470 377561302 377306824 376925125 376611252 376040840 376057587 375802422
3224.9 375802422 375425453 375603905 375166855 375044670 374844818 374746704 374389648 374223900 374215736 373862495
3234.5 373862495 373899078 373325195 373125343 372848167 372498970 372610512 372849998 372477875 371692162 372202454
3244.2 372202454 371739426 371091843 370760193 370422707 370620956 370122032 370051613 369792099 369740486 369696846
3253.8 369696846 369010315 368455086 368497696 368894806 368408432 368379784 368010483 367511635 367442245 367410851
3263.4 367410851 367282143 366475601 366389771 366018448 365957947 365883598 365750046 365810738 365120659 365503159
$$ packed form
3195.9C83480606M5319J34582o84433k9602o40488l63121N8823m94270m75655l89480
3205.6C80642281J66359l67623K31018l77655o56547J47972j17150L63808p93343p05146
3215.2C78533974k40097l73040n3367l06168k54478l81699l13873n70412J6747k55165
3224.9C75802422l76969J78452m37050j22185j99852r8114l57056j65748q164l53241
3234.5C73862495L6583n73883j99852k77176l49197J11542K39486l72123p85713N10292
3244.2C72202454m63028o47583l31650l37486J98249m98924p0419k59514n1613m3640
3253.8C69696846o86531n55229M2610L97110m86374k8648l69301m98848o9390l1394
3263.4C67410851j28708q06542q5830l71323o0501p4349j33552O0692o90079L82500
$$ plain form
3273.1 365503159 365130920 364703636 364742889 364368286 364212914 363778915 363776093 363213272 362817802 362854118
3282.7 362854118 362849274 362643547 362605515 362941513 362299614 361621094 361067314 361417465 361237717 360868340
3292.4 360868340 361457672 361128311 361038895 360339088 360130348 360198517 359816246 359696274 359062958 359334221
3302 359334221 359107742 358444328 358226814 358433228 357943420 357099838 357404594 357016754 357163963 356702728
3311.7 356702728 355892525 355727310 355418892 355814056 355658646 355684128 355386887 355130539 354774017 354233170
3321.3 354233170 354419250 353649521 352955780 352507324 352575073 352146149 351670265 352363701 352387657 352076263
3330.9 352076263 351221199 350758324 350453453 350464287 350628281 350099945 350134964 349887390 349716568 348977432
3340.6 348977432 348581886 348782043 348386345 348078690 347237206 346789436 346570702 346852036 346863289 346030159
$$ packed form
3273.1C65503159l72239m27284L9253l74603j55372m33999k822n62821l95470L6316
3282.7C62854118m844k05727l8032L35998o41899o78520n53780L50151j79748l69377
3292.4C60868340N89332l29361q9416o99807k08740O8169l82271j19972o33316K71263
3302C59334221k26479o63414k17514K06414m89808q43582L04756l87840J47209m61235
3311.7C56702728q10203j65215l08418L95164j55410K5482k97241k56348l56522n40847
3321.3C54233170J86080p69729o93741m48456O7749m28924m75884O93436K3956l11394
3330.9C52076263q55064m62875l04871J0834J63994n28336L5019k47574j70822p39136
3340.6C48977432l95546K00157l95698l07655q41484m47770k18734K81334J1253q33130
$$ plain form
3350.2 346030159 345630379 345642204 345872307 345193367 345080452 344993591 344255104 343827629 343401527 343288345
3359.9 343288345 342970543 342799835 342225151 342480774 343033066 342416878 342048187 341270714 340513954 340198097
3369.5 340198097 340160408 339650993 339492073 339318504 338541031 339051933 339148827 338964577 338363342 337952080
3379.2 337952080 338410110 337956161 337542686 337365990 337514725 336803627 335989571 336077576 335793037 335863266
3388.8 335863266 336295090 336377296 335484161 334658432 334287186 334440231 334459610 333877754 333610077 333254585
3398.4 333254585 333284874 332709808 332505455 332600403 332180328 332197723 331723175 331698074 331841850 332063522
3408.1 332063522 331136971 329857140 329924507 330051956 330492363 330004120 329922867 329762878 329258881 329031296
3417.7 329031296 328497047 329123154 328922615 328869934 328863602 328625221 328665276 328081055 328111649 327913895
$$ packed form
3350.2C46030159l99780J1825K30103o78940j12915q6861p38487m27475m26102j13182
3359.9C43288345l17802j70708n74684K55623N52292o16188l68691p77473p56760l15857
3369.5C40198097l7689n09415j58920j73569p77473N10902R6894j84250o01235m11262
3379.2C37952080M58030m53949m13475j76696J48735p11098q14056Q8005k84539P0229
3388.8C35863266M31824Q2206q93135q25729l71246J53045J9379n81856k67677l55492
3398.4C33254585L0289n75066k04353R4948m20075J7395m74548k5101J43776K21672
3408.1C32063522r26551j279831O7367J27449M40407m88243q1253j59989n03997k27585
3417.7C29031296n34249O26107k00539n2681o332k38381M0055n84221L0594j97754
$$ plain form
3427.4 327913895 328041306 327700043 327248611 327033691 326884079 327188339 326829376 327227745 326964226 326449776
3437 326449776 325939026 325920029 326331406 325767059 326238136 325668716 325602303 325889587 326082878 326502953
3446.7 326502953 324653473 324424973 324606323 324780693 324779015 324456329 324922638 324873772 324785080 324139748
3456.3 324139748 324650269 325135269 324850922 324957199 324795113 324304619 323389435 323688545 323713608 324104080
3466 324104080 324186325 323929977 324907074 324348259 323690720 323564529 323845863 324051170 324322052 324427795
3475.6 324427795 323797684 323927116 323401794 323474503 323938293 325008163 325108223 323489380 324194679
3484.3 324194679 324353714 323934097 323865318 323991013 323883514 323541756 323921356 323549385 323733597 323863411
3493.9 323863411 323981361 323928642 323642044 323587379 323419952 324125214 324087944 324715500 324472427 323564110
$$ packed form
3427.4C27913895J27411l41263m51432k14920j49612L04260l58963L98369k63519n14450
3437C26449776n10750j8997M11377n64347M71077n69420o6413K87284J93291M20075
3446.7C26502953j849480k28500J81350J74370j678l22686M66309m8866q8692o45332
3456.3C24139748N10521M85000k84347J06277j62086m90494r15184K99110K5063L90472
3466C24104080Q2245k56348R77097n58815o57539j26191K81334K05307K70882J05743
3475.6C24427795o30111J29432n25322P2709M63790J069870J00060j618843P05299
3484.3C24194679J59035m19617o8779J25695j07499l41758L79600l71971J84212J29814
3493.9C23863411J17950n2719k86598n4665j67427P05262l7270O27556k43073r08317
$$ plain form
3503.6 323564110 323908386 323701134 323886681 323562012 324669266 324854698 323913498 324463997 324084740
3512.2 324084740 324008446 323877144 324607048 324924355 324460869 324777756 325163841 325043755 324282837 325363693
3521.9 325363693 325841980 324690857 324260750 324628563 324715538 323862610 323926010 323325119 324102478 324575768
3531.5 324575768 324342384 325242538 325168571 326154060 326015244 324621429 324435997 324922791 325713120 326047134
3541.2 326047134 326994820 327208061 327731018 327254524 326097260 326318893 325249062 325754280 326542358
3549.9 326542358 327699432 328690643 327300453 327155647 326909523 326990547 327555771 327373276 327889366
3558.5 327889366 328227730 327904472 328061447 329573212 329681282 329341316 332374916 331666451 327688751
3567.2 327688751 326893768 326548424 328398514 328676491 328927765 330265388 330689392 330808029 330686264
$$ packed form
3503.6C23564110L44276k07252J85547l24669J107254J85432r41200N50499l79257
3512.2C24084740p6294j31302P29904L17307m63486L16887L86085j20086p60918J080856
3521.9C25363693M78287j151123m30107L67813Q6975q52928O3400o00891P77359M73290
3531.5C24575768k33384R00154p3967R85489j38816j393815j85432M86794P90329L34014
3541.2C26047134R47686K13241N22957m76494j157264K21633j069831N05218P88078
3549.9C26542358J157074R91211j390190j44806k46124Q1024N65224j82495N16090
3558.5C27889366L38364l23258J56975J511765J08070l39966L033600p08465l977700
3567.2C27688751p94983l45344J850090K77977K51274J337623M24004J18637j21765
$$ plain form
3575.9 330686264 331189842 330914116 331894188 332046738 330700111 331421509 332061996 332776794 333046036
3584.6 333046036 335727768 336341438 333623161 334254570 330865898 332440643 334677505 336210213 336505737
3593.2 336505737 335694466 337948189 334649506 335558395 337785988 337157326 338926430 337767220 337147408
3601.9 337147408 337537117 338852539 339956436 341449623 342543983 340678978 343159370 339009590
3609.6 339009590 337024574 342841911 343413658 342182121 343670502 341669006 343938370 346927452
3617.4 346927452 344807434 345345879 343655586 343227501 345376472 345621643 346674080 347999496 348939400
3626 348939400 350124779 355223618 352815056 340943947 345808105 349213829 352983017 352745934 350336647
3634.7 350336647 352061920 353787155 354998627 353830643 354154091 355154076 356637039 357012062 356489944
$$ packed form
3575.9C30686264N03578k75726R80072J52550j346627P21398O40487P14798K69242
3584.6C33046036K681732O13670k718277O31409l388672J574745K236862J532708K95524
3593.2C36505737q11271K253723l298683R08889K227593o28662J769104j159210o19812
3601.9C37147408L89709J315422J103897J493187J094360j865005K480392m149780
3609.6C39009590j985016N817337N71747j231537J488381k001496K269364K989082
3617.4C46927452k120018N38445j690293m28085K148971K45171J052437J325416R39904
3626C48939400J185379N098839k408562j1871109M864158L405724L769188k37083k409287
3634.7C50336647J725273J725235J211472j167984L23448R99985J482963L75023n22118
$$ plain form
3643.4 356489944 358329659 360651970 365405464 363186646 359535675 363216248 362137375 358352776
3651.1 358352776 355503311 360678444 363894310 366734314 370234756 362644501 363343430 366370888
3658.8 366370888 366991348 367243080 367395973 368935966 369136925 369886856 370449524 370775986 374321175
3667.5 374321175 376335983 375045853 374518929 368437805 370422821 378026161 386145859 386998520 367263260
3676.2 367263260 369280090 376399803 379374313 376834602 376246300 378123589 379503098 380973930
3683.9 380973930 380436249 380380363 384147186 389294777 381068192 376737442 383091583 377221031 378120079
3692.6 378120079 382363663 381916695 383317719 383078232 383000870 383652496 384310760 387039909 389116631
3701.3 389116631 384174232 381519089 384995079 385209885 384732704 384093437 386749229 391363220 385163918
$$ packed form
3643.4C56489944J839715K322311M753494k218818l650971L680573j078873l784599
3651.1C58352776k849465N175133L215866K840004L500442p590255O98929L027458
3658.8C66370888O20460K51732J52893J539993K00959P49931N62668L26462L545189
3667.5C74321175K014808j290130n26924o081124J985016P603340Q119698Q52661j9735260
3676.2C67263260K016830P119713K974510k539711n88302J877289J379509J470832
3683.9C80973930n37681n5886L766823N147591q226585m330750O354141n870552Q99048
3692.6C78120079M243584m46968J401024k39487p7362O51626O58264K729149K076722
3701.3C89116631m942399k655143L475990K14806m77181o39267K655792M613991o199302
$$ plain form
3709.9 385163918 388736839 390832100 378378334 381572838 385426903 385402336 385376968 387482910 388080330
3718.6 388080330 384996643 385391159 390580978 387816086 383215866 388012848 390138931 389970512 384881935
3727.3 384881935 384321022 387440186 388605499 394299774 390232582 384288406 392581558 393227844 383447990
3736 383447990 382289581 383251762 382909050 385854263 388515015 386218338 389911995 401870918 392421417
3744.7 392421417 373926697 383048019 387836418 393347321 387914391 380170631 390934944 382660789
3752.4 382660789 376425972 382009239 386048927 387994347 383228874 385671196 390464020 382665100
3760.1 382665100 380989380 384679298 384621086 385396347 388401146 384978142 380400124 383629417 388838196
3768.8 388838196 387665863 380005531 381854210 384313889 384128342 384424706 383902016 384116898 384956932
$$ packed form
3709.9C85163918L572921K095261j2453766L194504L854065k4567k5368K105942N97420
3718.6C88080330l083687L94516N189819k764892m600220M796982K126083j68419n088577
3727.3C84881935n60913L119164J165313N694275m067192n944176Q293152O46286r779854
3736C83447990j158409R62181l42712K945213K660752k296677L693657J1958923r449501
3744.7C92421417j8494720R121322M788399N510903n432930p743760J0764313q274155
3752.4C82660789o234817N583267M039688J945420m765473K442322M792824p798920
3760.1C82665100j675720L689918n8212P75261L004799l423004m578018L229293N208779
3768.8C88838196j172333p660332J848679K459679j85547K96364n22690K14882Q40034
$$ plain form
3777.4 384956932 387690926 387542725 380386543 382730064 384526215 384046936 385236130 382530746 381809731
3786.1 381809731 382140999 382883492 383434258 382615433 383060341 382887764 382886162 382271805 384482574 387938538
3795.8 387938538 384053955 380131531 381069832 385780029 391430931 385300179 374760323 377019958
3803.5 377019958 379736595 384043121 388448753 377505913 374716949 379578094 381785698 381936302
3811.2 381936302 381395569 381455612 382492752 389101334 387728577 373839073 378315010 383277168 388207130
3819.9 388207130 387719460 371058884 372926674 378079453 380212784 382901421 382880707 378427696 378999939
3828.6 378999939 379941902 382406082 382281342 374254913 378997192 385603523 378721275 377806664 385872917
3837.2 385872917 377792435 374948807 381480064 375205917 376101303 381281929 377986565 374089394
$$ packed form
3777.4C84956932K733994j48201p156182K343521J796151m79279J189194k705384p21015
3786.1C81809731L31268P42493N50766q18825M44908j72577j602o14357K210769L455964
3795.8C87938538l884583l922424R38301M710197N650902o130752j0539856K259635
3803.5C77019958K716637M306526M405632j0942840k788964M861145K207604J50604
3811.2C81936302n40733O0043J037140O608582j372757j3889504M475937M962158M929962
3819.9C88207130m87670j6660576J867790N152779K133331K688637k0714m453011N72243
3828.6C78999939R41963K464180j24740q026429M742279O606331o882248r14611Q066253
3837.2C85872917q080482k843628O531257o274147Q95386N180626l295364l897171
$$ plain form
3844.9 374089394 376471329 377575836 377903137 380419388 379109955 380880470 384795570 381166801
3852.7 381166801 381573982 363419418 367292557 376571808 375545387 373557854 375672836 378553925
3860.4 378553925 380481529 375031013 375611305 381355782 373655663 369855309 373730125 378486137
3868.1 378486137 384035530 375152931 366817856 369905396 376066971 378955269 369659920 370011482
3875.8 370011482 373305092 373491631 375682678 379628487 372962036 367554054 372573280 372657585 374909821
3884.5 374909821 379061508 367529716 367834778 371482544 372218704 376371460 375847435 367750893 368936501
3893.2 368936501 371312675 370601654 371016197 371497002 374241714 374891243 366385651 370570145 372148437
3901.8 372148437 368142319 372541847 368717270 366528587 366528015 366776695 368832321 368292465 368459625
$$ packed form
3844.9C74089394K381935J104507L27301K516251j309433J770515L915100l628769
3852.7C81166801M07181j8154564L873139R279251j026421j987533K114982K881089
3860.4C78553925J927604n450516N80292N744477p700119l800354L874816M756012
3868.1C78486137N549393q882599q335075L087540O161575K888298r295349L51562
3875.8C70011482L293610J86539K191047L945809o666451n407982N019226Q4305K252236
3884.5C74909821M151687j1531792L05062L647766P36160M152756n24025q096542J185608
3893.2C68936501K376174p11021M14543M80805K744712O49529q505592M184494J578292
3901.8C72148437m006118M399528l824577k188683n72K48680K055626n39856J67160
$$ plain form
3910.5 368459625 367771606 367935181 367885170 367124252 369353104 370766983 366379242 362791100 367635574
3919.2 367635574 367420616 363498077 366336899 367603531 368406525 365477409 362779541 364505119 366033592
3927.9 366033592 367057228 364793854 364524841 365849495 363964348 363502350 364895592 364640312 364101753
3936.6 364101753 364478493 363666382 363162384 362411995 364007034 365320854 361710243 361580544 361635818
3945.2 361635818 362603569 364129448 361980820 362284126 362189522 360362740 361389198 361546593 360261459
3953.9 360261459 360297127 360795403 360696602 359923248 360115967 360483742 360654945 360538635 359108849 359638367
3963.6 359638367 359375267 358536835 359418678 359644165 359890404 358829041 358328667 358635406 357945518
3972.2 357945518 357712860 358044014 358479881 357844162 357593498 357037582 356340446 356194534 356162186 356836090
$$ packed form
3910.5C68459625o88019J63575n0011p60918K228852J413879m387741l588142M844474
3919.2C67635574k14958l922539K838822J266632Q02994k929116k697868J725578J528473
3927.9C66033592J023636k263374k69013J324654j885147m61998J393242k55280n38559
3936.6C64101753L76740q12111n03998p50389J595039J313820l610611j29699N5274
3945.2C61635818R67751J525879k148628L03306r4604j826782J026458J57395j285134
3953.9C60261459L5668M98276r8801p73354J92719L67775J71203j16310j429786N29518
3963.6C59638367k63100q38432Q81843K25487K46239j061363n00374L06739o89888
3972.2C57945518k32658L31154M35867o35719k50664n55916o97136j45912l2348O73904
$$ plain form
3981.9 356836090 356380081 356022606 355935555 356257439 356643524 356085205 356139412 356347389 356036072 354986153
3991.5 354986153 355014076 355186119 355029640 355151596 354797707 354620476 353833160 354616814 355402107
4000.2 355402107
$$ packed form
3981.9C56836090m56009l57475q7051L21884L86085n58319N4207K07977l11317j049919
3991.5C54986153K7923J72043j56479J21956l53889j77231p87316P83654P85293
4000.2C55402107
##END=$$ End of the data block
