##TITLE=$$ Begin of the data block
##JCAMP-DX=5.00 $$ ACD/SpecManager v 10.08
##SPECTROMETER/DATA SYSTEM=Varian
##DATE=04 Dec 2012 14:52:16
##DATA TYPE=INFRARED SPECTRUM
##DATA CLASS=XYDATA
##ORIGIN=
##OWNER=
##NPOINTS=3735
##FIRSTX=399.26403809
##LASTX=4000.35498047
##MAXX=4000.35498047
##MINX=399.26403809
##MAXY=70.06504822
##MINY=32.37068558
##XFACTOR=1.0000000000
##YFACTOR=0.000000100000000
##FIRSTY=66.71321106
##DELTAX=0.96440572
##XUNITS=1/CM
##YUNITS=TRANSMITTANCE
##XYDATA=(X++(Y..Y))
399.3F67132111K512970j8857117K2923508q78678j760788j1358337j946945R583206
407F67349930J85547Q461456j3941269L812714m359207k327729O368485k127304k739334
415.7F60683289j2890702M819641j0663681K9319687Q72498j2814255O799393k301026
423.4F63824844M457322r128647N187454M82101j184616Q89817j1757355N065231k189865
432.1F55646286O760788j248245k931748N066986m82330P106934n134659L615036l571320
440.7F64827728k112655l27912j180420Q294831q234253M450683O31180N241165n42679
449.4F71047668r517974L085632n722580K680435l32718M282456j766892l960571O550522
458.1F66345978o197510L076859m463501L812866j606980j079559L701935P39288P695770
$$ plain form
399.3 667132111 669645081 650787964 673711472 672832794 671072006 659713669 657766724 667349930
407 667349930 667535477 675996933 662055664 665868378 661509171 659181442 665549927 663422623 660683289
415.7 660683289 647792587 652612228 641948547 671268234 672140732 659326477 666125870 663824844
423.4 663824844 668282166 659153519 664340973 664823074 663638458 664528275 652770920 657836151 655646286
432.1 655646286 662407074 661158829 658227081 663294067 662811737 669918671 664784012 668399048 664827728
440.7 664827728 662715073 662387161 661206741 669501572 661267319 665718002 666349182 671590347 671047668
449.4 671047668 661529694 664615326 658892746 661573181 661240463 665522919 663756027 659795456 666345978
458.1 666345978 660148468 663225327 658761826 662574692 660967712 659888153 663590088 664329376 672025146
466.8F72025146p515640K926026o10047m85687j219482j4603730J254578P62405P820893
475.5F60354462N64041N394897O32859j0062409m665756m53797J0016099n037995k58102
484.1F56484299l29056l819275K643585n63049N259476m20685M802551r88388m860458
492.8F58209000l670426k638550N274735l074112K460022O17371L625488L400040l767930
501.5F60435638k099533l455886K373428m311600n64957K534790M322205R60465m346924
510.2F55847626N076980k939071Q58764j307983m980316j159897j780014K682648l732529
518.9F48566208L355789K755585K501373R33533l552933Q83865k626495J666641l074798
527.5F51408768j955185J622238Q34656K975235K033157L421173l523559o42395N21469
$$ plain form
466.8 672025146 664509506 667435532 666825485 666339798 665120316 650516586 651771164 652533569 660354462
475.5 660354462 660918503 666313400 666946259 656883850 652218094 651764297 661780396 656742401 656484299
484.1 656484299 656155243 652335968 654979553 654416504 659675980 659255295 664057846 663069458 658209000
492.8 658209000 654538574 651900024 657174759 654100647 656560669 657178040 660803528 664203568 660435638
501.5 660435638 658336105 654880219 657253647 652942047 652377090 654911880 659234085 660194550 655847626
510.2 655847626 660924606 657985535 658844299 657536316 652556000 651396103 649616089 652298737 648566208
518.9 648566208 651921997 654677582 657178955 658112488 654559555 655443420 652816925 654483566 651408768
527.5 651408768 649453583 651075821 651910477 654885712 656918869 660340042 656816483 656174088 656695557
536.2F56695557k978592k101288j84555K183304r63440N678787K135620K61002K480316
544.9F63206711j482620J84860m064408j810607j481553R73969R16672j35727L248749
553.6F59556046j182938p477p10602O89164m02604l36151n02853n099716j431275j648178
563.2F48923416J822968P18918Q91342K291565j844483j03760k715911p54548j154251
571.9F48075256m78210K38800n47638R63058M00849K890091q77533J357040J022034
580.6F53043747j185761k12631k878265J402817o80085O05011J943207J998673K396087
589.3F56432800l87649J297760j491318k36816j039582j03607o2332j466522K634811
597.9F55577545Q18253J909332N3406o70319j504059j596298N52902k396164o83364
$$ plain form
536.2 656695557 653716965 651615677 651431122 653614426 652650986 658329773 660465393 660726395 663206711
544.9 663206711 661724091 661908951 657844543 656033936 654552383 655526352 656443024 656307297 659556046
553.6 659556046 658373108 658365631 657655029 658344193 657941589 657605438 657102585 652002869 650571594 648923416
563.2 648923416 650746384 651465302 652356644 654648209 652803726 652699966 649984055 649229507 648075256
571.9 648075256 647597046 647835846 647288208 648251266 648652115 651542206 650664673 652021713 653043747
580.6 653043747 651857986 651645355 648767090 650169907 649489822 650094833 652038040 654036713 656432800
589.3 656432800 656045151 657342911 655851593 655614777 654575195 654471588 654409256 652942734 655577545
597.9 655577545 656395798 658305130 658358536 657688217 656184158 654587860 655140762 652744598 652061234
606.6F52061234o10123J303863R62296J550293Q34350j435546K101593j094666m07257
615.3F55266037j475449J59455J728973M25110L059311p60269J823044L77731J14517
624F60718460J330566j296005J150284j180420M54407P5912Q18100Q67081p2479K404251
633.6F65270157N95398J697922j421738j088791r41467q28324J535416o97021Q86535
642.3F65008087L39356J270904j09253O56204P06788j373826K034455j167450k31018
651F67134247q55560j021195J030960N59311J667786j84098Q17872o36597O97021J91880
660.6F69401627j431351n0354j368637N25894k7084K430343J976776j120910J707916
669.3F72044220k466583k06375k36969R80224M0436m03519L18146l85742J909103R19113
$$ plain form
606.6 652061234 651451111 652754974 653717270 655267563 656101913 654666367 656767960 655673294 655266037
615.3 655266037 653790588 653950043 655679016 656104126 659163437 658403168 660226212 660603943 660718460
624 660718460 662049026 660753021 661903305 660722885 661177292 661253204 662071304 662938385 662865906 665270157
633.6 665270157 665865555 667563477 666141739 665052948 664111481 663283157 664818573 664121552 665008087
642.3 665008087 665347443 666618347 666509094 667165298 667872086 666498260 668532715 667365265 667134247
651 667134247 666278687 665257492 666288452 666847763 668515549 668331451 669149323 668512726 669209747 669401627
660.6 669401627 667970276 667919922 666551285 667077179 667050095 669480438 671457214 670336304 672044220
669.3 672044220 669577637 669371262 669134293 670114517 670154953 669751434 670069580 669683838 671592941 672512054
678.9F72512054N98069j593476k10418M57077p1335O99310j548614L59726k83738J309510
688.6F72228165O91986m30451L37143j579056q392j067123K87628n72510p10525J017837
698.2F70194702m19845J03836j089020n3635j027374l92532J07727j336975m28391
706.9F65658493m06799J348572n26276k32163L38822O66046J459656J90124R18350
715.6F69414825o25610R31320M73404J384812J475677j466293L9215j291733J490250
724.3F71825867J073379O57501K209092Q53805Q02231q67538J274871L01209L3798
733F78164215k89917o61774J315308k14004Q80355o16531J32828N65490J64338q7891
742.6F79352417j030655J278381j589889j072998j405640j198730j57089n60608K009048
$$ plain form
678.9 672512054 673110123 671516647 671306229 671763306 671691971 672391281 670842667 671202393 670918655 672228165
688.6 672228165 672920151 672489700 672826843 671247787 671239395 670172272 670459900 669887390 669176865 670194702
698.2 670194702 669774857 669878693 668789673 668736038 667708664 667316132 667423859 666086884 665658493
706.9 665658493 665251694 666600266 666073990 665841827 666180649 666846695 668306351 668496475 669414825
715.6 669414825 668789215 669720535 670193939 671578751 673054428 671588135 671627350 670335617 671825867
724.3 671825867 672899246 673556747 675765839 676619644 677421875 676554337 677829208 678130417 678164215
733 678164215 677874298 677212524 678527832 678313828 679194183 678577652 678710480 679275970 679440308 679352417
742.6 679352417 678321762 679600143 678010254 676937256 675531616 674332886 674175797 673615189 675624237
751.3F75624237j110992p46766j051864q71735N24216j323319j657485j828843J191101
760F68748550M52271P11517j18179n40924J637039m38080M20761J66855J196137q5755
769.6F72150192l16314J190795K92283K581558P65610Q86459M49600M22974O02493
778.3F79025650j5106J353988j136779Q32061L04184M63486J649399Q00018J534882
787F84811783R3994J307144q67386O51779J157837q71505M39987p39289J241074N84946
796.6F87810364J097259J104431Q46787J336441L80936J146240j215515P89413Q82035
805.3F94178391P23419J382065M24804J464081J91345Q31223n80902N14602p03430
814F98425598j301956P24945p57294K009049l94135n97458L64914Q35343J341476j349640
$$ plain form
751.3 675624237 674513245 673766479 672714615 671842880 672367096 671043777 669386292 667557449 668748550
760 668748550 669200821 669912338 669794159 669253235 670890274 670452194 670872955 671039810 672235947 672150192
769.6 672150192 671833878 673024673 673316956 675898514 676664124 677550583 678000183 678423157 679025650
778.3 679025650 679010544 680364532 679227753 680059814 680363998 680827484 682476883 683276901 684811783
787 684811783 684905777 686212921 685345535 685997314 687155151 686283646 686723633 685984344 687225418 687810364
796.6 687810364 688907623 690012054 690858841 692195282 692576218 693722458 692506943 693296356 694178391
805.3 694178391 694901810 696283875 696708679 698172760 698364105 699195328 698614426 699129028 698425598
814 698425598 697123642 697848587 697091293 699100342 698706207 698108749 698473663 699309006 700650482 699300842
823.6F99300842K90604j886292q72955m24728r94492R1858r53217R1401j587296p04117
833.3F92351608o64367k48566j101532k323532o23474k058792p55234o48041L93906
841.9F84321976J08871M48075J142959j565781o76879r90754O31943j130295j318054
850.6F80972061Q46863o60782P60346N19943J112900K62985J372299Q08716j715546
859.3F84279785l60031o45218N63584p41349J076737K342376J379624J192169l39127
868F88748550J595459N46418J449508J62812r37043M79737l11051K010956J704559
876.7F95449905K051468j59301m41514R42841j071625j213150k175064j132736j854324
885.3F90396500n51529l24936k74887N62210j605377J26724j387406q04214r49097
$$ plain form
823.6 699300842 699591446 697705154 696832199 696407471 695412979 695504837 694551620 694643021 693055725 692351608
833.3 692351608 691687241 691438675 690337143 688013611 687390137 685331345 684576111 683928070 684321976
841.9 684321976 684430847 684878922 686021881 684456100 683779221 682788467 683420410 682290115 680972061
850.6 680972061 681818924 681158142 681918488 682438431 683551331 683814316 685186615 685995331 684279785
859.3 684279785 683919754 683274536 683838120 683096771 684173508 686515884 687895508 689087677 688748550
868 688748550 690344009 690890427 692339935 692502747 691565704 692045441 691734390 693745346 695449905
876.7 695449905 697501373 697342072 696900558 697843399 696771774 695558624 693383560 692250824 690396500
885.3 690396500 689844971 689520035 689245148 689807358 688201981 688328705 686941299 686137085 685187988
894F85187988j693802n39016k133255o8970K39181P77283j02997K06681Q39996j088638
903.7F81624451n37720k677002k168045j362991m38233j55792n91888P29599n08805
912.3F73913574k9297r71374j582184k327271k378616j122513j018753J50223r14154
921F63719635K91824N16587M29611L50113r32312n88379k026825j472244j597214j72424
930.7F58518372M30145P15027K659073Q64944J106567N14222J80893q60062j232681
939.3F62896500L42788J28708P08771k80838K030334K501450J666641J843033O2637
948F71900024K52304j335830j351090k169952j143341N88302j78833M65699r75647
956.7F66051636j59836o96182j511536k026215k902526j925965k733841k063827j550064
$$ plain form
894 685187988 683494186 682955170 680821915 680752945 680992126 681769409 681666412 681873093 682713089 681624451
903.7 681624451 681086731 678409729 676241684 674878693 674440460 674284668 673692780 674422379 673913574
912.3 673913574 673884277 672912903 671330719 669003448 666624832 665502319 664483566 664633789 663719635
921 663719635 664011459 664528046 664957657 665307770 664375458 663787079 661760254 660288010 658690796 658518372
930.7 658518372 658948517 659663544 662322617 663187561 664294128 664808350 664989243 664129181 662896500
939.3 662896500 663239288 663367996 664076767 663795929 665826263 668327713 669994354 671837387 671900024
948 671900024 672152328 670816498 669465408 667295456 666152115 666740417 666561584 667027283 666051636
956.7 666051636 665891800 665195618 663684082 661657867 658755341 656829376 654095535 652031708 650481644
965.4F50481644N2795j46713p98798j5869j291046j729584k864380k734222l314819
974.1F37639008k627755j393776r98802J50719q57277n94902j123009j326332k057876
982.7F26809998k217598j793137k308807q02079j063461K58522J23329P34024J493721
991.4F21234512m55169J42059j562653j458206j286201q09174J65329k89192M89006
1000.1F16170311m42009J242828J069641J39046j87835j814957j533318j432457m17137
1008.8F12794113o45599L39241k10838K4566J520233n28183J98746m24728j448403
1017.5F11619148j711616r35478k54746p38373O82564N89638J375084O73446L33481
1026.1F11633148J56822o75697l56483j463547j22795j65100j1216J42327P67097J885643
$$ plain form
965.4 650481644 650534439 650387726 649588928 649573059 648282013 646552429 643688049 640953827 637639008
974.1 637639008 635011253 633617477 632618675 632769394 631912117 631317215 630194206 628867874 626809998
982.7 626809998 624592400 622799263 620490456 619688377 618624916 618883438 619006767 619740791 621234512
991.4 621234512 620779343 620921402 619358749 617900543 616614342 615805168 615970497 615681305 616170311
1000.1 616170311 615728302 616971130 618040771 618179817 617991982 616177025 614643707 613211250 612794113
1008.8 612794113 612148514 612487755 612276917 612301483 613821716 613293533 613492279 613067551 611619148
1017.5 611619148 609907532 608972054 608717308 607978935 608661499 609251137 610626221 611299667 611633148
1026.1 611633148 611789970 611114273 610757790 609294243 609171448 609006348 608995132 609137459 609904556 611790199
1035.8F11790199P10755J055946j75590n58815k179032j111870P71370j118660K76032
1044.5F09460335K98424J641311J132317l41759N30129J63383j63345r73854O23130
1053.1F12370071l45115k74811O34575k7733O52008O13594J690331Q19969J500473
1061.8F17633362P3166j544266J76849q8844O26907N5695P60345Q30994R79080J35422
1071.5F19638710j183357j32828k005959j554527k664680j947060P07665R92851J304474
1080.1F13155289k00119K16064k55775J11885l72353m47540J34621j203957M81110
1088.8F11619225O13708J398048N94826J63346J254043K99339J39656j190147j51024
1097.5F14741020J52436K89955k28882k34986J275979L7994Q56628l03764n69687j45607
$$ plain form
1035.8 611790199 612500954 613556900 613381310 612822495 610643463 609531593 610302963 609184303 609460335
1044.5 609460335 609758759 611400070 612532387 612190628 612720757 612884140 612720795 611746941 612370071
1053.1 612370071 612024956 611750145 612384720 612356987 613008995 613622589 615312920 616132889 617633362
1061.8 617633362 617706528 616162262 616339111 616250267 616877174 616932869 617693214 618524208 619503288 619638710
1071.5 619638710 618455353 618322525 616316566 614762039 612097359 610150299 610857964 611850815 613155289
1080.1 613155289 612955170 613171234 612915459 613027344 612654991 612207451 612342072 611138115 611619225
1088.8 611619225 612232933 613630981 614225807 614389153 615643196 615942535 616082191 614892044 614741020
1097.5 614741020 614893456 615183411 614954529 614719543 615995522 616033516 616890144 616586380 616016693 615871086
1107.1F15871086n94520m36402m54025J137047o11P07970K13623Q1482N02930j091652
1116.8F15936928O93435j220K37694n13802o35033J350594M07104Q25539N09682K26478
1126.4F19037399M2038Q40225J93367o58035M58260j31226O76193K63749K71110j9646
1136.1F20973434l0098P30248k86865l60871j153068n40619j432266j224327J61934
1144.8F16837502l03917L7727p10602l39813r38187k54326j09787r78164m71192n34095
1154.4F12235146P53555m89159J08376K97203q75435K34489P07894J208534q36067
1163.1F13344536l10211R42726O30569P83539M14009J133309J071853J387215O00052
1171.8F19997597J172065J715966R11789J420746Q73184J231155J089554K236404J581498
$$ plain form
1107.1 615871086 615276566 614840164 614386139 615523186 615522575 616230545 616444168 616525650 617028580 615936928
1116.8 615936928 616630363 616629143 616866837 616353035 615718002 617068596 617475700 618301239 618810921 619037399
1126.4 619037399 619079437 619919662 620113029 619454994 619913254 619782028 620458221 620721970 620993080 620973434
1136.1 620973434 620943336 621673584 621386719 621025848 619872780 619332161 617899895 616675568 616837502
1144.8 616837502 616533585 616571312 615860710 615520897 614582710 614328384 614218597 613240433 612769241 612235146
1154.4 612235146 612988701 612499542 612607918 612905121 612029686 612264175 612972069 614180603 613344536
1163.1 613344536 613034325 613977051 614607620 615391159 615805168 616938477 618010330 619397545 619997597
1171.8 619997597 621169662 622885628 623797417 625218163 626091347 627322502 628412056 630648460 632229958
1180.4F32229958M66613J687966R32693J052742k48832M60281J295242O01235M43382
1189.1F38921280k87514J404152P39517L36075k10037p07016j33209m09966P20787
1197.8F40374069o58798n93414q5984L45345Q93288k93885L42484K66037Q2702o29730
1207.4F40042114J145O39419M2572K19116n5236R50012R36127J305389M85458m11377
1217.1F44154739J82648l24325K13699m85993L4638L18680K7237L42254l66668k27509
1226.7F43869400m50287j20621o49719k33917j30386p19300k7542l56598N83573L63159
1236.4F42127762k80152n89981k34069J98440n54428n3024m90341L27529M55323K823
1246F40909882K85034J04217P17011l24249l85972k39410o9351J40610K22168M53414
$$ plain form
1180.4 632229958 632696571 634384537 635317230 636369972 636121140 636581421 637876663 638477898 638921280
1189.1 638921280 638633766 640037918 640777435 641113510 640903473 640196457 640063248 639653282 640374069
1197.8 640374069 639715271 639121857 639035873 639381218 640274506 639980621 640323105 640589142 640671844 640042114
1207.4 640042114 640043259 640682678 640725250 640944366 640889130 641839142 642775269 644080658 644566116 644154739
1217.1 644154739 644337387 644013062 644226761 643740768 643775406 644094086 644121323 644463577 644096909 643869400
1226.7 643869400 643419113 643298492 642648773 642414856 642284470 641565170 641537628 641181030 641764603 642127762
1236.4 642127762 641847610 641257629 641023560 641222000 640667572 640614548 640124207 640451736 640907059 640909882
1246 640909882 641194916 641299133 642016144 641691895 641305923 641066513 640997162 641137772 641359940 641813354
1255.7F41813354l51867M57687J00327L27072M48761k28424J10321j27716M44870k04315
1265.3F42790070K06527O0425m1428N91584j70517N71136P935n6153l95736k97394
1274.9F43266449M24042l65067J68076m6768J74102J17264K14996Q1177p75146j35498
1284.6F43123627q5297j07040o56967l84141n31158m30984M12750J33743J21079o12717
1294.2F40982895k2659k68097o62079m61731l83644K01301p74650p4501J4763j39885
1303.9F38411713j79406j98707L92074n84678l97568p28302j61362K95906N98908L73917
1313.5F37822495j094933K55356j37902k98500n51071j054001m63256o37017j28822
1322.2F33712349o67114M5547l16696l65715J33858m50287K8992p51763m83246p20291
$$ plain form
1255.7 641813354 641461487 641919174 642019501 642346573 642795334 642566910 642677231 642549515 642994385 642790070
1265.3 642790070 642996597 643057022 643015594 643607178 643436661 644007797 644015732 643959579 643563843 643266449
1274.9 643266449 643690491 643325424 643493500 643446732 643620834 643738098 643953094 644034271 643259125 643123627
1284.6 643123627 643038330 642931290 642274323 641890182 641359024 640928040 641340790 641474533 641595612 640982895
1294.2 640982895 640960236 640692139 640030060 639568329 639184685 639385986 638611336 638536835 638551598 638411713
1303.9 638411713 638232307 638033600 638425674 637840996 637443428 636715126 636553764 636849670 637448578 637822495
1313.5 637822495 636727562 636982918 636845016 636546516 635995445 634941444 634478188 633841171 633712349
1322.2 633712349 633045235 633090782 632774086 632408371 632542229 632091942 632120934 631369171 630885925 630165634
1331.8F30165634l16810j06163m49944J81046p10717J78490J41258m7340m01039l78876
1341.5F28255539M40292p69386l75557j23558j1368j10702K8495L67013k97242p0495
1351.1F27333031n05371l27225n57633l03917m32472o58111K24266k18086N31158J73759
1360.8F25259399J52474j11427k176781l31345J40419j54953J46408L76015p94296
1369.4F22505913k92282K46925N35469Q72688j428833l76739K8190J30196n7259o43577
1379.1F21520691L2082n95055K17132o1645L84331O07223O12641J286659j580887j76048
1388.7F22247124M67643L15438J68304K40288J634026l90816j512413L58772Q35991
1397.4F24364357L24516j209564j247482k68212o0653k67754Q48961j096687r01909
$$ plain form
1331.8 630165634 629848824 629742661 629292717 629473763 628763046 628941536 629082794 629035454 628634415 628255539
1341.5 628255539 628695831 627926445 627550888 627427330 627415962 627305260 627333755 627700768 627403526 627333031
1351.1 627333031 626827660 626500435 625942802 625638885 625206413 624548302 624772568 624554482 625085640 625259399
1360.8 625259399 625411873 625300446 623123665 622792320 622932739 622777786 622924194 623300209 622505913
1369.4 622505913 622213631 622460556 622996025 623868713 622439880 622063141 622091331 622221527 622164268 621520691
1379.1 621520691 621552773 620957718 621174850 621113205 621497536 622104759 622717400 624004059 622423172 622247124
1388.7 622247124 622714767 623030205 623198509 623438797 625072823 624682007 623169594 623528366 624364357
1397.4 624364357 624688873 623479309 622231827 621963615 621902962 621635208 622484169 621387482 620485573
1406.1F20485573Q55331j23367J14517l53393k61765o03523l97911J57814k21367M94957
1415.7F20146866N8021J134949J634941l959732j469116J526337Q02307Q6822j306801
1424.4F18654594q28857R55811L25584P94105R35135j241111l38784N77927N8136m19617
1434.1F19472923J547928J674614m761543q18291K103577J021805L10287K36473m92172
1442.7F20295601L0823o5270l52135N58930p8240j681900k04734J692161M70848p55424
1452.4F19910660K14424J011772J272278q92906l590355j915779J618385L36609J154594
1461.1F19119682J085701J80855K285652r33799j245270J173019Q30765Q87680M22897
1469.7F23807182K756996K202034n24597j590500J362305L830338l66936L6430J872864
$$ plain form
1406.1 620485573 621340904 621217537 621332054 620978661 620716896 620113373 619715462 619873276 619651909 620146866
1415.7 620146866 620204887 621339836 622974777 619015045 617545929 619072266 619874573 619961395 618654594
1424.4 618654594 617825737 618781548 619107132 619901237 620836372 619595261 619256477 619834404 619892540 619472923
1434.1 619472923 621020851 622695465 617933922 617115631 619219208 620241013 620551300 620787773 620295601
1442.7 620295601 620326424 620261154 619909019 620467949 620389709 618707809 618503075 620195236 620666084 619910660
1452.4 619910660 620125084 621136856 622409134 621516228 617925873 616010094 617628479 617965088 619119682
1461.1 619119682 620205383 620386238 622671890 621738091 620492821 621665840 622496605 623384285 623807182
1469.7 623807182 626564178 628766212 628241615 626651115 628013420 631843758 631476822 631513252 633386116
1478.4F33386116J192093J399727O58836L77083J444397J328697Q85887K570725P73697
1487.1F44017258l94974K906799P36084k643661O09207K349090J286469K436981K669296
1495.8F53972549l799438K760086J994858k288590J714249R33685l88412J134567L034897
1504.5F59068451L319626l646393o165161K728576K555008J110383K484817M96979
1512.2F61952286k509690J568070J709976J457062M09241o342392L708114N737152
1519.9F67689819Q2169m366608l392029K746506L387757k027054o34690J652527o51169
1528.6F64487228l98483J621628Q26950J619949O77948n762024J491089J753083K334365
1537.2F68651733M712449j078644j0891953L809281J598816j592255L169174M9133
$$ plain form
1478.4 633386116 634578209 635977936 636636772 637013855 638458252 639786949 640672836 643243561 644017258
1487.1 644017258 643622284 646529083 647265167 644621506 645230713 647579803 648866272 651303253 653972549
1495.8 653972549 650173111 652933197 654928055 652639465 654353714 655287399 654898987 656033554 659068451
1504.5 659068451 662388077 658741684 652576523 655305099 657860107 658970490 661455307 661952286
1512.2 661952286 659442596 661010666 662720642 664177704 664586945 658244553 661952667 667689819
1519.9 667689819 667771988 663405380 660013351 662759857 666147614 664120560 663485870 665138397 664487228
1528.6 664487228 664088745 665710373 666537323 668157272 668835220 663073196 664564285 666317368 668651733
1537.2 668651733 673364182 672285538 661393585 665202866 666801682 665209427 668378601 668427734
1545F68427734l543930J385422Q72727J891021j7776l691941R21402K186051K161102
1553.6F70591812l493729j156921N186997M977188q159409m062271k939606L506012
1561.4F64450073K730408Q05588J367035j874390r50699J173401J622162K362137o806259
1570F64879456m62037J817170j03073M07333K230301J545868q865280J662979J574096
1578.7F64686813m72412m28009j100921r6817k99225n036o00509p22199k32925p0496
1588.4F60658264o0501q11386j92032j754150q23746n52444j411744k12936r23615
1597F53915710j19323q83179n82047p96432j345673j104812k508774j113205m53873
1605.7F45008392k11792k023849q57697o63376k484397m72527j495323p02858q96454
$$ plain form
1545 668427734 664883804 666269226 667141953 669032974 669015198 665323257 666244659 668430710 670591812
1553.6 670591812 667098083 665941162 671128159 676105347 667945938 663883667 660944061 664450073
1561.4 664450073 667180481 667986069 669353104 667478714 666528015 667701416 669323578 671685715 664879456
1570 664879456 664417419 666234589 666131516 666538849 668769150 670315018 661449738 663112717 664686813
1578.7 664686813 664214401 663786392 662685471 662588654 662289429 662284393 661683884 660961685 660728760 660658264
1588.4 660658264 660597763 659786377 659594345 657840195 657016449 656464005 655052261 654839325 653915710
1597 653915710 653796387 652913208 652331161 651534729 650189056 649084244 646575470 645462265 645008392
1605.7 645008392 644796600 642772751 641915054 641251678 638767281 638294754 636799431 636096573 635200119
1614.4F35200119J335716J031952j1824684O09474P44934k95944q23097J347999L26386
1623.1F27652855p087402q10357j47399R42420k171363k968369M58183o10847m77715
1631.7F14780006q33015J658897L716469n237503m000702J412316p43256N60455M76189
1640.4F11789856n72662R89036k08130J947060K816391j185227q18100k906112k2927
1649.1F11829185J997338L839454N038796l777695j2765693N751228M512634K359925
1656.8F18785172O85615l777O89011N76096J807975P89605k628022J936341J900902
1665.5F24538918J180648K345314L097954k338333q00514L085747j458283J486054
1673.2F31137505M383621N74760m398498K415771L189926K241783J337853k148933
$$ plain form
1614.4 635200119 636535835 637567787 625743103 626352577 627097511 626801567 625978470 627326469 627652855
1623.1 627652855 620565453 619755096 619607697 620550117 618378754 615410385 615868568 615257721 614780006
1631.7 614780006 613946991 615605888 619322357 614084854 610084152 611496468 610753212 611313667 611789856
1640.4 611789856 611217194 612206230 611998100 613945160 616761551 615576324 614758224 611852112 611829185
1649.1 611829185 613826523 617665977 622704773 618927078 606161385 611912613 616425247 618785172
1656.8 618785172 619470787 619467010 620156021 620732117 622540092 623329697 620701675 622638016 624538918
1665.5 624538918 625719566 628064880 631162834 628824501 628023987 631109734 629651451 631137505
1673.2 631137505 635521126 636095886 631697388 634113159 637303085 639544868 640882721 638733788
1680.9F38733788K431983N592957J951981j0730706N42260N310592L022156L62473
1688.6F47217484R23614L94440J275406J528625J387177L831482L398361q833313J298904
1697.3F52422180M417038N589905q28018j2574997P138138M417114J518249q77456
1705F61222153M12216j374207k38037L138123O17981r88465P34024J515732K195359
1713.7F67234879o85196j428376K936631K169342q123017J044846K985229J347657
1721.4F67481995J474762M60968p61185K0218N50003K68402R85947K417526j106262
1730.1F71792374j925202L549881M342118l652955r120254L809814L625489Q21914
1737.8F73243179J900406q56552m740066L335723L251419j798629j736908J617737
$$ plain form
1680.9 638733788 641165771 646758728 648710709 637980003 638522263 643832855 646855011 647217484
1688.6 647217484 648141098 648535538 649810944 651339569 652726746 656558228 659956589 651123276 652422180
1697.3 652422180 656839218 662429123 661601105 649026108 656164246 660581360 662099609 661222153
1705 661222153 661634369 660260162 660022125 663160248 663778229 662789764 663523788 665039520 667234879
1713.7 667234879 666549683 665121307 668057938 670227280 662104263 663149109 666134338 667481995
1721.4 667481995 668956757 669417725 668656540 668676758 669226761 669495163 670481110 672898636 671792374
1730.1 671792374 669867172 673417053 677759171 674106216 664985962 668795776 672421265 673243179
1737.8 673243179 675143585 674287033 669546967 672882690 676134109 674335480 672598572 674216309
1745.5F74216309J748504Q17719n951k083283K309723o09207l724060K438202L64609
1754.2F75472565O86645J983261k727279n68390J275711J123352K177734l097381k727127
1762.9F73599091J974258M61960q240J627350J022263l687745R48182M149551K85721
1771.6F80372391l451004k884217K703553J569214k339402J051636N24597R32617O08063
1780.3F79087448k517242k29492P24716J181106q11691j166611R50699j1520K11944
1788.9F77419357J518097J026459J43967l673172k619858L001938J804733j386185
1796.7F77235336K05002J569138N3253j963959J116638m30984j016236Q96988o76879
1805.3F76988297M02679O07986q52890L33252J160889j141663r51690N42755l86124
$$ plain form
1745.5 674216309 675964813 676782532 676776581 674693298 677003021 676393814 672669754 675107956 675472565
1754.2 675472565 676159210 678142471 675415192 674846802 676122513 677245865 679423599 676326218 673599091
1762.9 673599091 675573349 676035309 676027069 677654419 678676682 674988937 675937119 680086670 680372391
1771.6 680372391 676921387 674037170 676740723 678309937 675970535 677022171 677546768 678479385 679087448
1780.3 679087448 676570206 676340714 677065430 678246536 677434845 676268234 677218933 677207413 677419357
1788.9 677419357 678937454 679963913 680107880 676434708 673814850 676816788 678621521 677235336
1796.7 677235336 677440338 679009476 679062729 677098770 678215408 677784424 676768188 677665176 676988297
1805.3 676988297 677390976 677998962 677146072 677479324 678640213 677498550 676546860 677089615 676703491
1814F76703491K88696P4845K44598l97415o39191Q74710l92684R1018l52936Q84858
1823.7F77379990K144165l468094j216660J595536K124252Q35190n164795q3084J942215
1832.3F76088715R3765l04337J24588N70298n47867j286850L2272R3460K36511l1509
1842F75069046J432190J202469o026917M78974K237472n47180r94949L0212O57730
1850.7F73539047o20880j76391O4392j30387J65100k04086J82724m47922k05002q2626
1860.3F72083969k20108m82635k99225N10483R6282O29044Q4457N17121r44519k832031
1869.9F69142838P83004M91867k35366l64609O9885L23181j4572J33972j08032j48621
1879.6F70073547p64007o4087j33286k09274j40228o43540L49121N2109J552048N93109
$$ plain form
1814 676703491 676992187 677067032 677311630 676914215 676275024 677149734 676757050 676848068 676495132 677379990
1823.7 677379990 679524155 676056061 674839401 676434937 678559189 679394379 674229584 674146500 676088715
1832.3 676088715 676182480 675878143 676002731 676573029 676025162 674738312 674770584 674864044 675100555 675069046
1842 675069046 676501236 677703705 671676788 672155762 674393234 673846054 672851105 672881317 673539047
1850.7 673539047 672918167 672741776 672806168 672675781 672840881 672636795 672819519 672371597 672166595 672083969
1860.3 672083969 671863861 671381226 671082001 671592484 671688766 672317810 672402267 672919388 671974869 669142838
1869.9 669142838 669925842 670417709 670182343 669817734 669887619 670210800 670196228 670330200 670222168 670073547
1879.6 670073547 669309540 669245453 669112167 668902893 668762665 668119125 668468246 668520355 670072403 670665512
1889.2F70665512l011246r8037N12771j18866P23954P8735j635437j52969K49404j02615
1898.9F67111206M73023j86005J526l94364j15127l33939o89850K42844m92020j32827
1908.5F65484467M15496k15683m65622M83246R4910l85284k05536n02091J361923j584014
1918.2F64481812k173996J075820L38212J206131n24674j453018M84772J05438o23322
1926.8F62917175n45578R308l96576r2315J46560J76316k81754j31226L56293j60828
1936.5F61997375j7471o96869l39355K289J116409J86233l330383N60532J210708J04981
1946.1F60794449R1629n03082r5826m68978k78244m28467k40174O1875j70136J21308
1955.8F58884354L08609K35519k29111K01340k09274n78308n10483m78897J20010L60184
$$ plain form
1889.2 670665512 667654266 667556229 668069000 667950134 668674088 668752823 667117386 666964417 667213821 667111206
1898.9 667111206 667584229 667398224 667399750 667005386 666890259 666556320 665866470 666109314 665617294 665484467
1908.5 665484467 665899963 665684280 665218658 665701904 665796814 665411530 665205994 664703903 666065826 664481812
1918.2 664481812 662307816 663383636 663721848 664927979 664403305 662950287 663435059 663540497 662917175
1926.8 662917175 662371597 662380905 661984329 661892014 662038574 662214890 661933136 661801910 662158203 661997375
1936.5 661997375 661979904 661283035 660943680 660945969 662062378 662248611 658918228 659478760 660689468 660794449
1946.1 660794449 660886078 660382996 660287170 659818192 659539948 659111481 658871307 658933182 658763046 658884354
1955.8 658884354 659192963 659428482 659199371 659400711 659191437 658613129 658102646 657623749 657743759 658103943
1965.4F58103943P88422n44816r13162J37482L49274J01928p02057m79507j92795O3019
1975.1F56711731m54407m77142K14310L85437P49511l7307m25263o20575m21142j58005
1984.7F55467148n91049l16773J9760J56937j73950R09271N83801j553573n96085P8888
1994.3F53984375k28119n56717m83627l78266m7531L87268K8916k30789r3537K80533
2004F52662506n77545r56039n28412m19159l12653m44794j40762k47116J92184J97678
2013.6F49425888k83508J8158l43170r90754q74328j25427l16926j51901k0218k90527
2023.3F46047287M8141k79312j84173l75595l00370m42886o69937l52020p86820m10995
2032.9F42293320j89591o5460l05405j05667K35062m29840Q1482k83356r43375p18193
$$ plain form
1965.4 658103943 658892365 658347549 657434387 657571869 657921143 658023071 657321014 656841507 656648712 656711731
1975.1 656711731 656257324 655780182 655994492 656379929 657129440 657092133 656666870 656046295 655625153 655467148
1984.7 655467148 654876099 654559326 654579086 654736023 654562073 655471344 656055145 654501572 653905487 653984375
1994.3 653984375 653756256 653199539 652715912 652337646 652290115 652677383 652706299 652475510 652381973 652662506
2004 652662506 652084961 651128922 650600510 650181351 649868698 649423904 649283142 649036026 649228210 649425888
2013.6 649425888 649142380 649160538 648817368 647826614 646952286 646826859 646509933 646358032 646337814 646047287
2023.3 646047287 646095428 645816116 645631943 645256348 644955978 644513092 643843155 643491135 642704315 642293320
2032.9 642293320 642103729 642038269 641732864 641627197 641862259 641432419 641513901 641230545 640287170 639568977
2042.6F39568977k39410j27106p7400L00713K0218J76658m03137p4921J95771n28641
2052.2F38811722l68729n27229q2970k17209j90620j70136j26609K18849m5128J29814
2061.9F37431755n50156k66380m47731o59218m5509m2992P84493J85890j04675k54135
2071.5F36031342j28441Q2054o81877k79618m37278k30790j60903Q0757L09562n7983
2081.1F34526825J70402j49765K938m19274m45938n25093k67715N40924l76091j19133
2090.8F32938080K06222J16730j8768J25122N4130n48133j74218m90379k0943j15356
2100.4F32072487l61366Q9988j04904J45302q5411O6566m47654m29383R0828k50091
2110.1F30786362l75214n19257K08741K03399O0120k10037O4049L93104n72319m68864
$$ plain form
2042.6 639568977 639329567 639202461 639125061 639425774 639445992 639622650 639219513 639144592 639340363 638811722
2052.2 638811722 638442993 637915764 637832794 637615585 637424965 637254829 637128220 637347069 637301941 637431755
2061.9 637431755 636881599 636615219 636167488 635508270 635462761 635419769 636204262 636390152 636285477 636031342
2071.5 636031342 635902901 635984955 635303078 635023460 634586182 634355392 634194489 634275246 634584808 634526825
2081.1 634526825 634697227 634547462 634550400 634131126 633685188 633160095 632892380 633433304 633057213 632938080
2090.8 632938080 633144302 633261032 633242264 633367386 633421516 632873383 632699165 632208786 632187843 632072487
2100.4 632072487 631711121 631801109 631696205 631841507 631756096 631822662 631375008 630945625 631036453 630786362
2110.1 630786362 630411148 629891891 630100632 630304031 630364151 630154114 630218163 630611267 630038948 629570084
2119.7F29570084n23453k19650l67966k35062K22092j53656L85132n0125j70403j411
2129.4F28455582k22016o26983m12979J19628m78096o103K0523J19972j97525l18298
2139F26453705M56238k64931k26860l57170k93350k13547r4948O7863m30984M8523
2148.6F25144539k30713p9231j58730k88009n2071l21388n2224j91993K72712n2528
2158.3F23990364j25351M9591j45302K24839O8588M90532l97454m62226J67656q316
2167.9F23852921K41432k40021P1526J67503J52206j53618j89781J82305j61744r6740
2177.6F23825989l10173J53961n7602n341K42806k24114K32773P3777J62658j65214
2187.2F23929520l2730K1362n13954K8648J24855K63863o9428p8087J6137K16331K49062
$$ plain form
2119.7 629570084 629046631 628826981 628459015 628223953 628446045 628292389 628677521 628627396 628456993 628455582
2129.4 628455582 628233566 627606583 627193604 627313232 626835136 626829033 626849556 626969528 626772003 626453705
2139 626453705 626909943 626645012 626418152 626060982 625767632 625554085 625459137 625527000 625096016 625144539
2148.6 625144539 624913826 624834595 624675865 624387856 624335785 624014397 623962173 623770180 624042892 623990364
2158.3 623990364 623865013 623914604 623769302 623994141 624062729 624553261 624155807 623693581 623861237 623852921
2167.9 623852921 624094353 623854332 623925858 624093361 624245567 624091949 623902168 624084473 623922729 623825989
2177.6 623825989 623515816 623669777 623612175 623606834 623849640 623625526 623858299 623932076 624094734 623929520
2187.2 623929520 623896790 623918152 623404198 623432846 623557701 623821564 623752136 623674049 623690186 623906517 624155579
2197.8F24155579l27454k2583k40326O8054j33056l00942K49939Q4267J28059P9498
2207.5F23741035L38402r3574o562m3830j55411K21901l79868J7739j37978n2757K08130
2218.1F23657227k5292P172n4016M02832l87421m52690N8212K61727J03111l36914
2227.7F23233948J19934j6136K49481j10855k42501K5826j45683p4120n89676j67923
2237.4F22282295q1329k2507n6076K1858O07300J92909m07600q68759J21231K45514
2247F22034836J01852M2305p27119j78681o1836L22533k9946k50282N2872M3258M14544
2257.6F21764336j36872j51024n29937k13509J08185j98975M4556k7466N05448J56021
2267.3F21320763J831m20876n18570j90582l40881K80113j01090J47667l2501q0757
$$ plain form
2197.8 624155579 623828125 623805542 623565216 623633270 623500214 623199272 623449211 623533478 623661537 623741035
2207.5 623741035 624079437 623985863 623979301 623935471 623780060 624001961 623622093 623639832 623501854 623449097 623657227
2218.1 623657227 623631935 623639107 623585091 623987923 623600502 623147812 623206024 623467751 623570862 623233948
2227.7 623233948 623353882 623337746 623587227 623476372 623233871 623259697 623114014 623039894 622450218 622282295
2237.4 622282295 622200966 622178459 622122383 622144241 622751541 622944450 622536850 621668091 621789322 622034836
2247 622034836 622136688 622178993 621451874 621273193 621211357 621533890 621503944 621253662 621306534 621349792 621764336
2257.6 621764336 621627464 621476440 620946503 620732994 620841179 620642204 620686760 620659294 621164742 621320763
2267.3 621320763 621322594 620901718 620383148 620192566 619851685 620131798 620030708 620178375 620145874 620065117
2276.9F20065117P0000l40043J46523k74620l72009m09012K42653J91498r6283J94397
2286.5F19418221l26691L48396q7166j1253j03912j05019L66859l53889K1286m66538
2296.2F18700294L82615L47442O6605M68826l94516J23024n58014J00594O1302j6479
2305.8F19281693K25486n21240Q61816K32811N89562K96593L6735l37677j087685J129647
2315.5F20707741J14136L58276k52609l41378J093903m0588N30853k48680K62146j46218
2325.1F22037582O37932N6305j585731J173591Q26264N64880m46243r7618r95293m08325
2334.8F21763344K094116j256828j540070q24737Q65593J34811n01137P19338l79601
2343.4F21074829L62129k137108j001281j346855j936341J451187K286530J075439
$$ plain form
2276.9 620065117 620135117 619795074 619941597 619666977 619294968 618885956 619128609 619320107 619223824 619418221
2286.5 619418221 619091530 619439926 619352760 619341507 619237595 619132576 619499435 619145546 619166832 618700294
2296.2 618700294 619082909 619430351 619496956 619965782 619571266 619694290 619136276 619236870 619298172 619281693
2305.8 619281693 619507179 618985939 619847755 620080566 620670128 620966721 621003456 620665779 619578094 620707741
2315.5 620707741 620821877 621180153 620927544 620586166 621680069 621639481 622170334 621921654 622183800 622037582
2325.1 622037582 622675514 622731819 621146088 622319679 623145943 623710823 623264580 623166962 622171669 621763344
2334.8 621763344 623857460 622600632 621060562 620235825 621101418 621236229 620735092 621454430 621074829
2343.4 621074829 621436958 619299850 618298569 616951714 615015373 616466560 618753090 619828529
2351.2F19828529o5727Q57430n2224m09164Q70514O41479M89884m6845P61414j444016
2360.8F21431274j321601p17850n48783o8740o14052l71895j665955m19082r22814
2369.5F14780502p89413j81236j014328j506615k149468o56509n51567l74718j97830
2378.2F07358818n04303n88989r83963p49817q47282n54810j062508n72738p8049m64592
2387.8F00951767K69852r9068M7874k27394j78375n455p59621l79066o88744k90908
2397.4E98640862J82762J01699j76887k16599K12212k08511k17247o00357m76303n69382
2407.1E96672249o97327k7695j73263j31378J5793L67164k00462n62248m49067m83093
2416.7E94330673j65672l51296j66359n84487m19884k75726r6512M32777k20375k42653
$$ plain form
2351.2 619828529 619762802 620620232 620568008 620158844 621029358 621670837 622160721 622113876 622875290 621431274
2360.8 621431274 620109673 619391823 618843040 618774300 618160248 617788353 616122398 615703316 614780502
2369.5 614780502 613991089 613809853 612795525 611288910 609139442 608482933 607931366 607556648 607358818
2378.2 607358818 606854515 606265526 605281563 604531746 603684464 603129654 602067146 601494408 601416359 600951767
2387.8 600951767 601221619 601122551 601170425 600943031 600764656 600759201 599999580 599620514 598931770 598640862
2397.4 598640862 598823624 598925323 598748436 598531837 598744049 598535538 598318291 597717934 597241631 596672249
2407.1 596672249 595974922 595947227 595773964 595642586 595658379 596025543 595825081 595262833 594813766 594330673
2416.7 594330673 594165001 593813705 593647346 593062859 592642975 592367249 592270737 592703514 592483139 592240486
2426.4E92240486o06842m71344o26526p17277j34316k56576J03073l82424r3803M9705
2436E89104156m21447k84729m32244m84809r10683n96123l23524R842j53084l21884
2445.7E85185471J95350m6272J2321o84890p89528m58946j43319k2850l96728K1286
2455.3E82871895n24559j05362K63786j60637m68445n90782Q1291l67088n36995o65130
2465E79797974j86081j16768n76668J22871n607K9068k64549j76888n82466r03587
2474.6E77137299l44658o42281K01416J37673k42463j33781O2294K61421l07808o13289
2484.2E75515823q98018j49459k62452j02386K69241m73861l12081k90870J71966j10283
2493.9E73357620k75078k42118n66941m71916o33163j14289j84173K20298l3645m24652
$$ plain form
2426.4 592240486 591633644 591162300 590535774 589818497 589684181 589427605 589530678 589148254 589054451 589104156
2436 589104156 588682709 588397980 587965736 587480927 586570244 585974121 585650597 585660439 585507355 585185471
2445.7 585185471 585380821 585334549 585346870 584661980 583872452 583413506 583270187 583247337 582850609 582871895
2455.3 582871895 582347336 582241974 582505760 582345123 581876678 581285896 581367187 581000099 580463104 579797974
2465 579797974 579611893 579495125 578918457 579041328 579035721 579064789 578800240 578623352 578040886 577137299
2474.6 577137299 576792641 576150360 576351776 576489449 576246986 576113205 576175499 576436920 576129112 575515823
2484.2 575515823 574617805 574468346 574205894 574103508 574372749 573898888 573586807 573295937 573467903 573357620
2493.9 573357620 573082542 572840424 572273483 571801567 571168404 571054115 570869942 571090240 571056595 570631943
2503.5E70631943q736j91574K14195k65388k24381l17497m29687l15590m38805L06168
2513.2E68960648n0621j47973m84314k20146p9536n07317M6501l40690k43874n49927
2522.8E66382751l89404r7999M5662M34494l70789l25127o02073j97296k00272o36711
2532.5E64043236l62892n98488P362m8065J62430l35884o15464J06965n1537k6588
2542.1E62281075o05507m57116m24499k60468j38549j47286L50571m22287m20685l19061
2551.7E59436188j23787l65715n38674m0779k82325Q7127m02946l17726O6490j06621
2561.4E57411232m62074n45044N04188j72615q34427o82067l6965K6932l71666K20756
2571E55058250j94130l26156k42348M5662j69945l42292j30005p64542m64516k58407
$$ plain form
2503.5 570631943 570623207 570431633 570645828 570380440 570156059 569838562 569408875 569093285 568654480 568960648
2513.2 568960648 568910027 568762054 568277740 568057594 567978058 567470741 567517242 567176552 566932678 566382751
2522.8 566382751 565993347 565895348 565941010 566375504 566004715 565679588 565077515 564880219 564679947 564043236
2532.5 564043236 563680344 563081856 563089218 563041153 563203583 562867699 562252235 562359200 562307663 562281075
2542.1 562281075 561675568 561218452 560793953 560533485 560394936 560247650 560598221 560175934 559755249 559436188
2551.7 559436188 559312401 558946686 558408012 558367233 558084908 558172035 557769089 557451363 557517853 557411232
2561.4 557411232 556949158 556404114 556908302 556735687 555901260 555219193 555182228 555209160 554837494 555058250
2571 555058250 554864120 554537964 554295616 554341278 554171333 553829041 553699036 552934494 552469978 552211571
2580.7E52211571J02501j92681k69317L8452l44963j33209m69094k33574n04532m15725
2590.3E49789429r2736l09829m4022l57056J24932j45912j09101j65481m03977q3923
2600E48202324m59137L1815m56353j18370j74026o37894j33171l99933K44713l01094
2609.6E45798874l56636m04549n59578K7275m56199j57547m23851m76342m72831k62795
2619.3E42255821j54228n39703r6474k07253L1395p38487p84073l8795j40610q9493
2628.9E39498100o49681n57861k77825K86293l36875p52984k44178m42543r1553o33354
2638.5E35797539n04532l07655k40632l13491n52178k10266p58285k05231l32489l20892
2648.2E32051888j52474l28216o3401r76982l45306j63574n71328m90951J36528M14657
$$ plain form
2580.7 552211571 552314072 552121391 551852074 551890526 551545563 551412354 550943260 550709686 550205154 549789429
2590.3 549789429 549696693 549386864 549342842 548985786 549110718 548964806 548855705 548690224 548286247 548202324
2600 548202324 547743187 547775002 547318649 547200279 547026253 546388359 546255188 545855255 546099968 545798874
2609.6 545798874 545442238 545037689 544478111 544505386 544049187 543891640 543467789 542991447 542518616 542255821
2619.3 542255821 542101593 541561890 541465416 541258163 541289558 540551071 539766998 539728203 539587593 539498100
2628.9 539498100 538848419 538290558 538012733 538299026 537962151 537209167 536964989 536522446 536430893 535797539
2638.5 535797539 535293007 534985352 534744720 534431229 533879051 533668785 532910500 532705269 532372780 532051888
2648.2 532051888 531899414 531571198 531507797 530530815 530185509 530021935 529450607 528959656 529096184 529510841
2657.8E29510841p63321n99746n16358n722l56178n14641J75705n53932l28713m84008
2667.5E25563927k06070J373j94473l18756n42336K7275k61612j76735k32925k72331
2677.1E23387337o07453n81283l6736m83093j27945k88849N4741p0877l30277j01127
2686.8E20814438o39000j53389l51181k70081n22956l91808N3101m13018j17569m96788
2696.4E17511749l49083m12750m7722m9286m88548M9171l52745Q7662k33917l58849
2706E15355682j89552l50838q8539o14738l61939m08668p4730k48032n0163N1842q05550
2716.6E12214775J01433m96903n79681j4229j58462l99208q09441J55334K3003m33426
2726.3E09603195n39017k67601j14631l66364m04663k06375N57823k38571m56085l94859
$$ plain form
2657.8 529510841 528747520 528147774 527631416 527625694 527269516 526754875 526930580 526376648 526047935 525563927
2667.5 525563927 525357857 525359230 525164757 524846001 524303665 524330940 524069328 523892593 523659668 523387337
2677.1 523387337 522779884 522198601 522161865 521678772 521550827 521261978 521316719 521245842 520915565 520814438
2686.8 520814438 520175438 520022049 519670868 519400787 518877831 518486023 518539124 518126106 518008537 517511749
2696.4 517511749 517162666 516749916 516702194 516652908 516164360 516213531 515860786 515948448 515714531 515355682
2706 515355682 515166130 514815292 514726753 514112015 513750076 513341408 513266678 513018646 512968483 513020325 512214775
2716.6 512214775 512316208 511819305 511239624 511225395 511066933 510667725 509858284 510013618 510036621 509603195
2726.3 509603195 509064178 508796577 508681946 508315582 507910919 507704544 508262367 508023796 507567711 507172852
2735.9E07172852k28234N5123n77164k70157n60837k73514k37274l51219j48010k06947
2745.6E04374619J81160l21885k46009m75464j61057j43394m68636O0463k70424j00708
2755.2E02428665o98089l63083o7520l48397j15204l41224J82190m24652j47820j01929
2764.9E00002937m92134l09067l64151K71111m41017k98577j53961K5063q0948p32193
2774.5D97427063k81982n66979J93291j17760k26402N1384m26369j46561p37762k65427
2784.2D94902496l12805k81029l02391m36592K96898j24664j88790n34477k80723k26517
2793.8D92511406j42136l33786r75151l2921k53715j45645l67432o95915l76663j0033
2803.4D89178009L13568o63223l80440m65813j83143j05362m52767M4785p76520n95054
$$ plain form
2735.9 507172852 506944618 506999741 506422577 506152420 505591583 505318069 505080795 504729576 504581566 504374619
2745.6 504374619 504555779 504233894 503987885 503512421 503351364 503207970 502739334 502799797 502529373 502428665
2755.2 502428665 501730576 501367493 501299973 500951576 500836372 500495148 500677338 500252686 500104866 500002937
2764.9 500002937 499510803 499201736 498837585 499108696 498667679 498369102 498215141 498240204 498159256 497427063
2774.5 497427063 497145081 496578102 496771393 496653633 496427231 496478615 496052246 495905685 495167923 494902496
2784.2 494902496 494589691 494308662 494006271 493569679 493866577 493741913 493553123 493018646 492737923 492511406
2793.8 492511406 492369270 492035484 491060333 491027412 490773697 490628052 490260620 489564705 489188042 489178009
2803.4 489178009 489491577 488828354 488447914 487982101 487798958 487693596 487240829 487285614 486509094 485914040
2813.1D85914040m48914k09961j50452j73454j30691r50966n85213l09677J46065n27687
2822.7D82573090o59981j75209m18816n1880p56912j57776k79846n30663O4202n41306
2832.4D79064903o02760m03137j49575j082191n53932M1427m42390m77982j162262
2841.1D74232101k65274l02963o54106m43726n51529n73959p25822m29650q88137l21999
2850.7D69074936l12042n70984l41988m50249l55148q05740l54386l78112O8245l34053
2860.3D65240479r05533k83127n70679j96991o16226n16205p84225p19986J93557k39868
2870D60601196l17917j110344p53326p49626q81538m15116o07147j58768n68504k25220
2879.6D54813690m19464p45850m82177l34893j71737n78804l3303o46019o46133k25639
$$ plain form
2813.1 485914040 485465126 485255165 485104713 484931259 484800568 483849602 483264389 482954712 483100777 482573090
2822.7 482573090 481913109 481737900 481319084 481267204 480510292 480352516 480072670 479542007 479606209 479064903
2832.4 479064903 478462143 478059006 477909431 476827240 476273308 476314735 475872345 475394363 474232101
2841.1 474232101 473966827 473663864 473009758 472566032 472014503 471440544 470714722 470285072 469396935 469074936
2850.7 469074936 468762894 468191910 467849922 467399673 467044525 466238785 465884399 465506287 465574532 465240479
2860.3 465240479 464334946 464051819 463481140 463284149 462667923 462151718 461367493 460647507 460841064 460601196
2870 460601196 460283279 459172935 458419609 457669983 456788445 456373329 455766182 455607414 455038910 454813690
2879.6 454813690 454394226 453648376 453166199 452831306 452659569 452080765 452047462 451401443 450755310 450529671
2889.3D50529671k57988j15395m83436k5216l50341j14098l47710m69970j98708m73328
2898.9D47693481r2277l95050J17226m53721o28547l91922k64740J48926p68357M45671
2908.6D45410690J72615n63507n32341p72629j56707p58210p34977p89681l69415o89125
2918.2D40216713n01442r8419q73757J91422k05536l52974n40657l00903K34680J1635
2927.8D37780762N71022l59612j93062L2158N12085O8093m98848J38816j64871J030541
2937.5D38917084K48222m33998j8425O57158O45714q58383M39758N78422M91066K38266
2947.1D40904884k19917M31862J89400N45578K65503M03595j40648n4779J36528l01285
2956.8D42160721M27322j5716L74984L23868P36733J71089l65639P83615q125L74794
$$ plain form
2889.3 450529671 450271683 450156288 449672852 449647636 449297295 449183197 448835487 448365517 448166809 447693481
2898.9 447693481 447601204 447206154 447323380 446869659 446241112 445849190 445584450 445733376 444965019 445410690
2908.6 445410690 445583305 445019798 444487457 443714828 443558121 442799911 442064934 441275253 440905838 440216713
2918.2 440216713 439715271 439616852 438743095 438934517 438728981 438376007 437835350 437534447 437769127 437780762
2927.8 437780762 438351784 437992172 437799110 437831268 438343353 438411446 437912598 438051414 437886543 438917084
2937.5 438917084 439165306 438731308 438712883 439370041 440015755 439157372 439597130 440175552 440666618 440904884
2947.1 440904884 440684967 441116829 441306229 441851807 442117310 442520905 442380257 442325478 442462006 442160721
2956.8 442160721 442588043 442572327 442947311 443271179 444007912 444179001 443813362 444596977 444588852 444963646
2966.4D44963646J1749O2027M07028j4495L75404L62244R64317J89247J11923J75667
2976.1D47608757J00822L99399Q1635N39207j10435K21977M30794K55966L72124O10504
2985.7D50510750J079788k58522l53661k00347O8130L80898K85949K55432j88713N19448
2995.3D52099152j755j06774p1945j51443M39529N8708j0795m09470J2131L6087j99928
3006D51693497j63231j35956L81241k34642l15247j57242L58468J05552k80762m39338
3015.6D50812340r42345j02615n40810k60467Q3503n8593j58463n73273q2397q50411
3025.2D47326469k54402k1934m02832j70479m45786J31340m44259o01349k91100j65367
3034.9D44660301p22923o60667K24342j46599k9526o07605l59115n16396q23555j12686
$$ plain form
2966.4 444963646 444975395 445037422 445444450 445429955 445805359 446167603 447131920 447321167 447433090 447608757
2976.1 447608757 447709579 448108978 448190613 448729820 448619385 448841362 449272156 449528122 449900246 450510750
2985.7 450510750 451590538 451332016 450978355 450778008 450846138 451227036 451512985 451768417 451579704 452099152
2995.3 452099152 452097397 451990623 451918678 451767235 452206764 452265472 452254677 451845207 451857338 451893425 451693497
3006 451693497 451530266 451394310 451775551 451540909 451225662 451068420 451426888 451532440 451251678 450812340
3015.6 450812340 449869995 449767380 449226570 448966103 449049606 448991013 448832550 448259277 448176880 447326469
3025.2 447326469 447072067 447050133 446647301 446476822 446031036 446162376 445718117 445116768 444825668 444660301
3034.9 444660301 443937378 443276711 443501053 443354454 443324928 442717323 442358208 441841812 441018257 440905571
3044.5D40905571n40504j77079j79252m58069p57714p8544j90544r27429j5297n9967
3054.2D37521172K27813q16612j282959k93503J42021J91002q15773m19426m36744
3062.9D34016991L2882q5449m61006o9923r18580l98521n86166k83852k04468l76549
3072.5D30665359J97907k82822m57954j061478l06205j16768j62964j21880o91452
3081.2D27661743k21939n05676m9057r08470r42994P5188M5738L11089q27408r27505
3090.8D23710709o55213j11160k18430m33082J95808m36516l90930n30815K59667J14097
3100.5D21504135j132736j044808n06019K40478r9334O8969n41877o69327j88942l67470
3110.1D17263069j86081n41954j89400k98309L9063m21486p22351P7400l06397m31709
$$ plain form
3044.5 440905571 440365067 440187988 440008736 439550667 438792953 438714409 438523865 437596436 437581139 437521172
3054.2 437521172 437748985 436932373 435649414 435355911 435497932 435688934 434873161 434453735 434016991
3062.9 434016991 434049873 433964424 433503418 433433495 432514915 432116394 431530228 431246376 431041908 430665359
3072.5 430665359 430863266 430580444 430122490 429061012 428754807 428638039 428475075 428353195 427661743
3081.2 427661743 427439804 426934128 426885071 425976601 425033607 425108795 425154533 425465622 424638214 423710709
3090.8 423710709 423055496 422944336 422725906 422292824 422488632 422052116 421661186 421130371 421390038 421504135
3100.5 421504135 420371399 419326591 418820572 419061050 418961716 419030685 418488808 417819481 417630539 417263069
3110.1 417263069 417076988 416535034 416345634 416047325 416086388 415664902 414942551 415019951 414713554 414281845
3119.8D14281845j042938p9346Q0719n24597j14326l09144k75840q07724j99089j86921
3129.4D10822639j34658l93525n35850J27106q12264j8806j3657J20545q0224r73892
3139D08107414k24380l29056r2812m79774m6539n60418q07762K41013n79109l32108
3148.7D04896469o22940j12152J76849k51693j82877l85284k44255q77495r842k06452
3158.3D02180328k29225q2016n41420l4408j055336j87264Q6594n70488o87065n01099
3168C98378601j030l65105L91198k30561j55410l01896p66792k34489m08287L46946
3177.6C96653175p74078p78160r8992k55050k95143n77660K88735r3537j49460m59442
3187.3C93460388n35965l20968m03481q2550n74455J9607k10266p3967j63460o04667
$$ plain form
3119.8 414281845 413238907 413159561 413240280 412715683 412601357 412292213 412016373 411208649 411009560 410822639
3129.4 410822639 410687981 410294456 409758606 409885712 409073448 409054642 409040985 409161530 409081306 408107414
3139 408107414 407883034 407553978 407461166 406981392 406934853 406374435 405566673 405807686 405228577 404896469
3148.7 404896469 404273529 404161377 404338226 404086533 403903656 403518372 403274117 402396622 402386780 402180328
3158.3 402180328 401951103 401869087 401327667 401293259 400237923 400050659 400137253 399566765 398879700 398378601
3168 398378601 398377571 398012466 398403664 398173103 398017693 397715797 396949005 396714516 396306229 396653175
3177.6 396653175 395879097 395100937 395001945 394746895 394451752 393874092 394162827 394069290 393919830 393460388
3187.3 393460388 392924423 392603455 392199974 392117424 391542969 391562576 391352310 391278343 391114883 390510216
3196.9C90510216n56145q67310M11530P5111j40838l63770n80444j86577l01628J12686
3206.5C88112831p04193q6174k23579l91007J13983m94766n6953q54302k77328L16238
3216.2C85454750k57111k42195m39987o72493o14853K56005j34964m01459q47511k67983
3225.8C81832199M82826o43730k87094k6703q6288q22220n39093J8234M5395N81398
3235.5C80554924q30040p69653k40822k14272k55737k12097j34545l99475N82734l76168
3245.1C77704849o53076m68063l47519M40445n1728j96495j073188n35088l21808r6130
3254.8C74402199M92363l21923k48870n53971K69242j25389n80330L3645k22397k03590
3264.4C72940979q74290l03345J07117K81600o50634j163521J68838L63160O03675
$$ plain form
3196.9 390510216 389954071 389086761 389498291 389573402 389432564 389068794 388488350 388301773 388000145 388112831
3206.5 388112831 387408638 387322464 387098885 386707878 386821861 386327095 386270142 385415840 385138512 385454750
3216.2 385454750 385197639 384955444 384515457 383842964 383228111 383484116 383349152 382947693 382100182 381832199
3225.8 381832199 382315025 381671295 381384201 381357498 381271210 380448990 379909897 379928131 379973526 380554924
3235.5 380554924 379724884 378955231 378714409 378500137 378244400 378032303 377897758 377498283 378081017 377704849
3245.1 377704849 377051773 376583710 376236191 376676636 376624908 376428413 375355225 374820137 374498329 374402199
3254.8 374402199 374894562 374572639 374323769 373769798 374039040 373913651 373333321 373366966 373144569 372940979
3264.4 372940979 372066689 371763344 371870461 372152061 371501427 370337906 370506744 370869904 371473579
3273.1C71473579n59234m32930j55373q86841l90091l77616j40191j1596M95681k87590
3282.7C68727798p25173m80805l00636N31959l15590n87387l97987N04150J94397r79690
3292.4C66171036n53665m1085M54941m91676m85306p40776k28882J83144q92639K83393
3302C63658485Q507m16374n63278j1177M19693m62532m54865r10873J06582m6196k28691
3312.6C61099281m27589q40340Q1139o08444q8578l78112l43438q0795m25949J5182
3322.3C58002357q91380m31137j09672K21214k48413n16358J96190m09546k60696o06499
3331.9C54946060K67029K49329o16379n13382j041489o47888k4643O53915n31005q32100
3341.6C51909447r6894k21557n93796j181488P7705r1743k14234l10630o67153r9182
$$ plain form
3273.1 371473579 370914345 370481415 370326042 369439201 369049110 368671494 368531303 368519707 369015388 368727798
3282.7 368727798 368002625 367521820 367221184 367753143 367437553 366850166 366452179 366956329 367150726 366171036
3292.4 366171036 365617371 365576286 366031227 365539551 365054245 364313469 364084587 364267731 363375092 363658485
3302 363658485 363666992 363250618 362687340 362676163 363095856 362633324 362178459 361267586 361374168 361327972 361099281
3312.6 361099281 360671692 359831352 359912491 359304047 359215469 358837357 358493919 358413124 357987175 358002357
3322.3 358002357 357110977 356679840 356570168 356791382 356542969 356026611 356222801 355813255 355552559 354946060
3331.9 354946060 355213089 355462418 354846039 354332657 353291168 352643280 352618637 353272552 352741547 351909447
3341.6 351909447 351812553 351590996 350997200 349815712 349893417 349801674 349587440 349276810 348609657 348510475
3351.2C48510475p4005K54707l86810M3678p06977j017647p2861p19185j60675k87208
3360.8C45383492p3357l20320l6698L71552q64067o66886o48536j81732l97988n23796
3370.5C42041664j77994j29852K21138k91443k25334n19409l08151k44446m53873n93567
3380.1C39318733p93953o5155j60637J81198l84063p10144n42679k37274P14836l01399
3389.8C37019463l26539n6991m70810r78737l58314L39470k75879N302m04091J31264
3399.4C34624138L1433n06859l47938r60617m99268j86768J62735k19841J0415j43319
3409.1C31964111o26449J05781k23350K2163o71997n44472l3264l66058n07240l96843
3418.7C28722382Q10546j34964l8833J27601l64265k60887p23801J7662m23279l33023
$$ plain form
3351.2 348510475 348436470 348691177 348304367 348348045 347641068 346623421 346550560 345831375 345670700 345383492
3360.8 345383492 345310135 344989815 344953117 345324669 344460602 343793716 343145180 342963448 342565460 342041664
3370.5 342041664 341863670 341733818 341954956 341663513 341438179 340918770 340610619 340366173 339912300 339318733
3380.1 339318733 338524780 338459625 338298988 338480186 338096123 337385979 336843300 336606026 337320862 337019463
3389.8 337019463 336692924 336635933 336165123 335186386 334828072 335167542 334891663 334896965 334492874 334624138
3399.4 334624138 334655571 334148712 333800774 332840157 332340889 332154121 332316856 332097015 332107430 331964111
3409.1 331964111 331337662 331443443 331220093 331242256 330570259 330025787 329992523 329626465 329119225 328722382
3418.7 328722382 329532928 329397964 329359131 329486732 329122467 328861580 328137779 328155441 327732162 327399139
3428.3C27399139P2976L75824j97030o33506M08706j19362M12713k29531o67763j81198
3438C26640968l55568m19273k63329Q43010p96814k37464M12521n646P21016j200981
3447.6C25338440n07927J18790M20608K87247n75676k43568m20533J4267p4196M79012
3457.3C24836464l090k06604J89781j00899M06991o57692j28212K60658K92854j46904
3466.9C24743347q40759P10869j28022p78579K022J22909J41068O50329K84653j88675
3476.6C24719162J10245n24369K02866J57585M60777j50222j188431M94423Q3504K63824
3486.2C24629364J99890k41203k48413K33268M97628r12285J72844K99759J04255K1820
3495.8C24756927k93350J44387m83323K45705N21507J324959L19061j232299l30124
$$ plain form
3428.3 327399139 327472115 327847939 327650909 327017403 327426109 327306747 327719460 327489929 326822166 326640968
3438 326640968 326285400 325866127 325602798 326445808 325648994 325411530 325824051 325818405 326539421 325338440
3447.6 325338440 324830513 324949303 325369911 325657158 325081482 324837914 324417381 324431648 324357452 324836464
3457.3 324836464 324833374 324626770 324816551 324715652 325122643 324464951 324336739 324597397 324890251 324743347
3466.9 324743347 323902588 324613457 324485435 323706856 323708878 323831787 323972855 324623184 324907837 324719162
3476.6 324719162 324829407 324305038 324507904 324665489 325126266 324976044 323787613 324282036 324365540 324629364
3486.2 324629364 324829254 324588051 324339638 324572906 325070534 324158249 324331093 324630852 324735107 324756927
3495.8 324756927 324463577 324607964 324124641 324370346 324891853 326216812 326535873 325303574 324973450
3504.5C24973450k93999M28467K63786Q94775j21345r60197O53038K58903J38207K2621
3514.2C26257706L13339j25961K67105K44713r48143k63062L92227J527786L81813
3522.9C28047523j319885j91536J127434L21961r86825j47552q16650M01001O76918
3531.5C27112389M59137Q78563k90719O97556J14860n78842K35863K41470l82232k27928
3541.2C28260117Q09555l12310O59142N04265j87035K03858j606942L99514R20105
3549.9C29650269Q35037P53746j040421J03417L46565K4376O6414J6517R80301J092339
3559.5C32828560r30863r84115J490555j25695N3177L260231n56068k337685j371193
3568.2C31326904j569404K532234J300964K18582J145173P95784J60217k79999O96182
$$ plain form
3504.5 324973450 324679451 325107918 325371704 326266479 326145134 325184937 325837975 326096878 326235085 326257706
3514.2 326257706 326571045 326445084 326712189 326956902 326008759 325745697 326137924 327665710 328047523
3522.9 328047523 326727638 326536102 327663536 327985497 326998672 326851120 326034470 326435471 327112389
3531.5 327112389 327571526 328450089 328159370 328856926 328971786 328392944 328628807 328870277 328488045 328260117
3541.2 328260117 329069672 328757362 329416504 329920769 329733734 329937592 328330650 328730164 329650269
3549.9 329650269 330485306 331239052 330198631 330302048 330648613 330672989 330739403 330755920 331736221 332828560
3559.5 332828560 331897697 330913582 332404137 332278442 332331619 335591850 335035782 332698097 331326904
3568.2 331326904 329757500 332289734 333590698 333809280 334954453 335750237 335910454 335630455 336326637
3576.9C36326637k68402N58434J50909j067047J108246J006927J82000K45056L336563
3585.5C41579323P79457l407936r2316k946663K053223K555351J736412J45035j495781
3594.2C40906105J716042k141838J575241J684799r08394K639694k06337p84454J3466
3602.9C44494324L48854R22355K525902J447830k778778K051850k807160j229515O423187
3611.6C51398849O45714l145141J660270j874618J959114L777389j374626R22394j700859
3620.3C52268486j182480J697083P76138J586533J138000Q84018O50368M528694n13229
3628.9C61833611j0832253M001007L047371L245506q16955k267075J914253K127571
3636.6C62253036J940880j312179J52130J190414J090164K47307m23736J959266K820778
$$ plain form
3576.9 336326637 336058235 336616669 336767578 335700531 336808777 337815704 337997704 338242760 341579323
3585.5 341579323 342358780 338950844 338858528 335911865 337965088 340520439 342256851 342401886 340906105
3594.2 340906105 342622147 340480309 342055550 343740349 342831955 345471649 345265312 344480858 344494324
3602.9 344494324 344843178 345765533 348291435 349739265 346960487 349012337 346205177 344975662 351398849
3611.6 351398849 352044563 348899422 350559692 348685074 350644188 354421577 353046951 353969345 352268486
3620.3 352268486 351086006 352783089 353559227 355145760 356283760 357167778 357818146 362346840 361833611
3628.9 361833611 351001358 355002365 358049736 361295242 360478287 358211212 360125465 362253036
3636.6 362253036 364193916 362881737 363033867 364224281 365314445 365561752 365138016 367097282 369918060
3645.3C69918060M769821l042945l516388M922332j315536m471703k164230N017166
3653C70116577K868157L111343M222717p888527L37029L150177O04210N17769p3777
3661.7C76965675J179886P53823J509475Q98247M04968L661690K028503o06002q25272
3670.4C85970993p799492J958542P277412P640801j94168j8756409L538208P274017
3678.1C86909904L472100k900543p33300K754364J408005Q74672p11288J67541L713493
3686.8C94954948M252472q976326k359352P753334o319313j19400L664894k31933K108001
3695.5C94727325k14958m74396Q70667Q77991K354049J848870n849800k760926M399147
3704.1C95777969Q12149R2316l84560K701493M347114p357673L867836K764091j2389488
$$ plain form
3645.3 369918060 374687881 371644936 368128548 373050880 371735344 367263641 365099411 370116577
3653 370116577 372984734 376096077 380318794 372430267 372767296 375917473 376521683 377039452 376965675
3661.7 376965675 378145561 378899384 380408859 381307106 381712074 385373764 387402267 386796265 385970993
3670.4 385970993 378171501 380130043 387407455 395048256 394854088 376097679 379635887 386909904
3678.1 386909904 390382004 387481461 386748161 389502525 390910530 391785202 391073914 391241455 394954948
3686.8 394954948 399207420 390231094 387871742 395625076 389305763 389186363 392851257 392619324 394727325
3695.5 394727325 394512367 394037971 394908638 395786629 398140678 399989548 394139748 391378822 395777969
3704.1 395777969 396590118 396682434 396297874 398999367 403346481 395988808 399856644 402620735 390231247
3712.8C90231247L167725L319511k47879O62384K365608K5826l247338J137314N403137
3721.5D02817535m260521m377670N683060J225014p64161m474144j52740L132172J095771
3730.2C99924316N294838m136772m855270P795944J54457r404411j151962J995620
3737.9C95616760k33078K661171K795220k886277L398362J2516822j0393638j9058914
3745.6C84416428Q838081M371223P143326m541816r381867J0451012q695793n268975
3753.3C87331619O550904N083885J659126n665779K746201M694557p918244k005539
3761C92476730L851853L91235M14543K693024l291130m003525L401108N252113o51092
3769.7D00534859q483734P00950K633743L50533L05290m43763J32217P41539K504883
$$ plain form
3712.8 390231247 393398972 396718483 396470604 397132988 399498596 399524422 396277084 397414398 402817535
3721.5 402817535 398557014 394179344 399862404 401087418 400323257 395849113 395696373 398828545 399924316
3730.2 399924316 405219154 401082382 396227112 404023056 404177513 394773102 393621140 395616760
3737.9 395616760 395383682 398044853 400840073 397953796 401352158 413868980 403475342 384416428
3745.6 384416428 393254509 397625732 404769058 400227242 390845375 401296387 392600594 387331619
3753.3 387331619 393882523 398966408 400625534 394959755 397705956 402400513 394482269 392476730
3761 392476730 396328583 396719818 397134361 399827385 396536255 392532730 395933838 401185951 400534859
3769.7 400534859 392051125 392752075 395385818 395736351 396041641 395597878 395730095 396471634 398976517
3778.4C98976517o48690o778602K576980J870690k87514J648102k619858j053200L37639
3787.1C94022064M36402J031951l7193l700m48990M30298n80559K267380L480873n330162
3796.7C95268364m317932J286545N389289P223053o261558j1329155K195587L001251
3804.4C92455444M531746L749390j1184883k971192M297600J653481N41000K49786
3812.2C93322372O09818J832466N887642l522491j3550873N753021O247787N771370
3819.9D02351112J030274j7863426l7537N169830J711273K110787l73154n169067O85615
3828.6C89615707J950684L491440R68551q258819L267898N672951o797829l56483P708359
3837.2C97262459r388771j735001P850380o889496L95622N740967k949371m061050
$$ plain form
3778.4 398976517 398327827 391549225 394126205 395996895 395709381 397357483 394737625 393684425 394022064
3787.1 394022064 394458466 395490417 395453224 395449524 395000534 395430832 394850273 397117653 400598526 395268364
3796.7 395268364 390950432 392236977 397626266 404849319 398587761 387258606 389454193 392455444
3804.4 392455444 396987190 400736580 389551697 386580505 390878105 392531586 393072586 393322372
3812.2 393322372 393932190 395764656 401652298 398129807 384578934 390331955 396579742 402351112
3819.9 402351112 403381386 385517960 385480423 390650253 392361526 394472313 394099159 388930092 389615707
3828.6 389615707 391566391 395057831 396026382 387767563 391035461 396708412 389910583 389554100 397262459
3837.2 397262459 387873688 386138687 393989067 387099571 387495193 393236160 390286789 386225739
3844.9C86225739K213096R38721K32315K507553p96127K636566M318428l332024J219902
3853.6C96164169k0346107L530197J0221863q63648k650451J374817K484474K414551
3861.3C92329865n063477K47269O545601p196312n627671L918724N910759O784325
3869.1C97849083q315201r202118L168068O089363K192383r874763K70576L202400
3876.8C85379791P1755K395744N138245n702591o827278M378357J14974J999207K902260
3885.4C89850464j1458244J279029L361664R18007M638329o61202q019180J244774
3893.2C81153641J980362j148033O93130R87816K765617M36020q374939M652176K075958
3901.8C85221748m313888M191208l792649k306251K08778L32489K015114j113167p8163
$$ plain form
3844.9 386225739 388438835 389377556 389609871 392117424 391321297 393957863 398276291 394944267 396164169
3853.6 396164169 375818062 379348259 389570122 388706474 386056023 387430840 389915314 392329865
3861.3 392329865 387266388 387513657 394059258 386862946 381235275 385153999 391064758 397849083
3869.1 397849083 389533882 380331764 383499832 389589195 391781578 381906815 382177391 385379791
3876.8 385379791 385451546 387847290 392985535 387282944 380455666 384834023 384948997 386948204 389850464
3885.4 389850464 378392220 379671249 383032913 383950920 388589249 387928047 379908867 381153641
3893.2 381153641 383134003 381985970 382679100 383666916 386432533 386868553 378493614 383145790 385221748
3901.8 385221748 380907860 385099068 381306419 379000168 379208946 379541435 381556549 380443382 380365219
3910.5C80365219k39982k44484k09084j030388J762200K403335l196945l511009M390907
3919.2C80489769J9455m097519J562576J099816J458511k260475l094025O89774J530533
3927.9C77398415J829910j072769J2665M62684k573356p22580J628456j4878j012420
3936.6C75936127M79850k26593n00946o95343J591912J091690m297829J60637J162758
3945.2C74702263Q94813J232872k376403k7886j79558j836776J478500L72925j073990
3953.9C73186760R1972K13852l7117j156730m46129K60162O25000Q13141j196823p782
3963.6C72346306L50914q25844o29425K97356R94529j227111r37386L18642m8600n9700
3973.2C70579681J6251R0256m70963l43170o06995M25911K47536p39937m76417q01239
$$ plain form
3910.5 380365219 380125237 379880753 379671669 378641281 380403481 382806816 379609871 376098862 380489769
3919.2 380489769 380509224 376411705 377974281 379074097 380532608 378272133 375178108 375867882 377398415
3927.9 377398415 379228325 378155556 378168221 378630905 376057549 375334969 376963425 376948547 375936127
3936.6 375936127 376415977 376189384 375688438 374993095 376585007 377676697 373378868 373539505 374702263
3945.2 374702263 375597076 376829948 374453545 374425659 374246101 372409325 373887825 374260750 373186760
3953.9 373186760 373278732 373492584 373455467 372298737 371852608 372112770 372737770 373550911 372354088 372346306
3963.6 372346306 372697220 371871376 371241951 371539307 372533836 371306725 370369339 370687981 370639381 370579681
3973.2 370579681 370595932 370686188 370215225 369872055 369265060 369690971 369938507 369198570 368722153 367920914
3982.8C67920914J056671M59442p12929k58026k39677J28288m09584R7999M30489J5297
3992.5C68488884q02803l44086j23634o02188K49176j66588M56505K15950
4000.2C67371216
$$ plain form
3982.8 367920914 368977585 369437027 368724098 368466072 368226395 368354683 367945099 368043098 368473587 368488884
3992.5 368488884 367686081 367341995 367218361 366616173 366865349 366698761 367155266 367371216
4000.2 367371216
##END=$$ End of the data block
