##TITLE=$$ Begin of the data block
##JCAMP-DX=5.00 $$ ACD/SpecManager v 10.08
##SPECTROMETER/DATA SYSTEM=Varian
##DATE=04 Dec 2012 14:52:12
##DATA TYPE=INFRARED SPECTRUM
##DATA CLASS=XYDATA
##ORIGIN=
##OWNER=
##NPOINTS=3735
##FIRSTX=399.26403809
##LASTX=4000.35498047
##MAXX=4000.35498047
##MINX=399.26403809
##MAXY=70.09288788
##MINY=33.56509781
##XFACTOR=1.0000000000
##YFACTOR=0.000000100000000
##FIRSTY=64.41255951
##DELTAX=0.96440572
##XUNITS=1/CM
##YUNITS=TRANSMITTANCE
##XYDATA=(X++(Y..Y))
399.3 644125595 663598709 666706314 666217880 664600525 657081680 652603226 654511108 659006195
407 659006195 660503769 661375885 657144852 650346756 653214264 661445160 669190903 670604019 663399811
415.7 663399811 656921158 654090576 655547714 656758575 645295029 642972565 648187408 655803070
423.4 655803070 659079132 660126877 657910461 655652313 655375824 650966568 647935257 652045898 655841370
432.1 655841370 656847458 654324570 650634995 651716995 656996536 660705643 662027588 660367508
439.8 660367508 659768829 662222824 657721710 655639954 659081650 663074188 667085724 661020966 659309616
448.4 659309616 661326752 658807831 661604767 663091736 660396500 660837402 658822327 657229691 656859283
457.1 656859283 650915527 655641708 660358200 657531586 654972534 658607101 663052826 657325439
464.8 657325439 656232834 663182678 660548935 657486725 655580444 653793564 654025574 650078659 650008316
473.5 650008316 654481201 655224686 652669830 657547302 661829681 654850159 648148727 651889343 658429642
482.2 658429642 657367935 652551193 650149994 652728043 656883545 654531784 653141403 657673416
489.9 657673416 659354782 657023163 654297028 650588760 650173798 649896317 648029022 652980957 657656479
498.6 657656479 654405823 652941437 655440216 653347549 651701279 651898499 649909363 649067688 650615234
507.3 650615234 654778900 655460052 654058838 654602585 652489090 651301346 650788956 650072632 650625763
516 650625763 650898819 649529648 646538849 647142181 649142151 649747772 651068344 651469955 651052704
524.6 651052704 649494324 647960587 646543121 644767380 645295029 645960007 648232956 653831558 656530609
533.3 656530609 656481400 656326752 654332504 649466629 646185760 649088898 650929718 652582779 656704330
542 656704330 655997009 655186234 656501236 656899948 656465912 654287491 652649841 652871933 654329376
550.7 654329376 653627167 652653732 653905869 655493240 656270294 655352402 654779358 654204102 653231583
559.4 653231583 650843048 647967377 647576141 647695465 647888031 648351974 649326553 650219650 650867386
568 650867386 651108780 647914658 643972778 642501068 642887268 643051147 643213882 644167480 646431122
576.7 646431122 648341064 648797302 649194794 647860413 647424164 648210220 646931458 646881943 646877594 646378860
586.4 646378860 647899857 650464783 652091522 652563629 653353577 654089890 654833298 654068680 652142258
595 652142258 651359100 650380020 650204315 651128998 651124725 651180038 652448578 652905579 651679306 650314865
604.7 650314865 649768524 649149475 648760529 649691086 650197525 650388260 650916061 651716080 651567993 650775070
614.3 650775070 651536560 651750946 652306976 652872238 652539902 653113174 653754120 655118866 656106339 657969818
624 657969818 660304718 659726257 658111954 656771240 657264709 657864761 658533249 659914398 660391464
632.7 660391464 661645813 662394943 663184891 663821259 663242798 663190002 662471848 661516190 660824356 660084686
642.3 660084686 661459732 663807373 664102402 664338760 665036697 665104752 665556488 665240173 664823074 663917007
651.9 663917007 662954025 664018402 664852219 665347824 666831131 667481995 667050400 667010422 665885391
660.6 665885391 664153061 664280701 665149765 664574051 664401016 667972260 672913742 671765823 669489288
669.3 669489288 668307266 667337341 667189941 667144775 667233505 667785568 668339462 667923889 668339767 669212875
678.9 669212875 669985504 670177841 669208755 669664459 670297546 669050522 667885971 668588638 669985733
687.6 669985733 669939651 668992081 668797302 669993820 670798645 670025940 669568558 669038925 668242187 668062668
697.3 668062668 667524719 667407837 667139435 666560059 666625366 666202698 665582428 665047836 664372482 663413315
706.9 663413315 663276672 663447189 663210831 664417953 665354996 665442963 665396423 665383835 665857315 666428452
716.6 666428452 667424469 668439484 670581360 672048645 671448746 670817642 669937668 670276108 671485062
725.2 671485062 672887650 673638306 674067154 675301361 675671234 676409225 677257843 676761780 676100845
733.9 676100845 677483749 678983841 677824554 677129059 677916412 678393478 678249359 679174576 678559341
742.6 678559341 677292099 678432083 677088013 675884933 676095047 675240326 674527206 674026260 673742828
751.3 673742828 672458115 672190323 671845245 670750351 670684814 669703140 667853928 666780243 668316650
760 668316650 669485703 669230042 669167328 668715668 669273148 669841537 669949646 670135880 671222687 672117691
769.6 672117691 671973953 672726517 673401413 674837418 676369400 676965790 677269363 677581635 679099655
778.3 679099655 679834442 679948502 680301514 680272293 680308609 681169510 682573547 683229294 684225922 685179672
787.9 685179672 685510941 686321869 687557220 687905884 686973495 686654358 687344894 688054810 688816910 689949036
797.6 689949036 690483398 690973511 692049561 693631439 695218048 695256271 695332108 694899521 694447403 695554428
807.2 695554428 696709137 698002396 699010162 699596481 699822998 700374451 700384750 699396591 698264847
815.9 698264847 697525940 699030685 699458084 698199234 698432693 700131760 700928879 700329590 700078659
824.6 700078659 698777008 698154297 697415314 695349350 694073639 693728027 694469528 694342957 693905792
833.3 693905792 693062820 692127609 691463852 689761047 688659973 687003708 685349960 684573441 684102478
841.9 684102478 684290848 685033569 686102753 686180038 685765686 685122604 684944992 684169617 682269974 681991119
851.6 681991119 682648010 683274918 684049683 685202637 685550766 685674667 686548615 686002731 685472183 685583420
861.2 685583420 685029907 684678879 685473938 686967316 688848267 690377655 691204987 692430267 692837067
869.9 692837067 693212280 693510056 692810059 693214493 694705734 696157074 697006760 697917175 697969131 697953186
879.5 697953186 698641357 698269119 697437744 695805359 693919373 692036896 691155624 691668701 691910858
888.2 691910858 691625977 690899963 690357361 689110947 688175507 687265625 685582123 684390564 682617264
896.9 682617264 681479492 682037659 683072052 682987595 682939072 683561325 682813950 681718063 680296936
905.6 680296936 678641434 676811295 675031891 674888000 675830002 676451569 676185455 675916748 675238800
914.3 675238800 673687210 671709976 669777679 667680893 665736542 665481033 665401917 665731888 667011642
922.9 667011642 667630386 667461243 666250687 665090485 664325790 663057022 661754456 661377411 661329117
931.6 661329117 661756897 663492584 665085831 666260605 666836853 666845779 666559906 665883255 665962753 665853577
941.3 665853577 665503998 666416016 668885269 671389236 672885361 674006882 673869247 673399887 672813797
949.9 672813797 670841675 669060898 668482132 668222122 668168411 668219452 668003311 667984314 667753754 666839523
959.6 666839523 664433746 661072998 658516235 656264038 654576416 653387833 652830734 653107758 652347412
968.3 652347412 651236420 650445786 648512268 645970001 643234100 640373077 637880249 635961647 635039330
976.9 635039330 633941956 633399239 633264999 632157860 631215858 629676361 627508965 624845390 622623024
985.6 622623024 621901436 621420708 621559486 621524887 622389145 624009018 623718147 623390617 622649498 620592079
995.3 620592079 618928947 617986526 617969589 618085442 617996140 618526459 619567375 620778236 620960464 620443153
1004.9 620443153 620130272 618821831 616895103 615123405 614009552 614328766 615044060 615846519 616681366
1013.6 616681366 616371193 615272255 614730301 613959923 612917938 612120819 610808411 609829330 609418602
1022.3 609418602 610341606 612437515 613703575 614275208 614628410 614596672 613739662 612871361 612155151
1031 612155151 611211700 611336632 612566605 613988838 614857368 615283470 615506592 616263809 616089439 613492050
1040.6 613492050 612094193 612516441 612460480 611859398 612374573 614049568 614979362 615062752 614957924 615891228
1050.2 615891228 616147041 614870262 614715080 614786568 614376831 614291000 614685898 615616798 617110634 618595085
1059.9 618595085 619209557 619205627 618845253 618458366 618779907 619689522 619987831 620376587 621238022 621940460
1069.5 621940460 622783432 622006607 620890617 620189857 618428230 617345543 615867920 614119186 613780937
1078.2 613780937 614693756 615967484 616327286 616473312 616732750 616129684 615072975 615382233 615697594
1086.9 615697594 614587173 614132004 614791794 616431236 617596169 617411652 617846756 618492889 618680916
1095.6 618680916 618687553 618422775 618387947 618097000 617428627 617798119 618786240 619183121 619231339 619096909
1105.2 619096909 619346848 619748459 619048195 618098488 618121529 618396339 618351402 618693199 619324265 619946899
1114.9 619946899 620399742 619939995 619678879 620320168 620623817 620415382 620385590 620806084 621003036 621220665
1124.5 621220665 621812363 622218552 622767296 623153381 623446312 623370247 622747688 623101692 623808060 624197578
1134.1 624197578 624674721 624654884 624349556 624626389 625226364 624934692 623850327 622678299 621445274
1142.8 621445274 620751266 620758667 620516663 619834442 619546776 619320831 619022865 618480682 617425117 616769409
1152.5 616769409 616190567 616051216 616239204 615645561 615335503 616025887 616527100 616514282 617206726 617641602
1162.1 617641602 617020187 616745071 617403831 617986145 618295174 619460754 620811806 621886597 622676163
1170.8 622676163 623633118 625231400 626591454 628023491 629483566 630311737 630921936 632506523 634836960
1179.5 634836960 636463242 637707596 638724937 639781609 640628052 640123901 640527496 641746750 642024384
1188.1 642024384 642724304 643567810 644488754 645090714 644911270 644872360 644468613 644060211 643980408 643926010
1197.8 643926010 643746643 643117752 642733307 643279114 644186478 644374847 644319458 644677124 644496689 644001007
1207.4 644001007 644139252 644651108 645110092 645326385 645613632 646131668 646706924 647672806 648505554 648637390
1217.1 648637390 648625870 648614273 648436127 648135834 648245773 648578644 648554153 648738937 649017792 648337097
1226.7 648337097 647322159 647067642 647028809 646757126 646127396 645631943 645553665 645470123 645664291 645959854
1236.4 645959854 645855865 645230179 644853821 645318604 645786057 645259933 644423523 644691315 645086288 645117645
1246 645117645 645482941 645974121 646321259 646409149 646547852 646426697 646013718 645640564 645664368 646253433
1255.7 646253433 646600571 646758347 646941071 647165070 647205963 647180557 647338028 647179031 647099838 647281418
1265.3 647281418 647599945 647600555 647845306 648660736 648827133 648898468 648868790 648517990 648161163 648143616 648353424
1275.9 648353424 647859421 647730942 647894287 647922592 648500443 649077454 649082184 648433151 647996826 647946854
1285.5 647946854 647557983 646944351 646484756 646187668 646312027 646592865 646643295 646604462 646312866 646141052
1295.2 646141052 645643387 644759750 644263000 644032516 643737411 643079758 643188782 643800583 643818283 643589325
1304.8 643589325 643303833 643349075 643347015 642866669 642150574 641669159 642188568 643358231 643023529 641699219
1314.5 641699219 641756210 641987686 641741562 641607437 640964508 640009995 639153442 638454247 638163033 638117523
1324.1 638117523 637695465 637374496 637227287 637103996 637093163 636614571 636058731 635607872 635228386 634682236
1333.8 634682236 634310036 634461937 634264107 634171906 634617424 634843864 634159622 633369217 633025742 632714691
1343.4 632714691 632490997 632374077 632120934 631834145 632220116 632751198 633020363 633086700 632440720 631682587
1353.1 631682587 631331406 631236801 630465851 629809456 629817238 629689980 630271378 630654488 630614090 630510712
1362.7 630510712 628451385 627844658 628294754 627920837 628039360 628162994 627263489 627058907 627197227
1371.4 627197227 628186569 629464836 628695946 627730217 627433968 627611504 627347412 626717644 626933250
1380.1 626933250 626829338 626720924 626810684 627218781 627614479 628337708 629834023 629122429 628367805 628592606
1389.7 628592606 628427544 628398819 629012718 630786247 631186638 629291420 629333534 630357285 631703110
1398.4 631703110 630349197 628198891 627993393 627668571 627692719 628406334 627766762 626716766 626973953
1407.1 626973953 627076454 627182388 627237892 626737099 625798340 624915886 625151405 625479774 625960770 626445808
1416.7 626445808 627412262 630104637 625936813 623031464 624831161 625937309 626429977 624459801 623661919
1425.4 623661919 624352150 624409332 625729904 627007103 625809975 624942780 625747261 626007080 625511627
1434.1 625511627 626789360 628852310 625145683 623216972 625182457 626146812 626563797 626753693 626440163
1442.7 626440163 626653099 626476593 626012764 626186676 626798897 625377884 624906120 626066742 626289749
1451.4 626289749 626066666 625926895 627365685 629407654 629597740 626209793 623618202 624860039 624082146
1460.1 624082146 624982986 625703888 626397476 629356384 628538628 626666145 627645950 628856201 629358940
1468.8 629358940 630166550 633485565 636287460 635476036 633289299 635169563 638686409 638406296 637803764
1477.5 637803764 639744644 641131744 642586594 643585587 643236771 644632263 646169968 647778549 650809097
1486.1 650809097 651480408 651229324 653988876 655664825 652167740 651866989 653760071 655191879 658160934
1494.8 658160934 661448441 657733383 659198608 661377487 658604889 660363007 662021637 661542969
1502.5 661542969 662690582 666039810 671371841 669956436 662983398 663883667 665635147 666071472 667570724
1511.2 667570724 668724060 666063461 667560425 669452209 670790100 671688538 665093765 669265442
1518.9 669265442 675335236 676707001 673184662 669052277 671195831 674252396 671401062 669532852
1526.6 669532852 671865463 671220093 670548630 672534332 673897095 676036453 677025681 671246872 671510544
1535.3 671510544 672820969 675012360 680766373 683382111 669092102 673564835 675800781 673902512
1543 673902512 676759949 677133560 671755447 672257156 674023972 676213684 676488647 671908875 672610931
1551.7 672610931 675390320 678238068 675482864 673147430 678706436 686188965 686010666 679226303
1559.4 679226303 668715897 671229172 673533020 674974594 676572647 674643860 673367386 674571609
1567.1 674571609 676732712 679448624 672380905 670893326 672785797 672922821 673950577 676836319
1574.9 676836319 678985977 669418182 670008850 672146378 671500626 671016464 669952316 669486694 669069977
1583.5 669069977 668770370 668325577 667792435 667943649 667622375 667382889 666602707 666125946 664601212
1592.2 664601212 663526764 663113251 661501617 661347198 660505219 659641800 658792648 658359299 657879486
1600.9 657879486 656513748 655796738 653427200 651631470 651067963 650506516 648416214 647336121 646543579
1609.6 646543579 643943100 643504715 642435074 641267776 639666939 640633163 642417221 630912056
1617.3 630912056 630942154 631285934 630481453 629404182 630559616 631888733 624763412 623547974 623582535
1626 623582535 624528236 622257347 618244858 618465271 617955093 617856865 617347870 619028854 623066750
1634.6 623066750 618517265 614656296 615408554 614228134 614667473 615128937 614340782 615336266 615254021
1643.3 615254021 617158737 621251411 621121750 619575310 615826874 615411682 617598686 621398773 628037567
1652 628037567 633134003 618635139 618376732 620951309 622955246 623492012 624163055 625040321 625951538
1660.7 625951538 628482590 629723015 626536636 627855949 629927750 630858078 633524284 637841377
1668.4 637841377 636209908 634398346 637279701 636826515 638269043 642824326 643807907 638680649 640732040
1677.1 640732040 643945465 646298752 647902603 646796799 649544220 656382751 661126175 649204254
1684.8 649204254 647327728 651558762 654424667 654462128 656126709 657130356 658249512 659577179 660673981
1693.5 660673981 665021133 668670807 659866562 660881805 665532074 672524948 674914169 658087997
1701.2 658087997 663600311 668592224 670856476 670688019 671324539 669683151 669184418 671714859 672343903
1709.9 672343903 671504593 672510910 674512177 677620468 677420425 674810181 678371277 682372894 673520660
1718.5 673520660 672604523 675531464 676987457 678096695 678395157 677350311 677723618 678762131 679210892
1727.2 679210892 679838333 682318878 681644211 679420547 683323822 688171844 686792526 676345520
1734.9 676345520 678774261 681993027 682447739 685464706 685443802 680156097 682808609 686176758 685072174
1743.6 685072174 682770233 684423523 686261520 687105713 686483994 684392166 687420120 686429291 681537247
1752.3 681537247 683940201 685131073 685824203 688166351 685973129 685017624 686089554 686928253 689897232
1761 689897232 687399673 684201202 685855789 686395187 686548080 687949371 689402084 685453110 686223984
1769.7 686223984 691084824 693065643 689545975 684626846 687514496 689286880 686505432 687179184
1777.4 687179184 687711029 688518066 689429016 687236862 686785278 688004761 689283142 688370438 686881866
1786 686881866 687813721 687815094 687867279 689750595 690530624 691569443 688411942 684893646 688009033 690025635
1795.7 690025635 688561935 688321762 690123291 690000000 687795029 689173203 688806076 687584152 688332367
1804.4 688332367 688242569 688328857 688737106 688077621 688622437 690117416 688563232 687882996 688265457 687713699
1814 687713699 687861710 688010330 688721008 687950439 687195587 688031006 687946167 688292618 687799683 688400116
1823.7 688400116 690630875 687796707 685892715 687649612 690462952 691898193 686146317 684987564
1831.4 684987564 687096863 687456207 687180252 686834641 687565155 687464447 685967636 686094742 686047745
1840.1 686047745 686284790 686525040 688484421 690472870 684189606 683715515 685540009 685235672 684368286
1848.7 684368286 684173965 684478149 684356613 684637527 684747009 684670715 684503708 684122086 684088287 683954620
1858.4 683954620 683858109 683753433 683582382 682774887 682713699 683018417 683093796 683978500 684202194 685240402
1868 685240402 684757462 681540070 681533203 682355499 682270660 681675720 681413574 681386337 681870880 682230759
1877.7 682230759 682070923 681807632 681353455 681372528 680799408 680741806 680730362 680015030 680264969 680400314
1887.3 680400314 681955795 682781677 679741592 679331436 680080795 679898911 680673141 680784531 679103012
1896 679103012 678868256 679103241 679099045 679323730 679175110 679417725 679668961 679405060 678533630 677881927
1905.6 677881927 678073196 678065872 677862167 677828903 677493973 677466965 678284149 678152313 677768860 677400513
1915.3 677400513 677201233 678821030 677190857 674537888 675267105 676229630 677850800 677500153 675594864
1923.9 675594864 675657730 675582886 675148621 674906616 674591904 674197845 673806686 673803253 674059982 674071426
1933.6 674071426 674241943 674367752 674553909 674533691 673779068 673212662 672765045 674126434 675073013 672366562
1943.2 672366562 672485962 673523331 673140335 672766495 672472610 672552109 672320709 671954956 671454315 671162109
1952.9 671162109 671564789 671762390 671837158 671980362 672128296 671987686 671766891 671555405 671171722 670908432
1962.5 670908432 670544662 670343475 670512772 671066360 671328964 670791779 670644531 670729294 670434189 669912567
1972.2 669912567 669437943 669336624 669347000 668898621 668675613 669044647 669223633 669382629 669513779 669359741
1981.8 669359741 669143677 669044876 668762131 667845993 667285080 667623978 667649460 667123718 667858963 668947983
1991.5 668947983 667873611 666854935 666789627 666725388 666523590 665842896 665529785 665588531 665522614 665495377
2001.1 665495377 665597534 665548325 665283661 664965210 664406662 664163284 663719711 662930374 662753296 662710114
2010.7 662710114 662470551 662217255 662217560 662229919 662348785 662121658 660907593 660432205 660142670 659499207
2020.4 659499207 659672470 659836426 659413147 659017181 658759384 658719254 658796616 658444214 657861176 657167130
2030 657167130 656490707 656093292 655686874 655554657 655456314 655366135 655488663 655334320 654903183 654702148
2039.7 654702148 654610825 653652344 653141556 653421707 653031616 652636490 652472992 652668381 652946320 652746735
2049.3 652746735 652546921 652189941 652071991 652117538 651643143 651220474 650994873 650786972 650931244 651066589
2059 651066589 651184006 651327057 650778275 650330353 650580597 650759506 650113678 649261398 649296570 649483490
2068.6 649483490 649613037 649802933 649764481 649747162 649508133 649080429 648775711 648884201 648865967 648562164
2078.2 648562164 648542175 648263168 648038712 648448334 648819427 648571167 648204956 648112183 647848511 647604446
2087.9 647604446 647648087 647566223 647255173 647359085 647687225 647738342 647647476 647397385 647166824 646817780
2097.5 646817780 646432953 646193314 646017761 645892487 645687943 645695190 645939941 646239166 646199188 645839920
2107.2 645839920 645427170 644985123 644851913 644685516 644627457 644797440 644795761 644518204 644317551 644593124
2116.8 644593124 644604721 644437027 644261169 644094696 643893814 643376617 643389511 643328857 642954636 642935638
2126.5 642935638 642953796 642926178 642795029 642662811 642448044 642347794 642301025 642228470 642145462 641649399
2136.1 641649399 641324844 641300507 641534653 641690903 641287842 640991211 640794220 640472717 640276566 640343628
2145.8 640343628 640252533 640002289 639842682 639488182 639383926 639521255 639534912 639375801 639150848 639322891
2155.4 639322891 639566383 639385567 638972282 638860817 639171486 639483681 639396439 639142914 639257355 639361496
2165 639361496 639279213 639203987 639062920 639063148 639019089 638768845 638637886 638795624 639318695 639564972 639473724
2175.6 639473724 639745712 639473610 638833199 638730240 638604164 638755569 639119034 639339523 639575424 639557457
2185.3 639557457 639493179 639548836 639580994 639624786 639671860 639451523 639280205 639544334 639752045 639498329
2194.9 639498329 639123840 639497681 639898758 639678078 639733353 639858437 639643555 639102631 638808441 639075050
2204.6 639075050 639107971 639148254 639469872 639575233 639667206 640087891 640206299 639703217 639535866 639657860
2214.2 639657860 639456177 639342003 639424744 639840622 640263214 639934578 639659882 639810867 639725342 639578934
2223.9 639578934 639612999 639461861 639291267 639484901 639452629 639410019 639726181 639851227 639917183 639950180
2233.5 639950180 639703789 639241714 638783951 638517876 638628120 638782196 638655739 638635216 638735352 639045944
2243.2 639045944 639037056 638530159 638268242 638304443 638563080 638525848 638341255 638138123 637962456 638184166
2252.8 638184166 638219109 638200073 638294792 638391876 638307915 638091507 638032913 637964859 637861900 637526855 637593689
2263.4 637593689 637736130 637591476 637742958 637608833 637504349 637535133 637381439 637199745 636803207 636353798
2273 636353798 636647491 637344322 637495346 637678986 637576828 637260742 637279205 637280655 637018623 636271629
2282.7 636271629 635983162 636093788 636403046 636768646 637035027 637069778 636469078 636686020 636890640 636631050
2292.3 636631050 636291504 635873489 636178017 635912590 635886879 636191826 636433907 636868973 636729202 636880112
2302 636880112 636850128 636889114 636721153 636496773 636800270 636870728 637554245 637903862 638131638 638218918 638382835
2312.6 638382835 638700562 637786789 637844887 637846336 637858467 638560371 638612938 638661690 638528824 639347878 639867783
2323.2 639867783 639801598 640070114 640113144 639823647 639226875 639944077 640237198 639809265 639865112 640394745
2332.8 640394745 639847374 638575935 639581184 639893684 639802475 640306396 640260391 639736519 638480148
2341.5 638480148 638183937 637916451 638048248 637175903 635788460 634631119 632985992 633697624 635498505
2350.2 635498505 636052284 635995712 636522484 638160782 639365158 639808159 639605408 639535179 640162354 639763031
2359.8 639763031 639146271 639412270 638306198 636502571 637082710 637360687 636956863 636421814 634345703
2368.5 634345703 632828522 633311386 633370209 631181526 629057655 627901421 627083740 626201210 625631447
2377.2 625631447 625555763 624670219 623908043 623429298 622769890 622346725 621306801 620145874 619825134
2385.9 619825134 619774666 619542885 619565773 619817276 619767265 619425278 618942337 618684769 618714600 618563843
2395.5 618563843 617972031 617313347 617010574 617036057 617115746 617121620 617374382 617300873 616635437 616162338
2405.2 616162338 615865135 615307274 614708900 614778214 614840126 614497795 614532280 614554520 614485588 614231415
2414.8 614231415 613528404 613140831 612823601 612210312 611956673 611917419 611495209 611168633 611352043 611220055
2424.5 611220055 610999756 611020889 610583229 610236588 609626579 608550491 608318214 608622780 608556366 608015022
2434.1 608015022 607866020 608083992 607780342 607331390 606921997 606421318 605935097 605543060 605053101 604745903
2443.7 604745903 604792900 604782219 604897881 604735756 604401321 604043922 603305893 602677841 602341881 602277222
2453.4 602277222 601876793 601389465 601496391 601478348 601343460 601290627 600941048 600393524 600107956 600010834
2463 600010834 599625740 598923073 598482170 598362236 598102188 597994728 597946701 598043060 598201523 597823715
2472.7 597823715 597369804 597056274 596796989 596318169 595806274 595741196 595687904 595589142 595779419 596037941
2482.3 596037941 595515060 594718132 594584198 594367485 593711662 593406143 593639565 593610229 593613892 593506012
2492 593506012 592849503 592801666 592904663 592531624 592202759 591668930 591041031 590808067 590832939 590714874
2501.6 590714874 590548172 590459175 590402565 590452042 590458603 590115433 589610329 589314919 588952713 588668861
2511.2 588668861 588838463 589001350 588966713 588823357 588490639 588345985 588266411 587751694 587362900 587171326
2520.9 587171326 586644287 586126289 585823021 585688400 586005592 586344795 586061134 585666389 585463066 585236664
2530.5 585236664 584855080 584189720 583696899 583364754 582986450 583119545 583508568 583394127 583098564 582768860
2540.2 582768860 582197266 581811409 581463547 581037598 580902328 580953026 580942001 580796547 580749702 580520554
2549.8 580520554 579839211 579490280 579712601 579548531 578885880 578536758 578426666 578211174 577971725 577819862
2559.5 577819862 577664604 577516060 577318268 577068024 577085075 576875648 576506195 576337891 576021576 575731049
2569.1 575731049 575288048 574784279 574618568 574520836 574386482 574421120 574430313 574276733 574409676 574268913
2578.7 574268913 573589134 573294296 573225479 572851562 572606506 572682953 572390327 571839333 571573982 571414642
2588.4 571414642 571095009 570655975 570385017 570245285 570195961 570254097 570130806 569592552 569287643 569518242
2598 569518242 569339447 568999329 568696899 568180885 568058548 568025284 567663689 567071075 566711617 566902390
2607.7 566902390 566916542 566629677 566335564 565954590 565701218 565678711 565463943 564942093 564590416 564056702
2617.3 564056702 563486748 563723831 563714905 563068962 562508736 562123222 562036552 561500969 560741348 560578613
2627 560578613 560488281 560361938 560109558 559529724 559084091 558921318 558541145 558213005 558121300 557670746
2636.6 557670746 557118683 556691170 556364212 556019211 555631371 555408897 555100632 554571533 553954582 553779907
2646.3 553779907 553713608 553336296 553043404 552636528 552323341 552140923 551782951 551473961 551153603 550558586
2655.9 550558586 550211220 550206833 549846153 549586754 549388657 548978271 548688469 548423615 548322792 547987328
2665.5 547987328 547355881 547108955 547048607 546631393 546315804 546242676 545944557 545786819 545554199 545178566
2675.2 545178566 544953651 544636536 544187431 543717766 543474693 543203278 543007584 543071709 542996330 542698669
2684.8 542698669 542421341 542362518 542193146 542014809 541835098 541246338 540510406 540263062 540450554 540279121
2694.5 540279121 539916725 539758873 539458504 538951988 538602371 538075218 537509651 537563972 537544975 537553406
2704.1 537553406 537526283 537131882 536906548 536591263 536393166 536182709 535687599 535433807 535218353 534839897
2713.8 534839897 534787369 534570312 533753662 533599396 533797836 533553619 533283081 533037949 532873497 532609863
2723.4 532609863 532384567 532102013 531613350 531153069 530817795 530740967 530463715 529870567 529734459 530300217
2733 530300217 530411072 529741859 529055405 528691216 528663368 528429337 528032074 527670135 527652855 527697067
2742.7 527697067 527188759 526732864 526658211 527016335 526835823 526034851 525666618 525544472 525351639 524800224
2752.3 524800224 524467316 524301033 523987541 523831787 523397064 523170929 523397675 523325005 522934303 522668610
2762 522668610 522506752 522321663 521845970 521500015 521692810 521478920 521131744 520815697 520608864 520842590
2771.6 520842590 520643730 520305023 520239868 520025520 519547195 519287796 518922806 518324432 518239021 518214798
2781.3 518214798 518081894 517598228 517504654 517915077 517487030 516955147 516538696 516297722 516250076 515951653
2790.9 515951653 515606117 515268707 515119972 514844971 514543457 514318504 514052620 513673706 513232727 512913399
2800.5 512913399 512387238 512253380 512278404 511942024 511443214 511021919 511108017 510766525 510183182 509989738
2810.2 509989738 509516068 508847733 508455429 508344650 508009605 507398109 506881752 506714363 506635704 506337814
2819.8 506337814 505980072 505518074 505186081 504963913 504452362 503791161 503520813 503539658 503240395 502584496
2829.5 502584496 501876755 501653976 501577225 501043472 500388412 499886436 499614334 499064255 498439598 498285141
2839.1 498285141 497917557 497509232 496926842 495882835 495503502 495460548 494979172 494171219 493551331 493302917
2848.8 493302917 492355652 491305351 490975227 490868149 490542679 489687691 489246178 489166527 488788300 488280296
2858.4 488280296 487842941 487640190 487119942 486475067 485742035 484940186 484855385 484897652 484245453 483118477
2868.1 483118477 482688522 482876854 482248497 481456108 481017075 480355644 479832535 479198570 478379593 477827797
2877.7 477827797 477381668 477079811 476766052 476325264 475714912 475228233 474951591 474364128 474104767 473942146
2887.3 473942146 473247147 472860069 472874107 472611313 472265358 472136116 471672440 471188316 471055298 470897179
2897 470897179 470522423 470070076 469806290 469702339 469911118 469601440 469025040 468987045 468559685 467966156
2906.6 467966156 467641335 467598000 467570305 467316322 466818237 466073341 465492477 464805717 464417801 464159088
2916.3 464159088 463472061 462769814 462319069 462216034 461826210 461378670 461144524 460897446 460595932 460449066
2925.9 460449066 460491829 460129128 459991760 459987526 459725723 459866028 460400734 460583725 460670967 461117172
2935.6 461117172 461122894 461372795 461919403 461996841 461920700 462150726 462606049 462539101 462821045 463011208
2945.2 463011208 462835693 463396339 463605537 463419037 463799553 464495468 464672165 464891319 465347214 465097809
2954.8 465097809 464736595 464903870 465612946 466181488 466608810 467091827 467269325 467285042 467242317 467405586
2964.5 467405586 467683182 468240852 468481560 468356056 468634872 468928299 469550018 470085602 470327835 470578308
2974.1 470578308 470502701 470669212 471316566 471813889 471744995 471730118 472260246 473119850 473691711 473684616
2983.8 473684616 473635635 473958740 474532738 474649010 474685211 474999313 475238342 475591698 475902100 476028481
2993.4 476028481 476174812 476380959 476103897 476072083 476585159 476418114 476086273 475848999 475712013 476071548
3003.1 476071548 476301880 476026688 475732040 475665703 475562668 475671844 475625839 475465889 475750275 475689087
3012.7 475689087 475452347 475352097 474643173 473968239 473881912 473498535 473148117 473221817 472954941 472528915
3022.4 472528915 472393761 472399216 472234230 471745911 471241264 471062469 470964851 470795212 470484123 469929848
3032 469929848 469484138 469017029 468887253 468967705 468500404 468010635 467870979 467768631 467308197 466935997
3041.6 466935997 466489220 465659904 465133247 464646873 464420700 464631195 464443817 463719444 463091736 462352066
3051.3 462352066 461429672 461473351 462048454 461924934 461041946 460018311 459467392 459611397 459352608 458161469
3060.9 458161469 457795792 458160973 458295631 457729187 457083473 457030754 456425323 456021347 455781288 455195961
3070.6 455195961 454695549 454198914 454286613 454255867 453704910 453264999 452986069 452468758 452134705 451991997
3080.2 451991997 451082497 450423889 450322533 450126152 449714394 449323349 449170837 448852119 448453560 447917633
3089.9 447917633 447301788 446718826 446665955 446577606 446137161 446190605 445790634 445443001 445184898 444711800
3099.5 444711800 444531517 443786507 443289680 443287849 443089676 442799072 442427406 442015114 441704788 441362877
3109.1 441362877 440864105 440620079 440234985 439809608 439556847 439192467 438583946 438114204 438306313 437975082
3118.8 437975082 437206497 436687889 436457100 436370087 435718994 435298157 435321579 435098114 434583702 434464378
3128.4 434464378 434518433 434029160 433348465 432824440 432551918 431952362 431587410 431706848 431681366 431540375
3138.1 431540375 430985031 430549202 430282936 429994392 429786758 429547958 429197235 428452835 427693939 427275391
3147.7 427275391 427306938 427436676 427421112 427217484 426891251 426419182 425911293 425683136 425030785 424528084
3157.4 424528084 424315147 424202881 424437981 424162712 423408775 422533989 422566681 422759094 422071304 421389389
3167 421389389 420831833 420532265 420202599 420183754 420135155 419585915 419303970 419245224 419157906 418928680 418583565
3177.6 418583565 417933235 417473259 416718864 416132240 416390495 416179886 416090698 415899239 415598602 414994240
3187.3 414994240 414270096 414304199 413526115 412957649 412963638 412803879 412876968 412832222 412748871 412603722 412217636
3197.9 412217636 411382790 411071625 410806618 410325165 410114441 409648743 409555893 409217834 408868866 408849716
3207.5 408849716 408715057 408163567 407338524 407148590 406591568 406245613 405951347 405318718 405294533 405369225
3217.2 405369225 405588799 405013695 404060936 403774071 403539009 403271065 403134499 402834549 402390137 402715187
3226.8 402715187 402689133 402127495 401693420 401342812 401690483 401245155 400270233 400170288 399969673 399395828
3236.4 399395828 398940773 398642082 398349419 398168297 398418312 398529053 398289833 398324394 397670326 396658249
3246.1 396658249 395975342 395441933 395625801 395642433 395434036 395116081 395125084 395338936 394663277 394318581
3255.7 394318581 394146767 393724403 393567924 393573723 393103828 392319641 392346420 392495232 391998177 391156044
3265.4 391156044 390909920 390793991 390688858 391121216 391031342 390630608 390157700 389796867 389232826 389251595
3275 389251595 389824905 388825188 388377151 388605309 387757530 387171631 387349358 387439842 387170143 386876869
3284.7 386876869 386392365 386142235 385980301 385656281 385197258 384896965 385062294 384802208 384695663 384618340
3294.3 384618340 384350891 384232941 383950691 383665123 383084030 382445450 381973801 382165260 382256813 381528053
3303.9 381528053 381257668 380963135 380232964 380124435 380265274 379298325 378359413 378063011 377937431 377827873
3313.6 377827873 377136002 376805458 376732025 376821556 376800461 376403008 375904350 375198288 375359268 374815788
3323.2 374815788 374131432 374532318 374527245 374213600 373294411 373016891 373322754 372816963 371779976 371175728
3332.9 371175728 371256714 371098480 371058769 370166512 368878822 368611374 368448792 368003197 367625084 367782326
3342.5 367782326 367561340 367145309 366680908 365882797 365292053 364856873 364615440 364053650 363774605 363560753
3352.2 363560753 363427887 363777962 363250275 362490234 362026253 361760559 361365700 360769310 360678902 360292778
3361.8 360292778 359396858 358906517 359098320 358930321 358405724 358238640 357767372 357088737 356560974 356072311
3371.4 356072311 355667305 355349846 355186119 355294151 355412064 355120049 354081421 353298569 353481178
3380.1 353481178 353087425 352438354 352208366 351579895 351053734 351276588 351402855 350903473 350684814 350445557
3389.8 350445557 350122261 350045891 349337463 348465576 348223534 348134956 347540131 346794357 346593094 346889877
3399.4 346889877 346849442 346188583 345938988 346015587 345908928 345626030 345516815 345305252 344595947 343857498
3409.1 343857498 343488350 343425751 342782974 342485199 342762756 342243805 341856461 342111816 342088966 341733017
3418.7 341733017 341536636 340656166 339972115 340366096 340827675 341239815 340447197 339340477 339303322 339401398
3428.3 339401398 339413223 339552765 339526520 339094467 339039917 339076195 338946609 338794785 338550034 338304596
3438 338304596 337998123 337922974 337600822 337816467 338128738 337466736 336891861 336917877 337257996 336548233
3447.6 336548233 336281853 336438408 336417122 336974678 336804314 336598244 336639442 336400795 336261215 336739769
3457.3 336739769 337259483 337030106 337115974 336780052 336379509 336357422 335983887 336090775 336509209 336441154
3466.9 336441154 336068497 336328201 336318932 336155052 336436501 336468544 336556702 336146317 335650978 335895233
3476.6 335895233 336276817 336121635 335951881 336503792 336922646 336452255 335677795 335943756 336614037 337229080
3486.2 337229080 337779579 337420349 336787949 337145119 337925491 337603073 337558250 338167038 338628654 338937187
3495.8 338937187 338172073 337688293 337923088 338347054 338684502 339384384 340198402 339366913 338813782 339055977
3505.5 339055977 339025612 338901176 339287491 339272270 338985634 339756279 339777374 339884415 340065918 339696236
3515.1 339696236 339899063 340137787 340448875 340707321 340358772 339848328 340778770 341556206 340982094 341266747
3524.8 341266747 342060890 342783089 342437363 342358589 342344780 342398415 342682953 342234726 342678947 343132820
3534.4 343132820 344497452 344879646 343092651 343236046 343764038 344035263 344529953 345889626 346110268
3543.1 346110268 346100006 347113533 346367950 346581879 345872345 345795860 346462555 347163391 348316803 346882515
3552.7 346882515 347430496 347606583 347722397 348800507 348072395 349089737 350070457 349574585 348712730
3561.4 348712730 350009193 351032066 350915184 354651756 354833260 352641945 351084709 348770409 351168671
3570.1 351168671 352430534 352928543 354277458 355263977 354665871 354529266 355778542 355517921 356428185
3578.8 356428185 356584053 356216888 357041779 357454376 357295036 357111588 360838852 362623749 360772934
3587.5 360772934 360614853 357553368 358970451 360839958 362377129 362960091 362262230 363326836 361345596
3596.1 361345596 363132591 365374260 364781342 366624680 366672745 366052780 366156921 366656685 367906075
3604.8 367906075 370141296 371591492 369180298 370785294 368829155 367756767 374393311 374731560
3612.5 374731560 371429482 373936958 372623825 374763451 377989731 377626190 378344460 375999641 375473518
3621.2 375473518 377474442 378488884 379472580 380531769 380965271 381999893 387991791 388245163 376539917
3629.9 376539917 379943924 384007301 388049240 388032951 385032692 386606102 389014053 390308456 389443703
3638.6 389443703 389595451 390627022 391559525 392001076 392029457 393427162 396437569 401674347 399962349
3647.3 399962349 397547569 402765350 401533318 397007256 393656387 397241478 400386086 403902931
3655 403902931 408088226 399989090 400840721 404263420 404389572 405525208 406168365 407495842 407392807
3663.6 407392807 408211975 409380531 410028534 413985596 416411552 417024689 417009888 408451691 409117775
3672.3 409117775 417391052 427073059 426636658 408835716 410565338 416716080 419717178 417263184
3680 417263184 417294006 419321327 420316658 421387253 421340866 421400757 425719185 432594833 425182686 421190948
3689.7 421190948 428391418 421531906 420167961 424624367 424090652 425014381 425227699 425261154 426456032
3698.4 426456032 426375275 428629990 430843582 424828186 422583618 427087440 428044815 427447166 427029839
3707 427029839 429558830 433948021 427280540 430962029 435312157 422502937 424851189 428031197
3714.8 428031197 428156776 428681030 431273079 432331467 428315468 428989410 434443970 432122345 427586060
3723.4 427586060 431695786 433185654 433347664 429214439 427265091 430106850 431117249 436870804
3731.2 436870804 433287086 427109833 437515831 438479080 428194847 426795921 427704773 427418289
3738.9 427418289 429786339 432244453 428173790 431616287 443782921 434540749 416152115 425026131
3746.6 425026131 430822678 437158089 433151665 424456329 435672226 428502655 421301270 426254845
3754.3 426254845 430132370 432904739 427553825 429926872 434683380 426799316 424696960 428138046
3762 428138046 429078293 429917412 433488998 429774857 424861336 428270226 433946991 434447403 424404945
3770.7 424404945 425357285 428375168 429010544 429551544 428375473 428405533 428781281 432343445 432732658
3779.4 432732658 424548531 426249466 428164711 428666992 430640793 427752838 426038475 426755142 427511749
3788 427511749 428177948 427458496 427369461 427388344 427359886 426913223 428898430 432553444 428297310 424271469
3797.7 424271469 425730171 429639702 436499977 432389412 421438789 422791252 424939995 429418182
3805.4 429418182 434728508 425362816 420843086 425197449 426623535 426265030 425426521 425206871 427874718
3814.1 427874718 434920654 433016891 417941093 422613144 428122597 433582344 435522995 418092384
3821.8 418092384 418826332 422832336 424495888 427294579 428486748 424695015 423474617 424704475
3829.5 424704475 427908249 428984489 420588493 423558731 429940910 424294090 424376335 431465836 422674637
3838.2 422674637 419528160 427696915 421529388 420578461 426363564 423081093 419479561 421781883
3845.9 421781883 423014565 423109169 425241661 424235916 425292358 430173759 426608429 427525520 410192795
3854.6 410192795 414101181 424455338 421860733 419077950 421077652 423882256 425846710 420459099
3862.3 420459099 421359749 428005180 421059723 414664688 418478203 423784599 430708733 423406982
3870 423406982 413337288 416748314 422602921 425512962 415996246 415597267 418415489 419215202 421943855
3878.7 421943855 425964966 420515556 413697281 418942070 419005051 421536255 426959000 413571548
3886.4 413571548 413259315 416230888 417779312 422928619 422465935 413796349 414596748 417398529 416112213
3895.1 416112213 417208138 417135162 419356232 420481682 410871468 416598549 418525620 414068985 418567276
3903.8 418567276 414608955 412655106 412519188 413226357 415853462 415023689 414519157 413894501 413215103
3912.5 413215103 413004036 412521935 414470100 416572609 413183746 410460434 414491844 414373245 410093079
3921.1 410093079 411966629 414152145 415565338 413023109 409164352 410165558 411173134 412142334
3928.8 412142334 411290054 411986694 414003296 410088539 408404884 409751740 409733200 409541740 409839859
3937.5 409839859 410024872 409500885 409102859 410774689 412148170 408490677 407693100 408600845 409403267
3946.2 409403267 410874748 408543549 408771973 408503876 406199226 408037033 408009834 406640930 406638756
3954.9 406638756 406980362 406966209 406195984 406105499 406381721 407249794 407548218 406463509 405811882 405880051
3964.5 405880051 405996475 405567665 405350380 405934639 405455399 404736404 405555191 404991646 403846321
3973.2 403846321 403756294 403693428 403922729 403711929 403817062 403698692 403183212 403244629 403358078 403449898
3982.8 403449898 403480377 403517456 402862396 402623291 403133011 403404388 403327484 402499580 402086868 401780739
3992.5 401780739 401690254 402051048 401461678 400686874 400877991 401093636 400551949 400498962
4000.2 400498962
##END=$$ End of the data block
