##TITLE=$$ Begin of the data block
##JCAMP-DX=5.00 $$ ACD/SpecManager v 10.08
##SPECTROMETER/DATA SYSTEM=Varian
##DATE=18 Dec 2012 10:13:18
##DATA TYPE=INFRARED SPECTRUM
##DATA CLASS=XYDATA
##ORIGIN=
##OWNER=
##NPOINTS=3735
##FIRSTX=399.26403809
##LASTX=4000.35498047
##MAXX=4000.35498047
##MINX=399.26403809
##MAXY=83.20277405
##MINY=31.26041603
##XFACTOR=1.0000000000
##YFACTOR=0.000000100000000
##FIRSTY=66.83155823
##DELTAX=0.96440572
##XUNITS=1/CM
##YUNITS=TRANSMITTANCE
##XYDATA=(X++(Y..Y))
399.3F68315582K1637345M3131637j3244247l7187119r298935L2017975K6459503j7606201
$$ 668315582 689952927 733084564 719840317 682653198 673354263 705372238 731831741 714225540
407G14225540l5850067L317184K5500565R12705k0873185j7005920J0524063J4611053
$$ 714225540 678375473 681692657 707193222 708105927 687232742 670226822 680750885 695361938
414.7F95361938n466842n506363O456757K5325698J4472809j8305816j4658204j0972290
$$ 695361938 689895096 684388733 690845490 716171188 730643997 712338181 697679977 686707687
422.4F86707687m102325O216507L504257j248474k44217R55048L127670N519638J643677
$$ 686707687 682605362 688821869 692326126 691077652 690833435 691788483 694916153 700435791 702079468
431.1G02079468k403717R20181q489761p395935J0450592O991424n344009m886170
$$ 702079468 699675751 700595932 692106171 684710236 695160828 702152252 696808243 691922073
438.8F91922073Q786393Q441772r509430j5565338j698074J0174865P78733p694779
$$ 691922073 700708466 709150238 699640808 684075470 682377396 692552261 693330994 685636215
446.5F85636215r56116N088425p87735m970321N536270Q922271l93905j2339325p700882
$$ 685636215 684680099 689768524 688980789 684010468 689546738 698469009 698075104 685735779 678034897
455.2F78034897N410080N449905m886093p181168M082795J3547287L634185j3514099
$$ 678034897 683444977 688894882 684008789 676827621 680910416 694457703 698091888 684577789
462.9F84577789o880951R534989L043594p113724p054901J104813Q491669M251785
$$ 684577789 677696838 687231827 690275421 683161697 676106796 677211609 685703278 689955063
470.6F89955063o471024q046417R558106M476547J920776m365082j0805206K19269
$$ 689955063 683484039 675437622 684995728 689472275 691393051 687027969 676222763 676442032
478.3F76442032P341003M749985l157577j457749K819977N788498N874862p695388
$$ 676442032 683783035 688533020 685375443 683917694 686737671 692526169 698401031 690705643
486.1F90705643r414368K013397Q998490L382339q621597o074677J0195465Q382035
$$ 690705643 681291275 683304672 692303162 695685501 687063904 680989227 691184692 699566727
493.8F99566727q971253p297439O754303P284622l065949q208542k834396J621018
$$ 699566727 690595474 683298035 690052338 697336960 694271011 686062469 683228073 684849091
501.5F84849091M388046J441040o17066k55355l187561l729172J335068J179962l058930
$$ 684849091 689237137 690678177 690061111 689805756 686618195 682889023 684224091 685404053 682345123
510.2F82345123j926346j035919j254272J033249K954712J811218k863464q73566l06931
$$ 682345123 680418777 679382858 678128586 679161835 682116547 683927765 681064301 680190735 679883804
518.9F79883804m750900n706177l113174M412613N943680o6834k860031q70819J851730
$$ 679883804 675132904 669426727 666313553 670726166 676669846 676603012 673742981 672872162 674723892
527.5F74723892P36389l231506l816528J290283J890259j684418k478561P00302N033035
$$ 674723892 675460281 672228775 668412247 669702530 671592789 669908371 667429810 668130112 673163147
536.2F73163147J891251l390427j632004L281555O67191m522858k647171J169815K928849
$$ 673163147 675054398 671663971 670031967 673313522 673980713 669457855 666810684 667980499 670909348
544.9F70909348J129226J084366L600464K273331j340866l131943j175690J241531
$$ 670909348 672038574 673122940 676723404 678996735 677655869 674523926 673348236 674589767
552.6F74589767J551667j078415j117172P78427J252441J917420R74960K13547k421341
$$ 674589767 676141434 675063019 673945847 674724274 675976715 677894135 678869095 679082642 676661301
561.3F76661301k890854O82068J055374j468201k853928K678834O217117K84576l309402
$$ 676661301 673770447 674452515 675507889 674039688 671185760 673864594 680081711 680366287 677056885
570F77056885Q2474L107070K67487m007263m025955m75083J318665j287995j035080
$$ 677056885 677139359 680246429 680513916 676506653 672480698 672005615 673324280 672036285 671001205
578.6F71001205K096558K563400P26319j43967r17664q81271j058502j191483l81164
$$ 671001205 673097763 675661163 676387482 676243515 675325851 674444580 673386078 672194595 671813431
587.3F71813431k41242J532288K467117J493531J518783J434708q81424m574967l143005
$$ 671813431 671572189 673104477 675571594 677065125 678583908 680018616 679137192 674562225 671419220
596F71419220p01294m41208m22821j525040m43496J082916k6398l415756n205612l406830
$$ 671419220 670717926 670276718 669853897 668328857 667885361 668968277 668941879 665526123 660320511 656913681
605.6F56913681m213715o996231q457107q828850p632599p833328j0736618j3599892
$$ 656913681 652699966 645703735 637246628 628417778 620785179 612951851 602215233 588615341
613.4E88615341q514747l625069l111305j590958k373886k174530l480263o025009
$$ 588615341 580100594 576475525 573364220 571773262 569399376 567224846 563744583 557719574
621.1E57719574q876610p623558k330322J052627O577721J0228157J2647591J2618561
$$ 557719574 548842964 541219406 538889084 539941711 546519432 556747589 569395180 582013741
628.8E82013741J2827262J1368905N729904J094055j640320k158127m442940p126464
$$ 582013741 594841003 606209908 611939812 613033867 611393547 609235420 604792480 597666016
636.5E97666016o134415l092651q79937J570816P333603J3524781J6801567J3457946
$$ 597666016 591531601 588438950 587559013 589129829 596463432 609988213 626789780 640247726
644.2F40247726J2935563J2547073R718704O242752M010315L675919K176742J801071
$$ 640247726 653183289 665730362 675449066 681691818 685702133 689378052 691554794 693355865
651.9F93355865R43680j53656J185990L186874K456970J105576J187286J354141R29795
$$ 693355865 694299545 694145889 695331879 698518753 700975723 702081299 703268585 704622726 705552521
660.6G05552521j016236r30862J40457L09982J242295K551956L116150k985153L17230
$$ 705552521 704536285 703605423 703745880 704055862 705298157 707850113 710966263 707981110 708298340
669.3G08298340K742691N46112n83191J82190l26996j007309J028748J731109J076584
$$ 708298340 711041031 711587143 711003952 711186142 710859146 709851837 710880585 712611694 713688278
678G13688278J334686K316514J191406r23996R3689j83716j357880j807098j556702
$$ 713688278 715022964 717339478 718530884 717606888 717700577 717516861 716158981 714351883 712795181
686.7G12795181N49012J398468J260681J32522j613693j543503r04846j452866k940902
$$ 712795181 713344193 714742661 716003342 716135864 714522171 712978668 712073822 710620956 707680054
695.3G07680054l560181j249771J354828J464081P41272k61307N39245K243805P61185
$$ 707680054 704119873 702870102 704224930 705689011 706430283 706168976 706708221 708952026 709713211
704G09713211j932754k684327j89972P51191M10461K762680L112030L115082K647858
$$ 709713211 707780457 705096130 704906158 705657349 706067810 708830490 711942520 715057602 717705460
712.7G17705460O81228J310578M95681k79007J191941P55920M63181L28827J277542
$$ 717705460 718386688 719697266 720192947 719913940 721105881 721861801 722324982 722653809 723931351
721.4G23931351L191986K210007P56835k74810j199494j526565j035385j017075k031708
$$ 723931351 727123337 729333344 730090179 729815369 728615875 727089310 726053925 725036850 723005142
730.1G23005142m10309J022110J130982P72857R3689p8659o79473l27302j750259k266617
$$ 723005142 722594833 723616943 724747925 725520782 725614471 725535812 724856339 724529037 722778778 720512161
739.7G20512161j81274P97119K061386J948013J041260P36160J198273J539917K26746
$$ 720512161 720330887 721128006 723189392 725137405 726178665 726914825 728113098 729653015 729879761
748.4G29879761N26428J328201J463547J961670J879883K043457L468475L848267K250519
$$ 729879761 730406189 731734390 733197937 735159607 737039490 739082947 742551422 746399689 748650208
757.1G48650208R24682J34049P2784M2572R00574R27353L30658Q97750M63181J229553
$$ 748650208 749574890 749708939 749781723 749824295 750724869 751652222 751982880 752880630 753343811 754573364
766.7G54573364Q89817k68403o33621j715469j331940o50863J11999K85721L26614
$$ 754573364 755463181 755194778 754561157 752845688 751513748 750862885 750974884 751260605 751587219
775.4G51587219J603241K531128K344360K045517J460114L67279Q05130L0365O2408
$$ 751587219 753190460 755721588 758065948 760111465 761571579 761938858 762743988 762774353 762836761
784.1G62836761J636429J538010R43375O46896K381439J883316O06384O0273j017227
$$ 762836761 764473190 766011200 766954575 767601471 769982910 771866226 772472610 772532883 771515656
792.7G71515656m58375j315002j215668K28958J930466K174530R29337O57119n0048
$$ 771515656 771057281 769742279 768526611 768755569 770686035 772860565 773789902 774447021 774396973
801.4G74396973q82798j895599o10733R4681L27606N8746n98068J784821J237945P14493
$$ 774396973 773514175 771618576 771007843 771102524 771430130 771488876 770890808 772675629 773913574 774628067
811.1G74628067N36499J30386k15454j973495l24784m84466j011505L77350J613006
$$ 774628067 775164566 775294952 775079498 773106003 772781219 772296753 771285248 771662598 773275604
819.7G73275604K365647J294250L57361j313858j068421k74810r57794k402878k748566
$$ 773275604 775641251 776935501 777292862 775979004 774910583 774635773 773677979 771275101 768526535
828.4G68526535J28632Q13598j373214j755829j60141j396714l413925l326263l031922
$$ 768526535 768655167 769468765 768095551 766339722 766179581 764782867 761368942 758042679 755010757
837.1G55010757k886581l513718k394561j272889j935882j105194O27823j26953j448288
$$ 755010757 752124176 748610458 746215897 744943008 743007126 741901932 742529755 742402802 740954514
845.8G40954514j472779j211548Q6823J96152J346206K478791J534881K329941L031921
$$ 740954514 739481735 738270187 738357010 738553162 739899368 742378159 743913040 746242981 749274902
854.5G49274902L516693J730881R11637J912155L43857J164855J104279P17468K387848
$$ 749274902 752791595 754522476 755434113 757346268 757690125 758854980 759959259 760676727 763064575
863.1G63064575K788086K006836P18994L47138K40554K59934o11191r40094q82110
$$ 763064575 765852661 767859497 768578491 768925629 769166183 769426117 768814926 767874832 766992722
871.8G66992722J221618L076782P33033J013488J496811N99671o15921j742478j426391
$$ 766992722 768214340 771291122 772024155 773037643 774534454 775134125 774518204 772775726 771349335
880.5G71349335k136383k371827k256393o86569P2861J49841L9978j759262j479187
$$ 771349335 769212952 766841125 764584732 763898163 763971024 764120865 764160843 762401581 760922394
889.2G60922394j010971l09296k15988p42569l53775l16238O58416J285630J214523
$$ 760922394 759911423 759602127 759386139 758643570 758289795 757973557 758631973 759917603 761132126
897.9G61132126N32989L01895j96838j102829j198349j718445k70385Q49075l16925
$$ 761132126 761665115 761967010 761770172 760667343 759468994 757750549 757480164 758329239 758012314
906.5G58012314q28400p85065k086563k760467k418900k694015j503678j906280l206406
$$ 758012314 757183914 756398849 754312286 751551819 749132919 746438904 744935226 743028946 739822540
915.2G39822540k134399r70383j032791j808929k060090k245712k222671j825486j880188
$$ 739822540 737688141 736717758 735684967 733876038 731815948 729570236 727347565 725522079 723641891
923.9G23641891k477798j943207p53402l63160l26996r26742k36511M50287J80587
$$ 723641891 721164093 719220886 718467484 718104324 717777328 716850586 716614075 717064362 717244949
932.6G17244949O36368M24118M27323J662139L062821K651977K058030K595214K392884
$$ 717244949 717881317 718305435 718732758 720394897 723457718 726109695 728167725 730762939 733155823
941.3G33155823K639084K248916K271576K533417J707382J617737J528015J516495
$$ 733155823 735794907 738043823 740315399 742848816 744556198 746173935 747701950 749218445
949G49218445J129608J763000J373902j5412j89819n87311k91748j152725j225128
$$ 749218445 750348053 752111053 753484955 753469543 753279724 752692413 752400665 751247940 750022812
957.7G50022812j324082k108764j272583q88748j048279k284775k371979k083511k745438
$$ 750022812 748698730 746589966 745317383 744428635 743380356 741095581 738723602 736640091 733894653
966.3G33894653k105407j490937j615600j711579q92486j7777J908n76096r88083p33948
$$ 733894653 731789246 730298309 728682709 726971130 726078644 726060867 726062775 725486679 724498596 723764648
976G23764648j052856j456757j322784j156769q67081o78329j312637j680069j930313
$$ 723764648 722711792 721255035 719932251 718775482 717908401 717230072 715917435 714237366 712307053
984.7G12307053k001801j512833k667923l618850l338394l357468l859177m613800
$$ 712307053 710305252 708792419 706124496 702505646 699167252 695809784 691950607 687336807
992.4F87336807o823349j0740280j3156891r912643J272354J0744247J0811386N672989
$$ 687336807 680513458 669773178 656616287 646703644 647975998 658720245 669531631 675204620
1000.1F75204620J907349O48422K90451M80576L5629r51843r25827m21829K33917n77622
$$ 675204620 677111969 677760391 678050842 678531418 678567047 677615204 676689377 676267548 676501465 675923843
1009.7F75923843k399063k066498o57806q92868j606674j661911j869583k050324k231293
$$ 675923843 673524780 671458282 670800476 669907608 668300934 666639023 664769440 662719116 660487823
1018.4F60487823k205200j989441k309494k278289j785202k266770k476501k498703
$$ 660487823 658282623 656293182 653983688 651705399 649920197 647653427 645176926 642678223
1026.1F42678223j875000q27599j865883k456093k635192j928139k322922l677444
$$ 642678223 640803223 639975624 638109741 635653648 633018456 631090317 628767395 625089951
1033.8F25089951j537972o95343j008224j154328j085167q98895l05405N31807j004066
$$ 625089951 623551979 622856636 621848412 620694084 619608917 618710022 618404617 618936424 617932358
1042.5F17932358q46405o70777q04557k58294j57928N07660P41920J729126J417542
$$ 617932358 617085953 616415176 615610619 615352325 615194397 615702057 616443977 618173103 619590645
1051.2F19590645L97072k25106Q8158M01917K90298Q21037r4413L37753k25029j333923
$$ 619590645 619987717 619762611 619850769 620252686 620542984 621364021 621269608 621607361 621382332 620048409
1060.9F20048409n46837J24130J57776j289101q51097n84831q97217j695633k122345
$$ 620048409 619501572 619625702 619783478 618494377 617643280 617058449 616161232 614465599 612343254
1069.5F12343254k29912K95487K13546j039237p45163p47796j750564j289597j939544
$$ 612343254 612113342 612408829 612622375 611583138 610837975 610090179 608339615 607050018 605110474
1078.2F05110474j058617o35986o31981o43845p26166n93452r06639j866989l708382
$$ 605110474 604051857 603415871 602783890 602140045 601413879 600820427 599913788 598046799 594338417
1086.9E94338417l155708l908692m130516m548187n727272n354462p465896p675209
$$ 594338417 591182709 587274017 583143501 578595314 572868042 567513580 560047684 552372475
1094.6E52372475r093933r698182j0270500j1187172j0204773j1771469r889488j0832100
$$ 552372475 543278542 533580360 523309860 512122688 501917915 490146446 480256958 469424858
1102.3D69424858j0210380r321557r644012r342957j1401481q833428r645462p892685
$$ 469424858 459214478 449892921 440248909 430905952 419504471 410671043 401025581 393132896
1110C93132896p771453p035141m497605n503044l299255l456803j83944p25136K58407
$$ 393132896 385361443 378326302 373828697 368325653 365026398 361569595 361385651 360660515 360918922
1118.7C60918922M18358k80037K647782M61616K957306J468430K023124J456643j85585
$$ 360918922 361337280 361057243 363705025 364166641 367123947 368592377 370615501 372072144 371886559
1127.4C71886559J358909j019096O15349j906739j519546k602959l583145k549667
$$ 371886559 373245468 372226372 372841721 370934982 369415436 366812477 363229332 360679665
1135.1C60679665m525261j679116l295211j679345k985458k957916j251183l498306
$$ 360679665 356154404 354475288 351180077 349500732 346515274 343557358 342306175 338807869
1142.8C38807869k422638m283409k140923m453163l541374j981812k668495k86312
$$ 338807869 336385231 332101822 329960899 325507736 321966362 319984550 317316055 317029743
1150.5C17029743k850570k67220j307793Q35839Q34770m65203K152520M86583L233567
$$ 317029743 314179173 313911953 312604160 313439999 314274769 313809566 315962086 316448669 319682236
1159.2C19682236J861000L230438K912903L405571M860344L625107O300392L857383
$$ 319682236 321543236 324773674 327686577 331092148 335952492 339577599 345877991 349735374
1166.9C49735374N611229N631180P209473Q130569O605759Q683510P114906Q877487
$$ 349735374 355346603 360977783 368187256 376317825 382923584 391607094 398722000 407599487
1174.6D07599487P476464Q178367Q415909P239304Q140792O507226Q148040P221833
$$ 407599487 415075951 423254318 431670227 438909531 447050323 453557549 461705589 468927422
1182.4D68927422P729225P145462O656341O743317M920692O179009N099983M947167
$$ 468927422 476656647 483802109 490458450 497201767 502122459 508301468 513401451 518348618
1190.1E18348618L879737M833908O250115N533905N697746M339905N593452N129624
$$ 518348618 522228355 527062263 533312378 538846283 544544029 548883934 554477386 559607010
1197.8E59607010N144462M978600M538879N450402M994812N684051M040184M415283
$$ 559607010 564751472 569730072 574268951 579719353 584714165 590398216 594438400 598853683
1205.5E98853683N083199M225082M184037L484497L454361K297210K502289K988434
$$ 598853683 603936882 608161964 612346001 615830498 619284859 621582069 624084358 627072792
1213.2F27072792L149071K589454J968766K844925J846542J679649J343766O94656
$$ 627072792 630221863 632811317 634780083 637625008 639471550 641151199 642494965 643189621
1220.9F43189621L75977K49252R72519M79049Q08793Q83941J151734J208572P58286
$$ 643189621 643565598 643814850 644787369 645266418 646075211 646959152 648110886 649319458 650077744
1229.6F50077744M66842m59289M67834O82373K95487N52139R82818J308976J059875
$$ 650077744 650544586 650085297 650553131 651235504 651530991 652083130 653065948 654374924 655434799
1238.3F55434799J138382P25632R24301P02820J01013m20380j53961Q96454O06918
$$ 655434799 656573181 657298813 658223114 658925934 659026947 658606567 658452606 659349060 659955978
1247F59955978O54145L66363P99637R68781L86047N69611K59323L12347m31290k14614
$$ 659955978 660610123 660976486 661776123 662744904 663130951 663700562 663959885 664272232 663840942 663626328
1256.6F63626328M37088M87060J016922J168442J428451P13959R09424R12552O2485
$$ 663626328 664063416 664550476 665567398 666735840 668164291 668878250 669787674 670700226 670762711
1265.3F70762711p9194K82212R64737N16433P83921J291885J917114K194596J816406
$$ 670762711 670683517 670965729 671930466 672446899 673230820 674522705 676439819 678634415 680450821
1274F80450821J736145R14688P62100P98645J070862J247330J499710K054596J729278
$$ 680450821 682186966 683101654 683863754 684662399 685733261 686980591 688480301 690534897 692264175
1282.7F92264175K146378K190628J777496J469117R76257J250229J291275Q77075J205215
$$ 692264175 694410553 696601181 698378677 699847794 700824051 702074280 703365555 704242630 705447845
1291.3G05447845J478577J288910J831436K145004J857834J436158Q59985N10864M37927
$$ 705447845 706926422 708215332 710046768 712191772 714049606 715485764 716345749 716856613 717294540
1300G17294540O59638P54547P52563J085053J076889J044540J477280R08814K24685
$$ 717294540 717954178 718708725 719461288 720546341 721623230 722667770 724145050 725053864 725278549
1308.7G25278549J70899j10245j6251j08337m1046M21295J283798J595383P48749N09567
$$ 725278549 725449448 725339203 725322952 725214615 725173569 725594864 726878662 728474045 729222794 729732361
1318.3G29732361K77099M11530L13187o0044L91922K97089L62549N31769P91015J352616
$$ 729732361 730009460 730420990 730734177 730674133 731066055 731363144 731725693 732257462 733048477 734401093
1328G34401093J100616P26624J24740k95486n0507m85001m69894J9226o8207O86264
$$ 734401093 735501709 736228333 736353073 736057587 736007080 735522079 735052185 735071411 735003204 735689468
1337.6G35689468R39026J51749l26309L59192O54449m16183p24564n76324m05655k68326
$$ 735689468 736628494 736780243 736453934 736813126 737467575 737051392 736326828 735750504 735344849 735076523
1347.3G35076523j03607N69687K87323K89993J78680l12576n87845j165008j099930
$$ 735076523 734972916 735542603 735829926 736119919 736298599 735986023 735398178 734233170 733133240
1355.9G33133240n63889l57818m77448N14832P96585M04587Q468k017517j30157J65329
$$ 733133240 732569351 732211533 731734085 732248917 733045502 733450089 733458557 731441040 731310883 731476212
1365.6G31476212j276856q70209j234283j540299j39160N36728M02603K06986p09915
$$ 731476212 730199356 729329147 728094864 726554565 726415405 726952133 727354736 727561722 726851807
1374.3G26851807j273194p57446o98395j317520j119766l77045m23965j67847P7515
$$ 726851807 725578613 724821167 724122772 722805252 721685486 721308441 720884476 720716629 720794144
1382.9G20794144M25110N62973J293487J225357j616974k58255L59803l06626k52075
$$ 720794144 721219254 721782227 723075714 724301071 722684097 722425842 722785645 722479019 722226944
1391.6G22226944J16348J483002K00272j980134l6087O67572M04206k568588k223282
$$ 722226944 722343292 723826294 724026566 722046432 722010345 722677917 723082123 720513535 718290253
1400.3G18290253k98157m33579k97164K05230q17108k97012R77096M0894k69318m66308
$$ 718290253 717992096 717558517 717261353 717466583 716649475 716352463 717329559 717370453 717101135 716634827
1409.9G16634827q77838j291581j303482N3635L05786Q63724O70318P12281J594391
$$ 716634827 715756989 714465408 713161926 713215561 713521347 714385071 715055389 715767670 717362061
1418.6G17362061m297104p31812J510010M96750M64477j876449J14822J655808R95102
$$ 717362061 713064957 712333145 713843155 714339905 714804382 712927933 713042755 714698563 715693665
1427.3G15693665J761474R91364j018219L96423J087265k41318n5694J762466J475983
$$ 715693665 717455139 718446503 717428284 717824707 718911972 718670654 718614960 720377426 721853409
1436G21853409l736954K50244L398285K142868R55353M37088m2114N32226J10474j40534
$$ 721853409 718116455 718366699 721764984 723907852 724863205 725300293 725258179 725790405 725900879 725760345
1445.6G25760345Q10700M38995j271438R26971J977387J025772N79223P42798J632538
$$ 725760345 726571045 727010040 725738602 726665573 728642960 729668732 730247955 730990753 732623291
1454.3G32623291J207962j72882k316284k548294J507034J649246K889328J757508
$$ 732623291 733831253 733658371 731342087 728793793 730300827 731950073 734839401 736596909
1462G36596909J225051K558060j599579j266174J115646N01328M94613J223526L087922
$$ 736596909 737821960 740380020 738780441 737514267 738629913 739131241 739625854 740849380 743937302
1470.7G43937302J958770j341323M77523L683777L609619r14154n85937J248092O53992
$$ 743937302 745896072 744554749 745032272 748716049 752325668 751411514 750825577 752073669 752727661
1479.4G52727661J129456J61590O97251K180175J774445J634293K346954k18277k428284
$$ 752727661 753857117 754018707 754715958 756896133 758670578 760304871 762651825 762433548 760005264
1488.1G60005264R16519k584152l787765J796417K033768Q20312J449433J861343m735031
$$ 760005264 760921783 758337631 754549866 756346283 758380051 759200363 760649796 762511139 757776108
1496.7G57776108J346359l77655m345932N95398o24161q83102J07116K469330L076096
$$ 757776108 759122467 758744812 754398880 754994278 754370117 753487015 753594131 756063461 759139557
1505.4G59139557q816986r872208L814011K828522q12073J103668k040787l381500
$$ 759139557 750322571 740450363 744264374 747092896 746280823 747384491 745343704 741962204
1513.1G41962204J000214p1717Q21762j395111l520660L019791L373870k706222n594788
$$ 741962204 742962418 742890701 743712463 742317352 738796692 741816483 745190353 742484131 736889343
1521.8G36889343p84225R64050J925430l190994k47345J342774j455994j27640O38733
$$ 736889343 736105118 737069168 738994598 735803604 735556259 736899033 735443039 735315399 735954132
1530.5G35954132J97754l80402j682129o466217O41404R42688J054611L831024l869553
$$ 735954132 736151886 735771484 734089355 727623138 728264542 729207230 730261841 734092865 730223312
1539.2G30223312r246902N208740J334000j600495J736985l25394m591293J677017
$$ 730223312 720976410 726185150 727519150 725918655 727655640 727330246 722738953 724415970
1546.9G24415970Q97674J176682J32065k437363J876221K050094K227860k560272m48227
$$ 724415970 725313644 726490326 726622391 724185028 726061249 728111343 730339203 727778931 727330704
1555.6G27330704L966751L863220j999512j6348190M549332O376266L985367K111359
$$ 727330704 731297455 735160675 733161163 716812973 721362305 727738571 731723938 733835297
1563.3G33835297J200180j785431j073990J384888P84912O93969o254806Q13064K446137
$$ 733835297 735035477 733250046 732176056 733560944 734345856 735039825 728785019 729598083 732044220
1572G32044220K32010O08063J381836R85794r397202R46121O38809j287612r73511
$$ 732044220 732276230 732884293 734266129 735251923 725854721 726800842 727439651 726152039 725178528
1580.6G25178528j851807k00424j227875p19070j075974j637039j168823k046204j663208
$$ 725178528 723326721 723126297 721898422 721179352 720103378 718466339 717297516 715251312 713588104
1589.3G13588104l202057k075271k513047j355056r81293k090073p96203k329712j502686
$$ 713588104 710386047 708310776 705797729 704442673 703461380 701371307 700575104 698245392 696742706
1598F96742706k724228k317657k602081k748566j567307l145675j327286j825867j163406
$$ 696742706 694018478 691700821 689098740 686350174 684782867 681637192 680309906 678484039 677320633
1606.7F77320633k407761j693878j970749l805923j324845l085250j705704k227783
$$ 677320633 674912872 673218994 671248245 667442322 666117477 663032227 661326523 659098740
1614.4F59098740N73272L50037j0423050J670990n49698n32226k221299J47019m34799
$$ 659098740 659672012 660022049 649598999 651269989 650720291 650188065 647966766 648113785 647678986
1623.1F47678986p180100p36008j105918J008186k875519j772499J33514r82971l16505
$$ 647678986 640498886 639762878 638656960 639665146 636789627 635017128 635150642 634167671 633851166
1631.7F33851166j742401J349487J492996n805702l883171J703796O35605P15103J508179
$$ 633851166 632108765 633458252 634951248 629145546 625262375 626966171 627601776 628316879 629825058
1640.4F29825058o32858R85908p08160J607666K477073j806755o76765l450279L716011
$$ 629825058 629192200 630178108 629469948 631077614 633554687 631747932 631071167 627620888 631336899
1649.1F31336899L088798M870072N696144K506943j1508027j141738M334297J626625
$$ 631336899 634425697 639295769 644991913 647498856 635990829 634849091 639183388 640810013
1656.8F40810013J671982J207275J571045K260055K292862K554856m88968L238067
$$ 640810013 642481995 643689270 645260315 647520370 649813232 652368088 651879120 655117187
1664.5F55117187K215577J792373K933274L565063J3199j701508L770066J405945L456649
$$ 655117187 657332764 659125137 662058411 665623474 665636673 663935165 667705231 669111176 672567825
1673.2F72567825M127579Q79440k17666K658004L083039K117767K582321K27280L520966
$$ 672567825 676695404 677574844 677357178 680015182 683098221 685215988 687798309 688025589 691546555
1681.9F91546555O107559K201080l572998R64661N361938L396912R26056K079544J555710
$$ 691546555 697654114 699855194 696282196 697246857 702608795 706005707 706931763 709011307 710567017
1690.6G10567017K349929K221833K976150M816818N014649k822266L299713N679703
$$ 710567017 712916946 715138779 718114929 722931747 727946396 725124130 728423843 734103546
1698.3G34103546N837021J950912q969421O444092M880524L204422J911239K086411
$$ 734103546 739940567 741891479 732922058 739366150 744246674 747451096 749362335 751448746
1706G51448746R30481J546173L291626J361542J63650J520004K281647L051453K10495
$$ 751448746 752379227 753925400 757217026 758578568 758742218 760262222 762543869 765595322 765805817
1714.7G65805817j38855M365234K239914p439346K986526L674088J765594J295548
$$ 765805817 765666962 770032196 772272110 764832764 767819290 771493378 773258972 774554520
1722.4G74554520O6223m51584R76257R04007P32956J600418K555313n44433m74091
$$ 774554520 774620743 774169159 775145416 776049423 776782379 778382797 780938110 780393677 779919586
1731.1G79919586M680252M564743m185409r560623L987350L623200J776733K631378
$$ 779919586 784599838 789164581 784979172 775418549 779405899 783029099 784805832 787437210
1738.8G87437210q30994k179412L821868K765809j334687p04117K644120J780166J051255
$$ 787437210 786606216 784426804 788248672 791014481 789679794 788975677 791619797 793399963 794451218
1747.5G94451218O76803k98767L426666j023941j742248M243088K328643J583023J420060
$$ 794451218 795128021 794829254 798255920 797231979 795489731 799732819 802061462 803644485 805064545
1756.2H05064545k799988K93884K063751J522980K755890k326965j281739L039246
$$ 805064545 802264557 802558441 804622192 806145172 808901062 806574097 805292358 808331604
1763.9H08331604J124725O72074J341324O45828l129044J481629L882904J29089l243027
$$ 808331604 809456329 810128403 811469727 812115555 808986511 810468140 814351044 814480133 811237106
1772.5H11237106j935196L668671J909103j458129J153640M89502J148911J85394k193375
$$ 811237106 809301910 812970581 814879684 813421555 814575195 815064697 816213608 816399002 814205627
1781.2H14205627M56467J580505J466141q71124m85916J482239L85284L03192J363297
$$ 814205627 814662094 816242599 817708740 816837616 816351700 817833939 818219223 818522415 819885712
1789.9H19885712L46985R0026l220367j498947L511047J518936r33990Q97064K060242
$$ 819885712 820232697 820322723 817102356 815603409 819114456 820633392 819699402 820596466 822656708
1798.6H22656708l64533k174301J257324q28170q67539R16748M17099R50775L17765
$$ 822656708 822292175 820117874 821375198 820547028 819679489 820596237 821013336 821964111 822281876
1807.3H22281876O5536J397476J073151j665268n71136L43704l05M90722p095N87921
$$ 822281876 822347412 823744888 824818039 823152771 822581635 822925339 822925034 823415756 823408661 823996582
1816.9H23996582k35062J3276R98840N29938P17773p35626L87497J104126k816010
$$ 823996582 823761520 823774796 824773636 825303574 826021347 825285721 825673218 826777344 823961334
1825.6H23961334o67648J800003K335358P12661m327392K89993J943207J88370O14471
$$ 823961334 823293686 825093689 827429047 828141708 823814316 824104309 826047516 826235886 826850357
1834.3H26850357M60434k35062q13446p04879Q65402L44696O25076O04782J611252
$$ 826850357 827310791 827075729 826262283 825557404 826422806 826767502 827392578 827997360 829608612
1842.9H29608612R16290n765991J350174K259140l45917p66983K70081O77109l59803
$$ 829608612 830524902 824758911 826109085 828368225 828022308 827255325 827525406 828202515 827842712
1851.6H27842712L39661K65198J81503J52512j86386M15802l63770l47137J02005J15203
$$ 827842712 828182373 828447571 828629074 828781586 828595200 829011002 828647232 828300095 828402100 828517303
1861.3H28517303q6746J74637N69382O80389P19910n5847N30700j275329k260285N34211
$$ 828517303 828430557 828605194 829174576 829854965 830574875 830519028 831049728 829774399 827514114 828048325
1870.9H28048325R12933O54297Q4457J76926J77154J97831j39847o2409L12653k76947
$$ 828048325 828961258 829615555 829700012 829876938 830054092 830251923 830112076 830049667 830362320 830085373
1880.6H30085373r2239m78440m7836K27432L3341L14788J03836J320801J78757k265091
$$ 830085373 829993134 829514694 829466858 829694290 829727631 830042419 830146255 831467056 831645813 829380722
1890.2H29380722P2174O14472m6769L28446l42941j019288N81513P68967M64477K99988
$$ 829380722 829452896 830067368 830020599 830349045 830006104 828986816 829568329 830337296 830801773 831101761
1899.8H31101761O8588l0060o71844k69547n4168m7608m2496k20947O1112M63714J58844
$$ 831101761 831170349 831140289 830468445 830198898 830144730 830097122 830054626 829833679 829894791 830358505 830517349
1910.4H30517349k02484O14624J02158k06147o97937k12783J417694j857605j301575
$$ 830517349 830314865 830929489 831031647 830825500 830127563 829914780 831332474 829474869 828173294
1919.1H28173294J562500J228561J063385q78372j381454J55334R3918l62854j31988
$$ 828173294 829735794 830964355 832027740 831149368 829767914 829923248 830017166 829654312 829522324
1927.8H29522324J73034K41165m8751o0425N28641N2871P7515r0332l99475j73645
$$ 829522324 829695358 829936523 829887772 829827347 830355988 830408859 830486374 830396042 829996567 829822922
1937.5H29822922l02353r0637P9727J518020K32697k437897N55344R02862j29318l96499
$$ 829822922 829520569 829429932 829509659 831027679 831260376 828822479 829377823 830280685 830151367 829754868
1947.1H29754868n40848m37088j49536J84021P8735M44107L74146J068m9668J17569
$$ 829754868 829214020 828776932 828627396 828811417 828890152 829334259 829708405 829709473 829659805 829777374
1956.7H29777374n1193n31998k97241j80969J5869m3793j61514J23596N97840R90524
$$ 829777374 829726181 829194183 828896942 828715973 828731842 828688049 828526535 828650131 829247971 830238495
1966.4H30238495l74603r05457j1291j36490k11716j95770O103P6218j03073M60205
$$ 830238495 829863892 828958435 828947144 828810654 828598938 828403168 828409271 828485489 828382416 828842621
1976H28842621L89023j97144N5466j58463m47311j77841j83945m94843o48651j57089
$$ 828842621 829231644 829034500 829089966 828931503 828484192 828306351 828122406 827627563 826978912 826821823
1985.7H26821823L14713M09088r1095j42517J020050M63562j553192p75223K83966
$$ 826821823 827136536 827545624 827454529 827312012 828332062 828795624 827242432 826467209 826751175
1994.3H26751175k4262r4070n2490K27966K66571j52664L12805K98615k33841k02790
$$ 826751175 826726913 826632843 826580353 826808319 827074890 826922226 827235031 827533646 827299805 827097015
2004H27097015k17819l78036m40140k55585q4610L80860O31713J79978j94473j58921
$$ 827097015 826879196 826501160 826061020 825805435 825720825 826101685 826733398 826913376 826718903 826559982
2013.6H26559982J5107p4692o58264j010132j18714K2278P3624N60379K58484K69241
$$ 826559982 826575089 826500397 825842133 824832001 824713287 824735565 824809189 825369568 825628052 825897293
2023.3H25897293j15967l02505j21231n87387o97480k07138M82560K29568J80740M17862
$$ 825897293 825781326 825478821 825357590 824770203 824072723 823865585 824348145 824577713 824758453 825176315
2032.9H25176315L9063j07880j90048j03531k54745m92249n12466j54343q0795k823
$$ 825176315 825215378 825107498 824917450 824813919 824559174 824066925 823554459 823400116 823319321 823316498
2042.6H23316498Q67462O38351M2878j12839l76434m75312k29797J602m08630l63694
$$ 823316498 824183960 824822311 824865189 824752350 824375916 823900604 823670807 823672409 823263779 822900085
2052.2H22900085Q469L35770P0877l0213L14026k30102k79923l95279o04782l31726
$$ 822900085 822908554 823244324 823315201 823284988 823599014 823368912 823088989 822693710 822088928 821757202
2061.9H21757202Q6441L19519j59607J76087L95050M1961k09426l56827n13153j069794
$$ 821757202 821843643 822163162 822003555 822179642 822574692 822616653 822407227 822050400 821537247 820467453
2071.5H20467453p27921j52816j06736J03226K37045l5781k33002k60391l02277R384
$$ 820467453 819739532 819586716 819479980 819583206 819820251 819784470 819551468 819291077 818988800 818998184
2081.1H18998184j86233n33600l61557K7084K35596K80456K89231Q3999M03901J31988
$$ 818998184 818811951 818278351 817916794 817943878 818179474 818459930 818749161 818833160 819237061 819369049
2090.8H19369049j96991k98767p68127l12653p8506R1629J92413M94690Q24661J67694
$$ 819369049 819172058 818873291 818105164 817792511 817714005 817805634 817998047 818492737 819317398 819485092
2100.4H19485092K30332J10778j41754k2049l27758k42463K32392L05481J23291O16073
$$ 819485092 819715424 819826202 819684448 819662399 819334641 819092178 819324570 819630051 819753342 820369415
2110.1H20369415N48096Q392J88446J17112m32892n47180j03226j22299l45536j38168
$$ 820369415 820917511 820925903 821114349 821231461 820798569 820251389 820148163 820025864 819680328 819542160
2119.7H19542160N88684O76346L27759O3476o28204j84708j23901p46155n24444q8044
$$ 819542160 820130844 820807190 821134949 821198425 820570221 820385513 820261612 819515457 818991013 818902969
2129.4H18902969M38309L19748J28632K12173L91464K12937k70386k62528j61666q9951
$$ 818902969 819341278 819661026 819789658 820001831 820393295 820606232 820335846 820073318 819911652 819821701
2139H19821701m78592n0812O86417M75159L17230K27127L24173o1569k76490o10j88599
$$ 819821701 819343109 819292297 819978714 820453873 820771103 820998230 821322403 821260834 820984344 820983734 820795135
2149.6H20795135k63290p5073K0294K44141O07757M25110K94952p6980l04108N875
$$ 820795135 820531845 820456772 820477066 820721207 821328964 821754074 822049026 821972046 821667938 821673813
2159.3H21673813j76239j99967n51529j90582M55551J10474J64642L62702M11987m6158
$$ 821673813 821497574 821297607 820746078 820555496 821011047 821121521 821286163 821648865 822060852 822014694
2168.9H22014694k73819l01742n25208m06647l07846j0528N6534L78341N74799J88599
$$ 822014694 821740875 821439133 820913925 820507278 820199432 820188904 820245438 820623779 821198578 821387177
2178.5H21387177k46048n19333Q087J33591l56217o25305k6703O33316K53296N5008
$$ 821387177 821141129 820621796 820629883 820763474 820407257 819781952 819755249 820388565 820641861 820696869
2188.2H20696869K33841K18201R5672K91596p2251m29458J25732J33743K77787O09054
$$ 820696869 820930710 821148911 821244583 821536179 821463928 821034470 821160202 821293945 821571732 822180786
2197.8H22180786J59836j34201N50690P64007j92718n83573j08032J46866k90833k34680
$$ 822180786 822340622 822206421 822757111 823521118 823328400 822744827 822636795 822783661 822492828 822258148
2207.5H22258148K29492O15693O00814m4861j525J03302j221n02472o32248K08511
$$ 822258148 822487640 823103333 823704147 823659286 823657761 823761063 823759842 823257370 822625122 822833633
2217.1H22833633K74964K03476J91574L83377M75311k61001m34571L5553O9580l22647
$$ 822833633 823108597 823312073 823503647 823887024 824362335 824101334 823666763 823702316 823771896 823449249
2226.8H23449249l08914l6240R6817j47171J77384M69894j02005J34278Q5220j87988
$$ 823449249 823140335 823104095 823200912 823053741 823231125 823701019 823599014 823733292 823818512 823630524
2236.4H23630524k47803m68369k84423l02048q7433L93677P03964K90451j45035j66168
$$ 823630524 823382721 822914352 822629929 822327881 822240448 822634125 823338089 823628540 823483505 823317337
2246H23317337k82135k18582k15912N6763J1062K07062J98898k69851P9422K08893
$$ 823317337 823035202 822816620 822600708 822657471 822668533 822875595 823074493 822804642 822884064 823092957
2255.7H23092957K48794R5596K7619l05634l26080J80511l30886j56632J13602L14865
$$ 823092957 823341751 823437347 823464966 823159332 822833252 823013763 822682877 822526245 822639847 822954712
2265.3H22954712L41263K17056L43552m97437m33655k14233j41296J42211o5002l4180
$$ 822954712 823295975 823513031 823856583 823359146 822925491 822711258 822569962 822712173 822647171 822612991
2275H22612991j07040j4496L54462N18188k31781p2784J50757o27213j42288L9062
$$ 822612991 822505951 822491455 822845917 823364105 823132324 823059540 823210297 822583084 822440796 822479858
2284.6H22479858J23749J15280J91040N36347J34430k518k64206m5853l6087j56936
$$ 822479858 822603607 822718887 822909927 823446274 823580704 823578186 823313980 823268127 823232040 823075104
2294.3H23075104j93253l14789N5848M2877O47964O1798n27725K72522L39356R2086
$$ 823075104 822881851 822567062 822622910 822665787 823313751 823375549 822847824 823120346 823459702 823551788
2303.9H23551788o04782n55801j27793J84327J57852L59726M74396k19574K00653n52750
$$ 823551788 822947006 822391205 822263412 822447739 822605591 822965317 823439713 823220139 823420792 822868042
2313.5H22868042m06189N21545P4082R0790l85819K35520R6969L815N83115o98548
$$ 822868042 822461853 822983398 823057480 823148270 822762451 822997971 823094940 823098755 823681870 822983322
2323.2H22983322p24029M85611J160736J48239j73035j32065q77304l61328j61819
$$ 822983322 822259293 822744904 823905640 824053879 823880844 823748779 822871475 822510147 822348328
2331.9H22348328J73797P04499N71670k90070O4393N31463k48871n33294p55616j87225
$$ 822348328 822522125 823226624 823798294 823508224 823572617 824104080 823855209 823321915 822566299 822379074
2341.5H22379074K10648Q27026K14386m79889K93121l38821L89481J198883O28128
$$ 822379074 822589722 823416748 823631134 823151245 823444366 823105545 823495026 824693909 825322037
2350.2H25322037M6081J5259k76413R5215J024399r5139p96127j017532n18418o33468
$$ 825322037 825368118 825383377 825106964 825202179 826226578 826131439 825335312 824317780 823799362 823165894
2359.8H23165894n78309J739121K36664j083679M0512k27280r12552P39822K156830
$$ 823165894 822587585 824326706 824563370 823479691 823520203 823292923 822380371 823120193 825277023
2368.5H25277023K6551m08020k21253q34656q926K93579N6229j26725j43814N08118
$$ 825277023 825303574 824895554 824674301 823839645 823830719 824124298 824180527 824053802 823909988 824418106
2378.2H24418106K81830j41907M69437L5019m12140k79923l75976K22168M01230R8953
$$ 824418106 824699936 824558029 825027466 825062485 824650345 824370422 823994446 824216614 824617844 824716797
2387.8H24716797l37296k90146M31214L09067j34201l24631q5907l5553j51596J34201
$$ 824716797 824379501 824089355 824520569 824829636 824695435 824370804 824284897 824249344 824097748 824231949
2397.4H24231949K48642K29263N5695j09024l14179n2414P3166k37198K1820j64871
$$ 824231949 824480591 824709854 824765549 824656525 824342346 824289932 824363098 824125900 824147720 823982849
2407.1H23982849m10690q393K98539K16446O8435k18734j80436J67389l28750l85666
$$ 823982849 823572159 823563766 823862305 824078751 824147186 823928452 823748016 823915405 823586655 823200989
2416.7H23200989j95542j2207L01209J01852L67661L13034K02026k19650p27310j15204
$$ 823200989 823005447 822993240 823294449 823396301 823763962 824076996 824279022 824059372 823332062 823216858
2426.4H23216858j36032k64893l9978r8572j80816j3657M44412M16718J84326j59149
$$ 823216858 823080826 822815933 822775955 822677383 822496567 822482910 822927322 823344040 823528366 823369217
2436H23369217k99912L0594j71508m70582l25775l28827l7536K73132J74103J41144
$$ 823369217 823069305 823099899 822928391 822457809 822132034 821803207 821765671 822038803 822212906 822354050
2445.7H22354050k29721j43052m577l88260l34091k95258J32828L15704j82724m8828
$$ 822354050 822124329 821981277 821976700 821588440 821254349 820959091 821091919 821407623 821224899 821176071
2455.3H21176071M39835J91879m67987k67944j28327l56750j01319J33362Q8806R2011
$$ 821176071 821615906 821807785 821339798 821071854 820943527 820586777 820485458 820618820 820707626 820799637
2465H20799637J48926k2126j16043j10931J37710j49688q52280l00445M6386k79999
$$ 820799637 820948563 820926437 820810394 820699463 820837173 820687485 819835205 819534760 819581146 819301147
2474.6H19301147J29853O42776L29972k74964m07257j07727P2479k97699k90374O7443
$$ 819301147 819431000 820073776 820403748 820128784 819721527 819613800 819686279 819388580 819098206 819165649
2484.2H19165649Q927l27759l95203K5711N7908j27259L3798K71607n3177k90680l4180
$$ 819165649 819174576 818846817 818451614 818477325 818535233 818407974 818441772 818713379 818660202 818369522 818335342
2494.8H18335342l02047l53852k5711J10855J37787K09122J44272M8523R2010l36456
$$ 818335342 818033295 817679443 817653732 817764587 817902374 818111496 818255768 818304291 818396301 818059845
2504.5H18059845k58408K5101k30637o36291m93698K06299r8801K30713P36236k18963
$$ 818059845 817801437 817826538 817595901 816959610 816465912 816672211 816573410 816804123 817540359 817321396
2514.1H17321396o79398k99530J60904O4011k55814k88849N6382J21307r3308J90430
$$ 817321396 816641998 816342468 816503372 816567383 816311569 816022720 816079102 816200409 816107101 816297531
2523.8H16297531L24783K03553n92041p02973R3537L2348k04391m00696k670L75824
$$ 816297531 816622314 816825867 816233826 815530853 815624390 815656738 815452347 815051651 815048981 815424805
2533.4H15424805j07727j74637K31705m197n05066l98025m18778j24664M22211M03671
$$ 815424805 815317078 815142441 815374146 815369949 814864883 814466858 814048080 813923416 814345627 814749298
2543.1H14749298J65253N3940n8289j08185M28925K1438n80062k79084k88391j41601
$$ 814749298 814914551 814968491 814910202 814802017 815230942 815252380 814672318 814393234 814104843 813963242
2552.7H13963242j96000p0343M74472K69013m30451j83181L61480l65753p48977l35007
$$ 813963242 813767242 813696899 814171371 814440384 814009933 813826752 814188232 813822479 813073502 812738495
2562.4H12738495M6615Q2779j88522m4556M43650M39377n6611O1264l94744q66166
$$ 812738495 812785110 812867889 812679367 812634811 813078461 813517838 813461227 813522491 813127747 812261581
2572H12261581k97927r2850P2098J08947K06452M78821M11834k01263p94830p40052
$$ 812261581 811963654 811870804 811942902 812051849 812258301 812737122 813148956 812947693 812152863 811412811
2581.6H11412811k84500M27704p7896o18973k74277J1902K42539J0986K17819R613
$$ 811412811 811128311 811556015 811478119 810859146 810584869 810596771 810839310 810850296 811068115 811077728
2591.3H11077728m16870l29742j26648J33590l77807j27030J30082k87934j37100J50986
$$ 811077728 810660858 810331116 810204468 810338058 809960251 809833221 809963303 809675369 809538269 809689255
2600.9H09689255L30353j50223l60031k51465m24423l77427P325L28750R1095l1891
$$ 809689255 810019608 809869385 809509354 809257889 808833466 808456039 808463364 808792114 808883209 808851318
2610.6H08851318k03399j75705Q4381p2022l29742n81436k94724J44348L8147l16162
$$ 808851318 808647919 808472214 808556595 808484573 808154831 807573395 807278671 807423019 807461166 807145004
2620.2H07145004k95257J73111K82898j24894k58712n0125l75519n97153j09024K95258
$$ 807145004 806849747 807022858 807305756 807180862 806922150 806872025 806496506 805899353 805790329 806085587
2629.9H06085587k5712m22286k03248k6550J64642K97699R0638l20359n22232l89709
$$ 806085587 806059875 805637589 805434341 805407791 805572433 805870132 805960770 805640411 805118179 804728470
2639.5H04728470m15344l19443r6893K07061J01853j26801P8278K2812k49939p62635
$$ 804728470 804313126 803993683 803896790 804103851 804205704 804078903 804157181 804179993 803930054 803167419
2649.1H03167419n83572J62354J03530m60739m35562M69589M36631l61634k23541k8152
$$ 803167419 802583847 802746201 802849731 802388992 801953430 802423019 802859650 802498016 802274475 802246323
2658.8H02246323n24140n31158k74124k03324J09864j46714r079K12097r0103K41394
$$ 802246323 801722183 801191025 800916901 800713577 800823441 800676727 800667648 800879745 800789642 801031036
2668.4H01031036J57929j71967k55966m02832m48227o2866K06299K7694K13700j30081
$$ 801031036 801188965 801016998 800761032 800358200 799909973 799847107 800053406 800081100 800294800 800164719
2678.1H00164719l07084J86081l2501p89413o55976k4414n44433k78855L84674K96097
$$ 800164719 799857635 800043716 800011215 799221802 798565826 798541412 797996979 797718124 798102798 798398895
2687.7G98398895L05023m21295m56543L9749k07672m06341m17099j63269L26767L68499
$$ 798398895 798703918 798282623 797826080 797865829 797658157 797251816 796834717 796671448 796998215 797366714
2697.4G97366714l27606n93719j52817P7362k10113j13907J26266j08795J54953r3765
$$ 797366714 797039108 796445389 796292572 796369934 796159821 796045914 796172180 796063385 796218338 796124573
2707G96124573q34351q84704j44730O81534L16467r8343m49371p22351p2251P4997
$$ 796124573 795290222 794405518 794260788 794942322 795258789 795160446 794711075 793988724 793916473 793991470
2716.6G93991470l42712l83377k08054J52970L14254l8986k44064m8447J36719l86581
$$ 793991470 793648758 793265381 793057327 793210297 793524551 793485565 793241501 793193054 793329773 792943192
2726.3G92943192q19397k40632K24991J62659l71475m45481k9907K7390l7689l04108
$$ 792943192 792123795 791883163 792108154 792270813 791899338 791453857 791423950 791451340 791413651 791109543
2735.9G91109543k16675k23618k69851l14102m97132l7155K90070J78604k33078L11355
$$ 791109543 790892868 790669250 790399399 790085297 789588165 789551010 789841080 790019684 789786606 790097961
2745.6G90097961O05240o86187r10874k57187O8741k74582m14810j94397k15912Q6975
$$ 790097961 790703201 790017014 789106140 788848953 788917694 788643112 788228302 788033905 787817993 787904968
2755.2G87904968j02539k5329J57928j73950l68118n44129k65045r1019l38592k74582
$$ 787904968 787802429 787777100 787935028 787761078 787392960 786848831 786583786 786492767 786154175 785879593
2764.9G85879593P6904k95868l61175K11258Q9264K3651k30484l39814m40673l45765
$$ 785879593 785956497 785660629 785299454 785510712 785599976 785623627 785393143 785053329 784612656 784266891
2774.5G84266891P5760m63028l00827l1356O8664L7766r09958m38004o1722n80062
$$ 784266891 784342651 783879623 783578796 783547440 783616104 783653870 782743912 782305908 782244186 781664124
2784.2G81664124j82801o7825l55148k91825P6828L46756k73590p91244k89765J68000
$$ 781664124 781481323 781413498 781058350 780766525 780843353 781190109 780916519 780125275 779835510 780003510
2793.8G80003510J06124o88781q12149L29361K15759q08182p40585R7503J14975n14373
$$ 780003510 780109634 779420853 778608704 778938065 779153824 778345642 777605057 777702560 777817535 777303162
2803.4G77303162q05893n69458L128l67279m76303p3777n45425k33994L21503j62048
$$ 777303162 776497269 775927811 775930939 775563660 775087357 775013580 774468155 774234161 774555664 774393616
2813.1G74393616m48990k25907r4604m58984r53522r04465p63550n27496J47476M50058
$$ 774393616 773944626 773718719 773624115 773165131 772211609 771307144 770543594 770016098 770163574 770613632
2822.7G70613632K5940o09207n26428j52817l00064p85217j177140l99170K20490j83182
$$ 770613632 770639572 770030365 769503937 769351120 769051056 768265839 767088699 766689529 766910019 766726837
2832.4G66726837k87247j94625j85395m75311n31845m22745j103439j627960j007691
$$ 766726837 766439590 766244965 766059570 765584259 765052414 764629669 763526230 761898270 760890579
2841.1G60890579o14700r68628j033707j236267o87485k25753j329651j462784j146469
$$ 760890579 760275879 759307251 758273544 757037277 756349792 756124039 754794388 753331604 752185135
2849.7G52185135j408844j244812o56433j52359o70243o72302K69699M52347L43170
$$ 752185135 750776291 749531479 748875046 748722687 748052444 747380142 747649841 748102188 748445358
2858.4G48445358k1820q04596o14624r4757l94745m46319l25318l45306p6828n8136
$$ 748445358 748423538 747618942 747004318 746909561 746514816 746068497 745743179 745397873 745321045 745262909
2868.1G45262909m46701q21991q16422l35693m32510j168747p88803k42539j61514
$$ 745262909 744816208 743994217 743177795 742842102 742409592 741240845 740452042 740209503 740047989
2876.7G40047989M28543K51160n9662r4147p80563j086579q26416l28064k55279n63202
$$ 740047989 740476532 740727692 740668030 740573883 739793320 738706741 737880325 737552261 737296982 736733780
2886.4G36733780m04282k42386k79541l10974L0823j17798q39233p54242r23767j131668
$$ 736733780 736329498 736087112 735807571 735496597 735527420 735409622 734570389 733816147 732892380 731760712
2896G31760712p13959j20773M23507n09796j180496l97720L6926j73187q62809q73718
$$ 731760712 731046753 730925980 731349487 730839691 729659195 729261475 729298401 729125214 728262405 727388687
2905.7G27388687l63006k62070l58353m12750j78375j64185k16217o02493j045609
$$ 727388687 727025681 726763611 726405258 725992508 725814133 725649948 725433731 724831238 723785629
2914.3G23785629r66339q32443p94830j226883r45664j63193l97491p67517k37351
$$ 723785629 722819290 721986847 721192017 719965134 719019470 718856277 718458786 717691269 717453918
2923G17453918J70060l28675l09066m2878P6447k88620n83954L44467O11115L56674
$$ 717453918 717623978 717295303 716986237 716943359 717019806 716731186 716147232 716491699 717102814 717459488
2932.7G17459488m4403j05057L54920K45132L77731J36948J80206N82276p248k2812
$$ 717459488 717415085 717310028 717664948 717910080 718287811 718424759 718604965 719187241 719179993 719157181
2942.3G19157181N09872K14691L02964Q11996Q4686m50134l49121l40042l76740l81927
$$ 719157181 719667053 719881744 720184708 720996704 721081390 720631256 720282135 719942093 719565353 719183426
2952G19183426j0223m75083o43310j4496K11792P9040j38702K07672j8387l46527j57928
$$ 719183426 719173203 718698120 718054810 718040314 718252106 718331146 718192444 718400116 718381729 718035202 717877274
2962.6G17877274j00556j43280J08948O95038O36978Q56552P82623N88532N70221j04599
$$ 717877274 717776718 717633438 717742386 718437424 719074402 719930954 720713577 721302109 721872330 721767731
2972.2G21767731L35159Q09937N74874K16065L21808J097183J165390Q52737L39814
$$ 721767731 722102890 722912827 723487701 723703766 724025574 725122757 726288147 727140884 727480698
2980.9G27480698L86428M79355O2943j95770m19083L87649R27124M95148M81262P74155
$$ 727480698 727867126 728346481 728409424 728213654 727794571 728182220 729109344 729604492 730085754 730859909
2990.5G30859909Q29544L47595j68914k15378M7455P6980p7667j95313j51672J2512
$$ 730859909 731689453 732037048 731868134 731652756 731700211 731777191 731699524 731504211 731352539 731365051
3000.2G31365051L01285O18820L45001J62583k96936q50220n14679l29208J63727M79354
$$ 731365051 731666336 732285156 732630157 732792740 732495804 731645584 731130905 730801697 730965424 731444778
3009.8G31444778j15585j3046L72543K84805K74201k05460q54568p92923q24661q49457
$$ 731444778 731329193 731316147 731688690 731973495 732247696 732042236 731187668 730394745 729570084 728720627
3019.5G28720627j29318N02243K77404n0201p9041l41415r19800q01620J12610n0431
$$ 728720627 728591309 729093552 729370956 729320755 729241714 728900299 727980499 727178879 727291489 727241058
3029.1G27241058n41839l55149l68347J7624R3689m26941m83703m06571j03149R3765
$$ 727241058 726699219 726344070 725975723 725993347 726087036 725660095 725176392 724769821 724666672 724760437
3038.7G24760437q74863j164932k76718l20587j17188J87302l24631m58450k32544
$$ 724760437 723885574 722720642 722443924 722123337 722006149 722193451 721868820 721410370 721177826
3047.4G21177826l128k36588n44662j086502j118241k06451r1553n8975k89993r85947
$$ 721177826 721174698 720938110 720393448 719306946 718188705 717982254 717890701 717831726 717541733 716555786
3057.1G16555786l38898M87595l40805q60901n87845q61358l39051j94702j82266K93045
$$ 716555786 716216888 716704483 716363678 715502777 714914932 714053574 713714523 713519821 713337555 713630600
3066.7G13630600j45950j11008k03476l60260j68152o42547j097947m25033R5749m87900
$$ 713630600 713484650 713373642 713170166 712809906 712641754 711999207 710901260 710476227 710571976 710084076
3076.4G10084076N1880J00632p43409l61404J47324K7771n31235n26200o90994o22558
$$ 710084076 710135956 710236588 709493179 709131775 709279099 709306870 708775635 708249435 707558441 706935883
3086G06935883m07868o23093O1951J0376m03747k98920k00806n33447j079788o78025
$$ 706935883 706528015 705904922 705966873 705977249 705573502 705274582 705073776 704540329 703460541 702782516
3095.6G02782516n15747j45263R4986l59345l57284k74353j4649m7607l96271o74438
$$ 702782516 702266769 702121506 702216492 701857147 701499863 701225510 701210861 701163254 700766983 700092545
3105.3G00092545o82679l42102m61807q38394o08826P6218k06909o54297j4649M6845
$$ 700092545 699409866 699067764 698605957 697767563 697158737 697234955 697028046 696373749 696359100 696405945
3114.9F96405945o98013p66907n99060p77359j021500j063690m34952m8218k1362j50452
$$ 696405945 695707932 694941025 694341965 693564606 692543106 691479416 691044464 690996246 690974884 690824432
3124.6F90824432n25131m39072p71713p10220m47998j178055r85489n6991l27149q68225
$$ 690824432 690299301 689860229 689088516 688378296 687930298 686752243 685766754 685709763 685382614 684514389
3134.2F84514389j0452K10953n67933n64346q19473j204071r54514r01642p49435j01471
$$ 684514389 684503937 684714890 684146957 683582611 682763138 681559067 680604553 679702911 678953476 678852005
3143.9F78852005j99814n41305m10767n44510n40085m38766n07126r18961j058807
$$ 678852005 678652191 678110886 677700119 677155609 676615524 676176758 675669632 674750671 673691864
3152.5F73691864r94949j057282j88064J88217l97034p20215o35376n56183r74502
$$ 673691864 672696915 671639633 671451569 671639786 671242752 670522537 669887161 669330978 668356476
3161.2F68356476j123429p74307o04553q10547p38602l24554Q6441m578q19397j168899
$$ 668356476 667233047 666458740 665854187 665043640 664305038 663980484 664066925 664062347 663242950 662074051
3170.9F62074051p70416o16532j303558j103668m05655n36194l30124k76565l12272
$$ 662074051 661303635 660687103 659383545 658279877 657874222 657338028 657007904 656731339 656419067
3179.5F56419067o04477n35659m56238j439972j348724j127167p59888k67639p22733
$$ 656419067 655814590 655278931 654822693 653382721 652033997 650906830 650146942 649879303 649156570
3188.2F49156570l81164p6904m75693p49512p54471o06460n41382o69937j034394j239013
$$ 649156570 648775406 648698502 648222809 647473297 646718826 646112366 645570984 644901047 643866653 642627640
3197.9F42627640q64945m29153m30527r8343j79519q06847j110916r26171l39546p46460
$$ 642627640 641762695 641333542 640903015 640804672 640625153 639818306 638707390 637781219 637441673 636695213
3207.5F36695213j271400j008263l05214O4316k28729m18511r13581q54454q04291
$$ 636695213 635423813 634415550 634110336 634174652 633945923 633527412 632613831 631759377 630955086
3216.2F30955086j004868o06842m81071p79572j216736o28204r2697l4752q9188p76519
$$ 630955086 629950218 629343376 628862305 628082733 626865997 626237793 626145096 626110344 626021156 625244637
3225.8F25244637p08161q35075q21419l25775q31108q56858l84597k52991k24075m22745
$$ 625244637 624536476 623701401 622879982 622554207 621723099 620866241 620481644 620228653 620004578 619581833
3235.5F19581833o60591j207581j005249k81257q94318n16090j24703p90253j44958
$$ 619581833 618921242 617713661 616708412 616427155 615532837 615016747 614892044 614101791 613956833
3244.2F13956833o58264j011200J19629J84669p72323j538277p48367o85921j229286
$$ 613956833 613298569 612287369 612406998 612591667 611819344 610281067 609532700 608846779 607617493
3252.8F07617493o02570m9019n3215l74985p18231r26590l34091k51808r17740j070938
$$ 607617493 607014923 606965904 606912689 606537704 605819473 604892883 604558792 604306984 603389244 602318306
3262.5F02318306p25250k56577l44505m8142o3018l03421n57213o48613j72806m08707
$$ 602318306 601593056 601336479 600991974 600943832 600880814 600577393 600020180 599371567 599198761 598790054
3272.1E98790054m45671j242866j010285j61018j159973l93067L85666K0104q2932
$$ 598790054 598344383 597101517 596091232 595930214 594770241 594377174 594762840 594782944 594700012
3280.8E94700012m62417q66051j324272j086426m39224j96038k13775r9945j3237J4801
$$ 594700012 594237595 593371544 592047272 590960846 590521622 590325584 590111809 590011864 589998627 590013428
3290.4E90013428m71001m14543O9580q65250q53080p85866j040764n98717m65431L44696
$$ 590013428 589542427 589127884 589197464 588332214 587479134 586693268 585652504 585053787 584588356 584933052
3300.1E84933052Q0376p42874p53212p79000o34308q02269q55522m41551o62498j144143
$$ 584933052 585013428 584270554 583517342 582738342 582104034 581301765 580446243 580004692 579342194 578198051
3309.7E78198051m48417o10123o53191K3842l68423j01662o15997j287346j120987
$$ 578198051 577749634 577139511 576486320 576510162 576141739 576040077 575424080 574136734 573015747
3318.4E73015747p24564J5908m30527p28455m55246j65596n18951j102943j250496
$$ 573015747 572291183 572307091 571876564 571148109 570692863 570527267 570008316 568905373 567654877
3327.1E67654877j097832m88434p87048q96301q11158l31268k61116q64601k00615
$$ 567654877 566557045 566068611 565281563 564385262 563574104 563242836 562981720 562117119 561916504
3335.8E61916504q77304j410561q34656p42225q99391j080704o51207q82645n91926
$$ 561916504 561039200 559628639 558793983 558051758 557152367 556071663 555420456 554537811 553945885
3344.4E53945885n55725q61245j97258l74755p96319j075325j259765j301270j144828
$$ 553945885 553390160 552528915 552331657 551956902 551160583 550085258 548825493 547524223 546379395
3353.1E46379395j188508r22775r0256j62277m90570j077652r81102q71506j457405
$$ 546379395 545190887 544268112 544177856 544015579 543525009 542447357 541466255 540594749 539137344
3361.8E39137344j161155q40950n13802k53792m85878j292953j131478j61132l87497
$$ 539137344 537976189 537135239 536621437 536367645 535881767 534588814 533457336 533296204 532908707
3370.5E32908707r85260j615982j371994p95594o23359l79715l58200k70806m57115
$$ 532908707 531923447 530307465 528935471 528139877 527516518 527136803 526778603 526507797 526050682
3379.2E26050682j138611j632499o27709j12266o29235n73692j055679j139603m20113
$$ 526050682 524912071 523279572 522651863 522539597 521910362 521336670 520280991 519141388 518721275
3387.8E18721275M60549K35481n37872l54462q15506j374054j046638k92359L3035
$$ 518721275 519181824 519417305 518879433 518524971 517709465 516335411 515288773 514996414 515029449
3396.5E15029449q34541r68857M16451L09639j122856m62799Q6479n43595o20422j068687
$$ 515029449 514194908 513226051 513642502 513952141 512829285 512366486 512452965 511909370 511288948 510220261
3406.2E10220261j167221j30692J88408k45895j08300l04413m49218m6654r2583m92515
$$ 510220261 509053040 508922348 509110756 508864861 508756561 508452148 508002930 507956276 507863693 507371178
3415.8E07371178n03884m90913m01077M04853l35884q56781j20163k05993L78151K32963
$$ 507371178 506867294 506376381 505975304 506380157 506044273 505187492 505067329 504861336 505239487 505472450
3425.5E05472450k49672j01700l20816m48722k45781l22876k21825R02786N32837r5329
$$ 505472450 505222778 505121078 504800262 504351540 504105759 503782883 503561058 504463844 504996681 504901352
3435.1E04901352K05231N645O600K1705O9771Q3809M59747j17416j22604P52678R12437
$$ 504901352 505106583 505112228 505118828 505140533 505210304 505294113 505753860 505636444 505513840 506266518 507178955
3445.7E07178955J159973r08355m44947J110726L00750K01264m4098J53732K56272
$$ 507178955 508338928 507430573 506985626 508096352 508397102 508598366 508554268 508708000 508964272
3454.4E08964272O68754R10721M48685L26843J2016P68929J085586O70815k67258n23834
$$ 508964272 509633026 510543747 510992432 511319275 511331291 512100220 513185806 513856621 513589363 513065529
3464E13065529M00925J138687J270523K79312P79495O29349L71399R15985L27988P84530
$$ 513065529 513466454 514605141 515875664 516154976 516934471 517563820 517935219 518851204 519179192 519963722
3473.7E19963722N58014o0692J84365Q67538J257324Q67424P00913M68101L40576K1973
$$ 519963722 520521736 520461044 520645409 521512947 522770271 523637695 524338608 524806709 525147285 525169258
3483.3E25169258P71484L64571k88467R84916R82170O16684P13387J346817J443138
$$ 525169258 525940742 526305313 526016846 527001762 527983932 528600616 529314003 530660820 532103958
3492E32103958R17587L33214J78337Q50144j81656J15013J213074J008339R40170J568947
$$ 532103958 533021545 533354759 533533096 534383240 534201584 534316597 535529671 536538010 537478180 539047127
3501.6E39047127J602592l03001r1705M75234L60985J124611K424851R46655j881485
$$ 539047127 540649719 540346718 540255013 540730247 541091232 542215843 544640694 545587349 543705864
3510.3E43705864N82542J231690J136284J636886P11861P97005Q60366Q81463l5172
$$ 543705864 544288406 545520096 546656380 548293266 549005127 549802132 550662498 551543961 551508789
3519E51508789m3526P46308J518287J788330j79138N97916J773262J204071K04430
$$ 551508789 551465263 552211571 553729858 555518188 555339050 555936966 557710228 558914299 559118729
3527.7E59118729K80571N59921P06596J487694J328468J045456P53708K015038Q15811
$$ 559118729 559399300 559959221 560665817 562153511 563481979 564527435 565281143 567296181 568111992
3536.4E68111992r39751J379051J237450Q56628R13201J675758J482010O36177L45459
$$ 568111992 567172241 568551292 569788742 570645370 571558571 573234329 574716339 575352516 575697975
3545E75697975R270J678009r0637J593513K177811J487465K669563j195679k23350
$$ 575697975 575707245 577385254 577294617 578888130 581065941 582553406 585222969 584027290 583803940
3553.7E83803940J001205K100334K431183L5973J361999R09958R82666P50389K025834
$$ 583803940 584805145 586905479 589336662 589372635 590734634 591644592 592627258 593377647 595403481
3562.4E95403481J509666k16103M600678Q42285j989708K36015n4969L709678J539498
$$ 595403481 596913147 596697044 601297722 602140007 600150299 600386314 600331345 604041023 605580521
3571.1F05580521N88607J583901K234421R20829R20639K262001M34113K325821J391334
$$ 605580521 606169128 607753029 609987450 610908279 611828918 614090919 614525032 616850853 618242187
3579.7F18242187q0833J882057K279511J685333P45125M053650K066803j978913N09529
$$ 618242187 618161354 620043411 622322922 624008255 624753380 628807030 630873833 628894920 629404449
3588.4F29404449j301040L276062L366165K976837J414757N83916L926468j917725
$$ 629404449 628103409 631379471 634745636 637722473 639137230 639721146 643647614 641729889
3596.1F41729889J044006L744278O00662K483674j32447P54395K876129J273498J890564
$$ 641729889 642773895 646518173 647118835 649602509 649470062 650224457 653100586 654374084 656264648
3604.8F56264648L410950K522049j522217K822342j297302n88379Q269653J055985
$$ 656264648 659675598 662197647 660675430 663497772 662200470 661612091 669881744 670937729
3612.5F70937729k406235M545136j102600K947769M559860N86700P79801k268601m57992
$$ 670937729 668531494 673076630 671974030 674921799 679481659 680068359 680848160 678579559 678121567
3621.2F78121567K692489L270874K922898K775116J999359K706146P714157p25632
$$ 678121567 680814056 684084930 687007828 689782944 691782303 694488449 702202606 701476974
3628.9G01476974j3283691L741913M919739O199875J421737k112884K360306K995300
$$ 701476974 688193283 691935196 696854935 703054810 704476547 702363663 704723969 707719269
3636.6G07719269K693252N55344M05884J327133K555771J341476o23779J841431M006576
$$ 707719269 710412521 710967865 711373749 712700882 715256653 716598129 715974350 717815781 721822357
3645.3G21822357P470093J104736m813919L990326j140518l470917k591629M691696
$$ 721822357 729292450 730397186 725583267 729573593 728433075 724962158 722370529 727062225
3653G27062225L903733L557510M789124r393387J356201N548782J776886J037750r7885
$$ 727062225 730965958 734523468 739312592 729919205 731275406 736824188 738601074 739638824 739540939
3661.7G39540939J869355q240N37872J621781R42688N047149L318405m82559m01840
$$ 739540939 741410294 741402054 741939926 743561707 744504395 749551544 752869949 752387390 751985550
3670.4G51985550q373947J361236Q383179R247208j193543j9150772J209259P243424
$$ 751985550 743611603 744972839 753356018 762603226 761409683 742258911 743468170 750711594
3678.1G50711594N405883k586517m04205L057251J631622J301041J24130n93338L564835
$$ 750711594 756117477 753530960 753126755 756184006 757815628 759116669 759240799 758647461 762212296
3686.8G62212296O558761r826965m331513R143372o252594j503296M946518M13208
$$ 762212296 768771057 758944092 754612579 763755951 757503357 756000061 760946579 761359787
3694.5G61359787R72595q77075j211777J109772J48697K734756M191361m719162l400955
$$ 761359787 762332382 761455307 760243530 761353302 761501999 764236755 768428116 763708954 760307999
3703.2G60307999L945312J357269L3112Q45490L210144L631897q131180M634704N643235
$$ 760307999 764253311 765610580 765643692 766489182 769699326 773331223 765200043 769834747 775477982
3711.9G75477982j4634324M211808M147567k97164P61184K910919J449509m595718
$$ 775477982 760843658 765055466 769203033 768905869 769667053 772577972 774027481 769431763
3719.6G69431763L84063O142960k347336m950332M354553J478119k00196m003067o70242
$$ 769431763 769815826 775958786 773611450 768661118 773015671 774493790 774293594 770290527 769620285
3728.3G69620285M614487J485061N960160j767502r071884R511795K169876j1471253
$$ 769620285 774234772 775719833 781679993 779912491 770840607 780352402 782522278 771051025
3736G71051025k76870J725921l48739K220382L339615l680343K946853J2370377q694153
$$ 771051025 770774155 772500076 772151337 774371719 777711334 774030991 776977844 789348221 780654068
3744.7G80654068j8348694R921646N771256O292801j330567j2625122P413483o905594
$$ 780654068 762305374 772227020 777998276 784291077 782960510 770335388 777748871 770843277
3752.4G70843277n396347O085663M920425L137360n307541L099594O279449r148483
$$ 770843277 765446930 771532593 776453018 779590378 774282837 777382431 783661880 774513397
3760.1G74513397l334045L896713J786194P82242L247909l749771n015259L983765
$$ 774513397 771179352 775076065 776862259 777644501 780892410 777142639 772127380 776111145
3767.8G76111145N625687R74273q850326P19147K142715L38135Q58536j183548R35134
$$ 776111145 781736832 782711105 773860779 774579926 776722641 777060776 777919312 776735764 777670898
3776.5G77670898J265030L011093J083680p509156J209870J434784R39331K350311
$$ 777670898 778935928 781947021 783030701 775521545 776731415 778166199 779105530 781455841
3784.2G81455841m000473k056961J250839J125794N84945n84106N99289N52978Q01010
$$ 781455841 777455368 775398407 776649246 777775040 778359985 777775879 778375168 778928146 779729156
3792.9G79729156k46582J009522L914413m304123n380401K234650M996185P565155
$$ 779729156 779482574 780492096 784406509 780102386 774721985 776956635 781952820 789517975
3800.6G89517975n203476j2334061J440430K623749N959015O306915j1064453o159516
$$ 789517975 784314499 771980438 773420868 776044617 782003632 788310547 777246094 771086578
3808.3G71086578M813462K618026L61939Q32901N90286J403122O135407j136170j5189514
$$ 771086578 775900040 778518066 778880005 779712906 780303192 781706314 787841721 786705551 771516037
3817G71516037M486237N546798N796051K916489k0839386J879272N725098J702499
$$ 771516037 776002274 781549072 787345123 790261612 769422226 771301498 777026596 778729095
3824.7G78729095K326966K82364m551239j23749K393036L871994J608200r423676L491135
$$ 778729095 781056061 781338425 776787186 776663437 779056473 782928467 784536667 775112991 778604126
3833.4G78604126Q472137o890258r25827R561920r394989o022568P783051o531067
$$ 778604126 787076263 780186005 779260178 788822098 779427109 773404541 781187592 774656525
3841.1G74656525l42865O945572k136536l534165K420350J622238M37393J454849j323929
$$ 774656525 774313660 781259232 779122696 775588531 778008881 779631119 780068512 781523361 780199432
3849.8G80199432J832505N531234n781402J971206j8468246J605453J1919175o83747
$$ 780199432 782031937 787563171 781781769 783752975 765284729 766890182 778809357 778125610
3857.5G78125610k126388K491836K927933L042832o233368k58942P563095o697540
$$ 778125610 775999222 778491058 781418991 784461823 778228455 777969513 785532608 778835068
3865.2G78835068o185684M482498O268921P137222r336090j0379029M144364O167679
$$ 778835068 772649384 777131882 783400803 790538025 781201935 770822906 774967270 781134949
3872.9G81134949K537765j0407257J390457M076920Q7356K257081N065917o157913
$$ 781134949 783672714 773265457 774655914 778732834 778820190 781077271 786143188 779985275
3880.6G79985275q019867O686554J134491J418915M726028j3789138O82220M656525
$$ 779985275 771965408 778651962 779786453 781205368 785931396 772142258 772824478 777481003
3888.3G77481003J921310L915482k592774r735717K329712M146728j016312J450119
$$ 777481003 779402313 783317795 780725021 770989304 773319016 777465744 776449432 777899551
3896.1G77899551J604615K943039Q18710j0326309N622863K090760m389954N823593
$$ 777899551 779504166 782447205 783265915 772939606 778562469 780653229 776263275 782086868
3903.8G82086868l441925l076248m61578K77099K073670k13623J25580J78833K85797
$$ 782086868 778644943 775568695 775107117 775384216 777457886 777244263 777369843 777548676 777834473
3912.5G77834473L03344L97873K132645K047424n116882m595108N177154N29175m070053
$$ 777834473 778137817 778535690 780668335 782715759 777598877 773003769 778180923 778710098 774640045
3921.1G74640045K611313K139664J608581k903213l766632K197418J386337J139527
$$ 774640045 777251358 779391022 780999603 778096390 774329758 776527176 777913513 779053040
3928.8G79053040j206513p16171K602463l259201k804261J418534O61163R66186R77631
$$ 779053040 777846527 777130356 779732819 776473618 773669357 775087891 775749054 776715240 777692871
3937.5G77692871N1270K2506j022567N37414J707840l671799n98373J739578Q67844
$$ 777692871 777744141 777766647 776744080 777281494 778989334 775317535 774719162 776458740 777326584
3946.2G77326584J551819k426377L36380Q72574k477569J278839N31845l81012J20468
$$ 777326584 778878403 776452026 776788406 777660980 775183411 776462250 776994095 776613083 776733551
3954.9G76733551j49765j76697n75104J064682N11399o333k04696j489182K32773R48792
$$ 776733551 776583786 776407089 775831985 776896667 777408066 777401733 777197037 775707855 775940628 776889420
3964.5G76889420j44654n55038K12097J025772p16782r90524J587219O43082o38199
$$ 776889420 776744766 776189728 776401825 777427597 776710815 775720291 777307510 777950592 777312393
3973.2G77312393J65177k06681m80118p70187q8882M29077K62375n0888k75269O2561
$$ 777312393 777477570 777270889 776790771 776020584 775931702 776360779 776623154 776572266 776296997 776359558
3982.8G76359558m22439K31933q697p55463K12021J058121R05456q43887o95877O9809
$$ 776359558 775937119 776169052 776160355 775404892 775616913 776675034 777580490 776736603 776040726 776110535
3992.5G76110535P21512O71081j486587p41654M99802J46560j06277M13895
$$ 776110535 776832047 777503128 776016541 775274887 775774689 775921249 775814972 776228867
4000.2G76228867
$$ 776228867
##END=$$ End of the data block
