##TITLE=$$ Begin of the data block
##JCAMP-DX=5.00 $$ ACD/SpecManager v 10.08
##SPECTROMETER/DATA SYSTEM=Varian
##DATE=18 Dec 2012 10:13:14
##DATA TYPE=INFRARED SPECTRUM
##DATA CLASS=XYDATA
##ORIGIN=
##OWNER=
##NPOINTS=3735
##FIRSTX=399.26403809
##LASTX=4000.35498047
##MAXX=4000.35498047
##MINX=399.26403809
##MAXY=83.34851837
##MINY=31.33544922
##XFACTOR=1.0000000000
##YFACTOR=0.000000100000000
##FIRSTY=70.63575745
##DELTAX=0.96440572
##XUNITS=1/CM
##YUNITS=TRANSMITTANCE
##XYDATA=(X++(Y..Y))
399.3G06357574P959137J137543j1731567j7000046k711487R920273J0789719Q28399
407G05549545m393310n26276k57492O313400k055053j4869004l747558N663299N66635
415.7F92244186k466430K733230l867950j3449402J5290909L081665p186585j689148
423.4F84690475R941254K908859o958389J495438L098373K183762N478286k865753
431.1F99972305o588592j395035j426621J137009l97491j367035L472137r60998k499161
439.8F89946518K794876M526291L363190k355881n219650j617966k315598k646255
447.5F86475525R06982L85743K314453L894577j842270l313294l38134j637955l610306
456.2F83235321o215515K756348P674636r10949L09066J818009j227188k48184j300431
$$ y = [706357574, 714316711, 715454254, 703722687, 686722641, 684011154, 693931427, 704721146, 705549545, 701156235, 700629959, 700372467, 706685867, 704630814, 689761810, 686014252, 691677551, 692244186, 689777756, 692510986, 688643036, 675193634, 690484543, 693566208, 686379623, 684690475, 694631729, 697540588, 690582199, 692077637, 695176010, 697359772, 702838058, 699972305, 693383713, 691988678, 690562057, 691699066, 691301575, 689934540, 693406677, 692445679, 689946518, 692741394, 697267685, 700630875, 698274994, 693055344, 691437378, 689121780, 686475525, 687382507, 687768250, 690082703, 693977280, 692135010, 688821716, 688483582, 686845627, 683235321, 677019806, 679776154, 687450790, 686539841, 686848907, 688666916, 687439728, 687191544, 685891113]
464.8F85891113m203109n487214k528457L978653O013488L844071k575913j538925
472.6F83393707L283005l229217p64771j481018m262619K234497L311157J49307R26743
481.2F83560791N246964J996612k722855J233902o04553j751480p87506j767960j210785
489.9F83193130M17023L265686K808686K055969J154785j055298k659836q36334J498642
498.6F89842453j426773j826706o47202M6616O09512k45666J982651J513137k173385
507.3F87674637l549729k962265k485809o52618J878051m58755k050247q14362O73294
516F77252197J424866j749191j928482j138001j561584l133469k373428L106918N407944
524.6F75307770K538299k938232k873840j463089q8654o00967k219239J45188L03497
$$ y = [685891113, 681688004, 676200790, 673672333, 677650986, 683664474, 687508545, 684932632, 683393707, 686676712, 683447495, 682682724, 681201706, 676939087, 679173584, 682484741, 682634048, 683560791, 688807755, 690804367, 688081512, 689315414, 688710861, 686959381, 686171875, 684403915, 683193130, 683610153, 686875839, 689684525, 691740494, 692895279, 691839981, 689180145, 688343811, 689842453, 688415680, 686588974, 685941772, 685988388, 686597900, 686352234, 688334885, 689848022, 687674637, 684124908, 681162643, 678676834, 678024216, 679902267, 679443512, 677393265, 676578903, 677252197, 678677063, 676927872, 674999390, 673861389, 672299805, 669166336, 666792908, 669899826, 675307770, 677846069, 674907837, 672033997, 670570908, 670482254, 669881287, 667662048, 667807236, 668110733]
533.3F68110733N29709J481399J954499J814728j54572m78363o36673j000519k839660
542F68781281l124009n11779O18667L814392M386139J678238L30658j165466k099076
550.7F72709045j303558J814117J593400k113495r93424J612396Q64563L92228J223220
559.4F75798492O61469r2774k17285j496963j812363p16781N26275K193070L682327
568F78525467K684631j498413k247772j657944k274856m75617Q4381n42907j489258
576.7F71107712j236496J996231K701721J895065n9890j155472p24411j926880j403275
585.4F71194305n10025l738N21164J382828K235870J034546k8610q3847P29065k671585
595F73799973l273011J1978k193298n26810J109085n01327o10809k307969j720275
$$ y = [668110733, 668640442, 670121841, 672076340, 673891068, 673736496, 673258133, 672621460, 671620941, 668781281, 665657272, 665145493, 665764160, 669578552, 673964691, 675642929, 675973587, 674808121, 672709045, 671405487, 673219604, 674813004, 672699509, 671706085, 673318481, 674183044, 674575272, 675798492, 676459961, 676367187, 676149902, 674652939, 672840576, 672123795, 672650070, 674843140, 678525467, 681210098, 679711685, 677463913, 675805969, 673531113, 673055496, 673139877, 672596970, 671107712, 669871216, 671867447, 674569168, 676464233, 676404343, 675248871, 674524460, 672597580, 671194305, 670684280, 670680542, 671201706, 672584534, 674820404, 675854950, 675826340, 675742493, 676471558, 673799973, 670526962, 670538940, 668345642, 667818832, 668927917, 668426590, 667815781, 665507812, 663787537]
603.7F63787537j709671m123001o482621p071075p943154r958763r453087r483108
611.4F07563057q692436j0624199q777390m872207l828431k65922j133766j738510
619.2E67630196m561310p463875o619225o545410m386177N48630Q454590J0916023
626.9E57973442J1632385J2433701J2473106R862976N553475L468933q19626m531059
634.6F08047333n604820n251008m136047l764687k488899K584420Q977546J1810761
642.3F10174599J4637260J4616470J4470520J2909546R070816N026703M769821M362412
650F90038147L30811j09253J179199J778183J676559J864319K454224K358856K105789
658.7G03676834P48520R57947k87018j622162L46603L54386J382217L821793J276855
$$ y = [663787537, 662077866, 657954865, 651472244, 644401169, 636458015, 626499252, 617046165, 607563057, 598870621, 588246422, 579469032, 574596825, 570768394, 570502472, 569368706, 567630196, 563068886, 555605011, 548985786, 542440376, 538054199, 538602829, 547057419, 557973442, 569605827, 582039528, 594512634, 604375610, 609929085, 613398018, 612578392, 608047333, 602442513, 597191505, 593055458, 589290771, 586801872, 589386292, 598363838, 610174599, 624811859, 639428329, 653898849, 666808395, 675879211, 680905914, 685675735, 690038147, 690368958, 690259705, 691438904, 693217087, 694893646, 696757965, 699212189, 701571045, 703676834, 704425354, 705383301, 705096283, 703474121, 703820724, 704175110, 705557327, 709379120, 710655975]
667.4G10655975p097320M673233L778305N65567p85446j105500o79016l89022Q36486
676.1G10453262J794892J585693L245697L665772m6158k174759r18350m77829j115113
684.7G16013107j343078j015396M76684J543579L51792n57938q56323j017685j730652
693.4G11864090l401871j952743j041870j088944N04379M15955J208801P67365J80511
702.1G07455673K191468J000823j518173k778854q46558J248474Q61130K316055K878571
710.8G12808609K868576K752762J376190O23169J85394k97393p02286R94873K187271
719.5G22797165J461029K002106K245407J560211O06232J27182o00739j716766j103211
728.1G27378616r36660j580201j200637j24054J457595Q65555k75192O92902N1040
$$ y = [710655975, 703558655, 708231888, 712010193, 712575760, 711790314, 710684814, 710005798, 709616776, 710453262, 712248154, 713833847, 717079544, 720745316, 720699158, 718524399, 717606049, 717128220, 716013107, 714670029, 713654633, 714131317, 715674896, 716026688, 715468750, 714612427, 713594742, 711864090, 708462219, 706509476, 705467606, 704378662, 704883041, 705298996, 706507797, 707275162, 707455673, 709647141, 710647964, 709129791, 706350937, 705504379, 706752853, 707613983, 709930038, 712808609, 715677185, 718429947, 719806137, 720429306, 720614700, 720317307, 719615021, 720609894, 722797165, 724258194, 726260300, 728505707, 730065918, 730672150, 730799332, 730198593, 728481827, 727378616, 726441956, 724861755, 723661118, 723537064, 724994659, 725860214, 725585022, 726277924, 726328964]
736.8G26328964j967697j857452o57196k95258k25983P57752K718048K877579J656112
745.5G29334869J552277M34723o10962N82199J190186J717987K668914J799012J654434
754.2G40323639L007049K616578K326736J985626K86408P3013m578J1902Q63037J473999
763.8G52963409O21949l08457Q94165R89304J76010p12891q66317r71909j786194o69784
773.5G50329285N30700K027741K819443K165527J540756J793442J709824k35749Q13370
782.1G63494339P37839m68827Q74711J164245J617661K062072K708741J115799k01416
790.8G73105164J76925j100311p43637q20236j019593k00729J358490K083206P57981
799.5G73597260O75735O29120k04544j132584o32248q35571j029511K03019P11288
$$ y = [726328964, 724361267, 722503815, 721846619, 721551361, 721325378, 722083130, 724801178, 727678757, 729334869, 730887146, 731321869, 730710907, 731293106, 732483292, 734201279, 736870193, 738669205, 740323639, 743330688, 745947266, 748274002, 750259628, 750546036, 750619049, 750614471, 750626373, 751489410, 752963409, 753585358, 753276901, 754171066, 755160370, 755336380, 754623489, 753757172, 752785263, 750999069, 750329285, 750859985, 752887726, 755707169, 757872696, 759413452, 761206894, 762916718, 762680969, 763494339, 764232178, 763763351, 764638062, 765802307, 767419968, 769482040, 772190781, 773306580, 773105164, 773282089, 772181778, 771438141, 770617905, 769598312, 769397583, 770756073, 772839279, 773597260, 774272995, 774902115, 774697571, 773564987, 772932739, 772097168, 771067657, 771270676, 771981964]
808.2G71981964J856690R46502o8054L31497J00479k81906q43353o55212m00925O4392
817.8G73032074k74353P74155J795425J023865J338501M48532r10187k572250k303391
826.5G72352371j493454j675873k57873j274033j623306k76031o03638j261826k666702
835.2G61219635l639679l368759k871780k630921k267990j466599j235275k26288N72586
843.9G44084930j026153j240311j612167j718369P03659L87040J89666J729737K507171
852.5G44005203K964859K595902K761307K294006J814880R20029K57034J789170J043014
861.2G60445404N12085J885910K997665J910096M99115J278991P248l99856j31531
869.9G69005127j196213p71789J160202K382583J708603J178284N95703P49512k10877
$$ y = [771981964, 773838654, 774785156, 774717102, 775048599, 775149078, 774867172, 774023819, 773368607, 772967682, 773032074, 772757721, 773531876, 775327301, 776351166, 777689667, 778138199, 777228012, 774655762, 772352371, 770858917, 769183044, 768925171, 767651138, 766027832, 765751801, 765148163, 763886337, 761219635, 757579956, 754211197, 751339417, 748708496, 746440506, 744973907, 743738632, 743512344, 744084930, 743058777, 741818466, 740206299, 738487930, 739191589, 739578629, 739768295, 741498032, 744005203, 746970062, 749565964, 752327271, 754621277, 756436157, 757356186, 757613220, 759402390, 760445404, 760957489, 762843399, 765841064, 767751160, 768250275, 769529266, 769536514, 769136658, 769005127, 767808914, 767037125, 768197327, 770579910, 772288513, 773466797, 774062500, 774812012, 774601135]
878.6G74601135k044220j769104j641388k090683j771164n77468o13099r3765J31760
887.3G64132004r27048j329193j765518o40412l15475j15128J46027r25903J10855
895.9G58370209J557541J292038k11716k86636L77044l8833r19037j844635o40946
904.6G57655029J17569l33481o00814j487809k457733k261429j616058j807098j857987
913.3G45350189k592010k841797k057419j247940r21021j933441k197876k057953k211456
922G27289276j731415j984100k374954j774369j629867j058426k8687O791N1269J60065
931.6G16925583J61209P0801K02179P83233J508179K625809K977676K599335K496338
940.3G30350342K515030K847366K525024J955719J573105J160889J555862K122040
$$ y = [774601135, 772556915, 770787811, 769146423, 767055740, 765284576, 764707108, 764094009, 764000244, 764132004, 763204956, 761875763, 760110245, 759469833, 759154358, 759039230, 759185257, 758259354, 758370209, 759927750, 761219788, 761008072, 760721436, 761098480, 761059647, 760140610, 758295975, 757655029, 757772598, 757439117, 756838303, 755350494, 752892761, 750631332, 749015274, 747208176, 745350189, 742758179, 739916382, 737858963, 736611023, 735690002, 733756561, 731558685, 729500732, 727289276, 725557861, 723573761, 721198807, 719424438, 717794571, 716736145, 716707458, 716714249, 716765518, 716925583, 717086792, 717157593, 717359772, 718143005, 719651184, 722276993, 725254669, 727854004, 730350342, 732865372, 735712738, 738237762, 740193481, 741766586, 742927475, 744483337, 746605377]
948G46605377J803971J397552J968689O00662m50134N87692K43836n14298j707229
956.7G50536118j843033r25217r93881j640625j559754j320419k159347j818696j946868
965.4G36328278k956467k392655j150131j007995j488495o72150q20999j321106j42975
974.1G24375305m14657j310502j243591j125564j107026j440811p87048m89578j140747
982.7G15315781r29642j636124j979675k090912l302460l458633l134308l108673l548279
991.4F92127075m343338p369156j0684738j2606811j0370331J504364J0908050J0394822
999.1F69559937N427780K071762J215591j47018j00937M01306p21893j095810j91727
1007.8F76418991K25525j023483k245865k176514j362457j079712j203308j236801
$$ y = [746605377, 748409348, 749806900, 751775589, 752376251, 751926117, 752513809, 752757645, 752243347, 750536118, 748693085, 747767868, 746773987, 745133362, 743573608, 742253189, 740093842, 738275146, 736328278, 733371811, 730979156, 729829025, 728821030, 727332535, 726660385, 725839386, 724518280, 724375305, 723960648, 722650146, 721406555, 720280991, 719173965, 717733154, 716946106, 716456528, 715315781, 714386139, 712750015, 710770340, 708679428, 705376968, 701918335, 698784027, 695675354, 692127075, 687783737, 680414581, 669729843, 657123032, 646752701, 648257065, 659165115, 669559937, 674987717, 677059479, 678275070, 678128052, 678027115, 678428421, 677706528, 676610718, 676418991, 676644516, 675621033, 673375168, 671198654, 669836197, 668756485, 667553177, 666316376]
1015.5F66316376j557923k118301k459335k343445j834717j623077k932663l108368
1023.2F48338547j820450j413651j882400j619034j356201k502174k133942k257576
1031F33353119j812744j635208k772828k138175k616654j027603L06740p51267j687660
1039.6F19217720j205177k9564r97124p133l44773j196022q24547k67601J448670J469383
1049.3F17263832J524658N23262O12030L37715p70988j66740Q2130M60091n64957l61176
1058.9F18939857n6495P09190P09000j238899m00620l27339n92499j548004j666908
1067.6F14527283n27535o10885q22106p53021O41365m6654k25448j692009k367325
1076.3F08123665m56467j697082j837578j464157l18756m78821o35033p74231k146225
$$ y = [666316376, 664758453, 662640152, 660180817, 657837372, 656002655, 654379578, 651446915, 648338547, 646518097, 645104446, 643222046, 641603012, 640246811, 637744637, 635610695, 633353119, 631540375, 629905167, 627132339, 624994164, 622377510, 621349907, 621656647, 620905380, 619217720, 618012543, 617982979, 616985855, 616978722, 616633949, 615437927, 614613380, 614345779, 615794449, 617263832, 618788490, 619311752, 619923782, 620261497, 619490509, 619323769, 619405899, 619865990, 619301033, 618939857, 618883362, 619592552, 620301552, 619062653, 618662033, 618334694, 617742195, 616194191, 614527283, 613999748, 613388863, 612566757, 611813736, 612455101, 612408447, 612182999, 610490990, 608123665, 607667198, 605970116, 604132538, 602668381, 602349625, 601870804, 601235771, 600461540, 598315315]
1085E98315315j493454l182487l375664l738823l795509m052506n809631n451088p744217
1093.6E59671936q159752r635277j0075683r898415j0848465j0036545j1708221r427948
1101.4D79881630j0534744j0807534j0074615r400520q407212j1371956q515281r400749
1109.1D01369019q408394p652397p317849n253753n031319k523041m024734o72837
1116.8C60484695j194267j17493J674614N79529K599793L10554K411423R95369J716919
1125.5C69461136J516876K53525J653976j017227P53670k174111k187080k675781l268356
1134.1C62316628k188378m750671k235260l384476j805229k886734k527390j612968
1141.9C40925522l936348k340202m745331k026520l498802l438339k290307k663154
$$ y = [598315315, 596821861, 593639374, 590263710, 586524887, 582729378, 578676872, 572867241, 567416153, 559671936, 551512184, 541876907, 531801224, 521902809, 511054344, 501017799, 489309578, 479881630, 469346886, 458539352, 448464737, 439064217, 430657005, 419285049, 410769768, 401369019, 392960625, 385308228, 377990379, 372736626, 367705307, 365182266, 361157532, 360484695, 359290428, 359172935, 360847549, 361427078, 364026871, 364337425, 366748848, 367744217, 369461136, 370978012, 371231537, 372885513, 371868286, 372621956, 370447845, 368260765, 365584984, 362316628, 360128250, 355377579, 353142319, 349757843, 347952614, 345065880, 342538490, 340925522, 336989174, 334648972, 329903641, 327877121, 324378319, 320939980, 318649673, 315986519]
1149.6C15986519k43168k339230Q09307q58936J53103L29971J80302K418709J72024
1158.3C16608601L431911J872177L412972L051948L500061N130310K826577N931320
1166C45765877M479255O121178N621109O288490P965622P317505Q753777P044220R124069
1174.6D08481102P542648P810059Q067245P515831Q790093P113647Q503762O992797
1182.4D70817184P143403O706237O439820O732292N403824O320877M670982N414162
1190.1E19648781M097442M261170N818634N165062O215668M846115N508423N385932
1197.8E60947227N447312M740333L867875N395050M983673N556144M822617N015869
1205.5F00776100M956169L883324L843040L298912L367234K418785K774162K981377
$$ y = [315986519, 315743351, 313404121, 314213428, 313354492, 313507595, 313837566, 314017868, 316436577, 316608601, 320040512, 321912689, 325325661, 328377609, 331877670, 337007980, 339834557, 345765877, 350245132, 356366310, 361987419, 368275909, 376241531, 383559036, 392312813, 399357033, 408481102, 416023750, 423833809, 431901054, 439416885, 448206978, 455320625, 463824387, 470817184, 477960587, 484666824, 491106644, 497838936, 503242760, 509563637, 514234619, 519648781, 523746223, 528007393, 533826027, 538991089, 545206757, 550052872, 555561295, 560947227, 566394539, 571134872, 575002747, 580397797, 585381470, 590937614, 595760231, 600776100, 605732269, 609615593, 613458633, 616757545, 620124779, 622543564, 625317726, 628299103]
1213.2F28299103K808532K484704J902656K516670J847458J814919J172180O12793
1220.9F43459015M49219J52130O97326K76032J282272J699829J218644R22851L60336
1229.6F50517654J56327R4299M86908K39105P53556M47235J68991J246948J704254
1238.3F55815277J547470M22745L34778L51486K46506j38703N8747P89261K15606Q23746
1247.9F60466919Q56934Q85543N20554J98135P56836J55258M84086k7390k69852J84403
1257.6F64211426Q65936J471863P39136R98230P41577J082000R44138j72501l57437
1266.3F70524368m2114Q15277P67212J444092J893616J884841J809845J635819J534653
1274.9F82267609Q36868J052933Q58993J048203J269226J317138J928483J701354K122269
$$ y = [628299103, 631107635, 633592339, 635494995, 638011665, 639859123, 641674042, 642846222, 643459015, 643908234, 644060364, 644757690, 645033722, 646315994, 648015823, 649234467, 650157318, 650517654, 650673981, 650768280, 651255188, 651494293, 652247849, 652695084, 652864075, 654111023, 655815277, 657362747, 657785492, 658120270, 658471756, 658718262, 658579559, 658638306, 659427567, 659643173, 660466919, 661323853, 662209396, 662729950, 662928085, 663684921, 663840179, 664324265, 664296875, 664027023, 664211426, 665077362, 666549225, 667288361, 668286591, 669028168, 670110168, 671054306, 670881805, 670524368, 670482254, 671297531, 672064743, 673508835, 675402451, 677287292, 679097137, 680732956, 682267609, 683104477, 684157410, 685016403, 686064606, 687333832, 688650970, 690579453, 692280807, 694403076]
1283.6F94403076K281571J797866J298676J205063J130600Q74023J235581J351928
1291.3G05578384J480408J291123J656799K384262J949463J478424J107559K48261
1299G17174683k4491P05338R26361Q90274J159668J096725J291581J378479P81478
1307.7G25380096K81373R4833j4191M2496k59018l10593M93927J179810J334381J243439
1317.4G29466553J062851L22952n7449J57165J0452J81351N04913P53556O76880N85098
1327G33664322J229248J197967O89545J93176m49142p8812k87704l58811K33765l12958
1336.7G35720596K73819Q42438K87094p0724J97830N95016k53067o68716o13480m77142
1346.3G35833664J22909J99509j06735j35117O07300K81754l79715l30200r05304j322098
$$ y = [694403076, 696684647, 698482513, 699781189, 700986252, 702116852, 702990875, 704226456, 705578384, 707058792, 708349915, 710006714, 712390976, 714340439, 715818863, 716926422, 717174683, 717150192, 717855530, 718781891, 719672165, 720831833, 721928558, 723220139, 724598618, 725380096, 725661469, 725756302, 725742111, 725784607, 725525589, 725214996, 725708923, 726888733, 728223114, 729466553, 730529404, 730852356, 730794907, 730952072, 730962524, 731143875, 731648788, 732402344, 733079224, 733664322, 734893570, 736091537, 736781082, 736974258, 736525116, 736446304, 736158600, 735799789, 736033554, 735720596, 735994415, 736836853, 737123947, 737053223, 737251053, 737846069, 737593002, 736924286, 736310806, 735833664, 735956573, 736156082, 736049347, 735914230, 736521530, 736803284, 736423569, 736093369, 735188065, 733865967]
1355.9G33865967p05414l48206m91256M13894M83017M42505M80805j765747m68522
1364.6G31907043l5247j259308j038056j256103j218872M3258L15629M14581O03714
1373.3G28476639p71332j257553p72171m22440o97479j521835j002808m88434o4468
1382G21478119K34680P50046Q90274J114578P95441k171936j68762R21707j21231m37394
1391.6G23285522k06069J071777J78680j220779L19519N61981Q0567l178406k025528
1400.3G18867264r6817o90460r537M96597j073837j30615J008834p6828j48468p39364
1409.9G17406769j483765j291199j093063M7302L08533O59790Q33664J320572K110596
1418.6G18819199l721543j639099J156769L22800m04816j704712P17011J543655J319122
$$ y = [733865967, 733160553, 732812347, 732321091, 732734985, 733218002, 733660507, 734141312, 732375565, 731907043, 731871796, 730612488, 729574432, 728318329, 727099457, 727142715, 727458344, 727872925, 728476639, 727705307, 726447754, 725675583, 725253143, 724555664, 723033829, 722031021, 721542587, 721478119, 721712799, 722462845, 723353119, 724467697, 725263138, 723091202, 722922440, 723844147, 723722916, 723285522, 723079453, 724151230, 724329910, 723109131, 723428650, 723990631, 724071198, 720892792, 718867264, 718770447, 718079987, 718070450, 718567047, 717493210, 717362595, 718371429, 718294601, 718146133, 717406769, 715923004, 714631805, 713538742, 713586044, 713894577, 714554367, 715388031, 716708603, 718819199, 715097656, 713458557, 714615326, 714938126, 714533310, 712828598, 713545609, 715089264, 716408386]
1427.3G16408386J760636O21795o09894N17960P92999m00238M0741K019654K031860
1436G23183899l631287p88650L292694K339859R22317O30188J98975K19955j26037
1444.7G26241913j22605Q21000O44302j156158Q61969J925201J291885Q06427L16086
1453.3G31630020J503372J596451L86124l037873l894424J881485J940537L093414
1461.1G35099106K242889J740723K685623k003937j634292J268921N88531M15650J552124
1469.7G41955338L253784J680298j205292M87823L495255L435592j124649o79016J400681
1478.4G52699814Q41751J093292M01840P68509J879120J565323J417770K006226l8300
1487.1G62635345j690063J342850j657563m767913P13729J806183Q96836J677322J357346
$$ y = [716408386, 718169022, 718790817, 718180923, 718698883, 719491882, 719091644, 719132385, 721152039, 723183899, 719552612, 718763962, 722056656, 724396515, 725318832, 725949020, 726147995, 726367950, 726241913, 726119308, 726940308, 727584610, 726428452, 727290421, 729215622, 730507507, 731313934, 731630020, 733133392, 734729843, 735115967, 732078094, 728183670, 730065155, 732005692, 735099106, 737341995, 739082718, 741768341, 739764404, 738130112, 739399033, 739987564, 740403214, 741955338, 745209122, 746889420, 745684128, 746171951, 749667206, 753102798, 751978149, 751299133, 752699814, 753541565, 754634857, 755036697, 755805206, 757684326, 759249649, 760667419, 762673645, 762635345, 760945282, 762288132, 760630569, 755862656, 756576385, 758382568, 759279404, 760956726, 762314072]
1495.8G62314072n259629K100144J73034m412612M23889p63703r85794M47998K470856
1504.5G56508255K820053n108719p565079L51105N54657j146621J720581j602555l891983
1513.1G42639694L07617j04751J466293o99844l413925K845306K742844l784027n011216
1521.8G36987991j145019J354141K653809k827073p91397O58570j405716M31366J045837
1530.5G36962509M21906l57666k230835o867752J065902J008759J348190M383164m820252
1539.2G30913925q865890N686340l61786j916504K507630L98483m419632J424484J028595
1547.9G26395645J396103K02179k449036J949845K230530J836013l168640M64707M199905
1556.5G33057251K108002j0503006j2274857J2461853N058975L437729K120133R52530
$$ y = [762314072, 757054443, 759154587, 759327621, 754915009, 755338898, 754575195, 753589401, 754037399, 756508255, 759328308, 754219589, 746654510, 747005615, 747560272, 746413651, 748134232, 746531677, 742639694, 742947311, 742842560, 744308853, 743609009, 740195084, 743040390, 745783234, 741999207, 736987991, 735842972, 737197113, 739850922, 737023849, 736232452, 736891022, 735485306, 735916672, 736962509, 737384415, 737026749, 734795914, 727928162, 728994064, 730002823, 731351013, 735734177, 730913925, 722048035, 727734375, 727372589, 725456085, 727963715, 728362198, 723942566, 725367050, 726395645, 727791748, 727993927, 725544891, 727494736, 729725266, 731561279, 728392639, 728857346, 733057251, 735165253, 724662247, 712387390, 724849243, 729908218, 733345947, 735466080, 736418610]
1564.2G36418610j698990j257706R27353Q34351R74197o148987O53000K545547M17405
1572.9G33664780R47799J994248J197586j0450821N49240P76901j152038q48236j683197
1581.6G24996262n59159j452255o24084q06275j529312j697311k428284j639633k507401
1590.3G11752548j606064l012542j480561r43679k539673j086502k370377j424713
1598F97288437k570343k126389k500152l071137k038879k936936j088485k025452j351013
1606.7F77579651k487030j637955k115936l902741j448974l449402j331863j758881
1614.4F59446869R1019n23682j0220108K032852l18527l57361k361984j44043p09076
1623.1F46935959p199974m94576q91342J033859k943992k018700o904q93403l18260
$$ y = [736418610, 734719620, 733461914, 734389267, 735223618, 736197815, 730048828, 730701828, 733247375, 733664780, 734612579, 736606827, 737804413, 727353592, 727902832, 728679733, 727527695, 726679459, 724996262, 724437103, 722984848, 722360764, 721554489, 720025177, 718327866, 715899582, 714259949, 711752548, 710146484, 707133942, 705653381, 704709702, 702170029, 701083527, 698713150, 697288437, 694718094, 692591705, 690091553, 687020416, 684981537, 682044601, 680956116, 678930664, 677579651, 675092621, 673454666, 671338730, 667435989, 665987015, 662537613, 661205750, 659446869, 659537888, 659014206, 648794098, 650826950, 650508423, 650151062, 647789078, 647645035, 646935959, 639735985, 639241409, 638350067, 639383926, 636439934, 634421234, 634414330, 633520927, 633202667]
1631.7F33202667j521568J678657K008019m374657m918976J114846M71534O34079J250878
1640.4F29545479n96428J415634o12717J547623K340393k015190j4153k771072L120194
1649.1F31959763K256584M557113N989342L91770j3058701K531013N342865J512566
1656.8F41482315J533890J393280K122116K667236K290345K313385o52237L254623
1664.5F56404953J995010J711426L115463L449555q1406r69467M093552Q34350L060684
1673.2F73614120M340973J205216q61969K634811L311692J900405K261811P15255L958207
1681.9F93080521N874939O3018l706970K644043N659638L674926J344147J940689J091232
1690.6G11666183K271042K221680L013687M894715N146331l262405K850189O150513
$$ y = [633202667, 631681099, 633359756, 635367775, 630993118, 626074142, 627188988, 627660522, 628294601, 629545479, 628949051, 630364685, 629751968, 631299591, 633639984, 631624794, 631610641, 628839569, 631959763, 634216347, 638773460, 644762802, 645154572, 632095871, 634626884, 639969749, 641482315, 643016205, 644409485, 646531601, 649198837, 651489182, 653802567, 653150330, 656404953, 658399963, 660111389, 663226852, 666676407, 666595001, 665625534, 669719086, 670553436, 673614120, 677955093, 679160309, 678298340, 680933151, 684244843, 686145248, 688407059, 689122314, 693080521, 698955460, 699018478, 695311508, 697955551, 703615189, 707290115, 708634262, 710574951, 711666183, 713937225, 716158905, 719172592, 724067307, 729213638, 725951233, 728801422, 734951935]
1698.3G34951935O592636J135254j0519257P523422N482102L370132K126389K184372
1706G52846985O51855J512833L383789J387253M05884J942672J867371K112579J95008
1714.7G66306229L25470M415054K542114p004547K919464L887482J704788O94351N7068
1723.4G75847473j86310Q19779J099701J029281J571198K374954q19550o68182M338455
1732G85406799M332047l502731j0134430M226455L958740J680680K439499j046753
1739.8G87360306j584931M027558K099533j856537j60523K915574J448288N65338Q78448
1748.4G95693054L02582L338165j041565j621246L933640K336502J650772J346588
1756.2H05938492k484436K60772J981507J527939K795944j651077j357422K516479
$$ y = [734951935, 741544571, 742679825, 732160568, 739683990, 745166092, 748536224, 750662613, 752846985, 753498840, 755011673, 758395462, 759782715, 760188599, 762131271, 763998642, 766111221, 766306229, 766631699, 771046753, 773588867, 766584320, 769503784, 773391266, 775096054, 775790405, 775847473, 775661163, 776480942, 777580643, 778609924, 780181122, 782556076, 781736526, 781068344, 785406799, 789738846, 786236115, 776101685, 780328140, 784286880, 785967560, 788407059, 787360306, 785775375, 789802933, 791902466, 790045929, 789885406, 792800980, 794249268, 794814606, 795693054, 795995636, 799333801, 798292236, 796670990, 800604630, 802941132, 804591904, 805938492, 803454056, 803714828, 805696335, 807224274, 810020218, 808369141, 807011719, 809528198]
1763.9H09528198Q39157N54886J222306L38745k866516K122039M338761K55737m541702
1772.5H11791611j646881M493789J705933k015152J422958O42548P55463K03247k052384
1781.2H15301132K63214J651383J389313r56727m41055J557922P64695M98657J205978
1789.9H21234512J61362L14331k795257j420746L318252R35593j148224R83658J922149
1798.6H23505630k33383j839599J026306j066437p03049J026154N28793Q20008K23465
1807.3H23287888J16195J357041J304321j679916n74952N32685J526O30722j27106
1815.9H24848404K50702l23105N2795R56879J84403L92684l05481J214905J419144
1824.6H28691330k998657p86591J711121J932983J74408l772507O57044J880035o4926
$$ y = [809528198, 810367355, 810922241, 812144547, 812483292, 809616776, 811738815, 816077576, 816333313, 811791611, 810144730, 814638519, 816344452, 814329300, 815752258, 816394806, 817150269, 817353516, 815301132, 815564346, 817215729, 818605042, 817648315, 817207260, 818765182, 819529877, 820028534, 821234512, 821395874, 821710205, 818914948, 817494202, 820812454, 821748047, 820599823, 821583481, 823505630, 823272247, 821432648, 822458954, 821392517, 820689468, 821715622, 822244415, 823064423, 823287888, 823404083, 824761124, 826065445, 824385529, 823810577, 824343262, 824344788, 824975510, 824848404, 825099106, 824776001, 824828796, 825785675, 825970078, 826362762, 826057281, 827272186, 828691330, 825692673, 824906082, 826617203, 828550186, 828724594, 824952087, 825609131, 827489166, 827424240]
1833.3H27424240J23444M53796J96228m58374q87375M35791L94821N24369N18570K158737
1842.9H30884247J181640o143646J320420K527542k58408r58176P4234M39759k14234
1851.6H28853378L41721K25906L10440K44065N8212L27148l38058l55072J4496M1122
1861.3H29723358n03158J20773M15192Q21991J201019Q5220P27005j676254k557984
1869.9H28357162M40369R93805Q69141m6616M38995K35672j09558l4713R1323J81504
1879.6H31417084l79334J56327j68686j2589j49536l12576M71649M70581J502609K35520
1889.2H33231049k396927k13242O90231j3427K26364j75171r69315O43311Q62350K85111
1898.9H32170334n7984j12533J28097l63159j66473k29645j93252j0224N1270J89285
$$ y = [827424240, 827547684, 828001480, 828197708, 827739334, 826851959, 827287750, 827682571, 828206940, 828725510, 830884247, 832065887, 825922241, 827242661, 829770203, 829511795, 828553619, 828627853, 829067612, 828853378, 829195099, 829421005, 829731445, 829975510, 830033722, 830360870, 830022812, 829667740, 829682236, 829723358, 829220200, 829340973, 829756165, 830578156, 831779175, 831864395, 832591400, 830915146, 828357162, 828797531, 829791336, 830660477, 830613861, 831052856, 831288528, 831178970, 831144257, 831235580, 831417084, 831037750, 831194077, 831025391, 831012802, 830863266, 830550690, 831022339, 831492920, 832995529, 833231049, 830834122, 830620880, 831311111, 831297684, 831524048, 831348877, 830379562, 831022873, 831885223, 832170334, 832112350, 831999817, 832127914, 831764755, 831598282, 831368637, 831175385, 831165161, 831216431, 831405716]
1908.5H31405716N60455Q9722n67322O75354N1727j87149l39050j99890J295166j841125
1918.2H30943604j156693J533508J111222J053543p61490j400910p5836m5013m51355
1926.8H30750580r6131J81427K58866J24359J3962O00738n8212j78986j71966j50681
1936.5H31273956n3024o90994m23203L357J803208M41284k753144O81534J141281j26648
1946.1H31297607j97525k34375l16696k41470J21384K13317l5705k26135K70462J96533
1955.8H30847397K12860R0027m61502m10996o61163J5869L49884k4567J67771N13153
1965.4H30638733P55615m91028p35016L88871Q392o69022m77829j18408Q6823K28653
1975.1H29615784K55890J52359O5155K32086j69983l48816k32849n72968l40500l23562
$$ y = [831405716, 831966171, 832055893, 831488571, 832163925, 832215652, 832028503, 831689453, 831489563, 832784729, 830943604, 829786911, 831320419, 832431641, 833485184, 832723694, 831322784, 831246948, 831201935, 830750580, 830654449, 830835876, 831094742, 831219101, 831233063, 831833801, 831775589, 831596603, 831424637, 831273956, 831220932, 830529938, 830106735, 830110092, 831913300, 832354584, 829601440, 830282974, 831424255, 831297607, 831100082, 830865707, 830549011, 830307541, 830428925, 830642242, 830606537, 830380402, 830650864, 830847397, 831060257, 831150284, 830688782, 830277786, 829616623, 829632492, 829982376, 829957809, 830125580, 830638733, 831394348, 830903320, 830168304, 830557175, 830565567, 829896545, 829418716, 829300308, 829387131, 829615784, 829871674, 830024033, 830089188, 830321274, 830151291, 829802475, 829569626, 828996658, 828656158, 828332596]
1984.7H28332596j15051M06036L06396l0441j67541O19506M21067j255112p64389K16827
1994.3H27969894j46408k94418P4539L96652L56675o87J46942J98670r6055j75705
2004H28430099k75802l87573k88926l50723q8882O75201L76511O943L4484j78146j93558
2014.6H27759628k90298n82123j082611k68402M43115M39148N75180K21176L22495
2023.3H27537308j46561l84750k25449n62591k04392k87094O1874L60947q850K56805
2032.9H26397247L66593R3841l14102m45557m02603n05600m02298J80970J34887J15967
2042.6H25219345N97687K37579J21689j81961l29895k47650n24826l02048m48761n7144
2052.2H24084015M60968L17001M7455J21231L01361l59192l84369l28292n36271k81219
$$ y = [828332596, 828217545, 828623581, 828929977, 828899536, 828731995, 829351501, 829772568, 828517456, 827753067, 827969894, 827823486, 827529068, 827603607, 828000259, 828356934, 828356247, 828503189, 828701859, 828605804, 828430099, 828154297, 827766724, 827477798, 827127075, 827038193, 827713394, 828089905, 828096848, 828131332, 827953186, 827759628, 827469330, 826887207, 825804596, 825536194, 825979309, 826418457, 826993637, 827214813, 827537308, 827390747, 827005997, 826780548, 826217957, 826013565, 825726471, 825788345, 826149292, 826140442, 826397247, 826763840, 826857681, 826543579, 826098022, 825695419, 825189819, 824787521, 824968491, 825103378, 825219345, 825817032, 826054611, 826176300, 825994339, 825664444, 825416794, 824891968, 824589920, 824141159, 824084015, 824544983, 824861984, 824909439, 825030670, 825332031, 824972839, 824588470, 824260178, 823723907, 823442688]
2061.9H23442688j33286j17187j06278K35138L82843Q8654m54636k63824k96555q96759
2071.5H21880798l56826N0582k21786k10571L95813J76696m24804k32086j98746j26648
2081.1H20732422m02222n04761m44564l52021o5841L91464P41653P7286K60544K14691
2090.8H20648651q4228Q163o29578l84140n8517J86233K59858L96118M28772P8811
2100.4H20850143N52521J06888l42865k72446l08075q8501K79313O15768L21426M55857
2110.1H22170029J87988N2872L78112L5325l67432n49851p9269j95847k33001N2185
2119.7H21451111M28848Q29315L11127j71738q53805l21427Q6823p47299n80674j30996
2129.4H20301285N20553O12564K92893L46222L75519J88141l51792n24368l12119m8294
$$ y = [823442688, 823309402, 823192215, 823085937, 823321075, 823703918, 823792572, 823337936, 823074112, 822777557, 821880798, 821523972, 821574554, 821352768, 821142197, 821538010, 821714706, 821289902, 821057816, 820859070, 820732422, 820330200, 819825439, 819380875, 819028854, 818963013, 819354477, 820096130, 820173416, 820433960, 820648651, 820564423, 820572586, 819943008, 819558868, 819500351, 819686584, 819946442, 820342560, 820771332, 820850143, 821402664, 821509552, 821166687, 820894241, 820586166, 820497665, 820776978, 821392746, 821714172, 822170029, 822358017, 822410889, 822789001, 822824326, 822456894, 821907043, 821827774, 821631927, 821398926, 821451111, 821879959, 822709274, 823020401, 822848663, 821994858, 821673431, 821760254, 821012955, 820432281, 820301285, 820821838, 821434402, 821727295, 822073517, 822449036, 822637177, 822285385, 821761017, 821448898, 821400604]
2139H21400604m23507l19977N02777P08084M75922L00445L60108j01395r16J91193
2148.6H23093338l53928m59747n20630m2953P55539P42569L01666K28882J373j10321
2158.3H23635788p6675m22898k22091l06168r7885K23083J44806M10614J51291K49558
2167.9H23689423J62429m10156m11072k07443k91061l91922o9504n2033J72959L96957
2177.6H22588577J45569j24588J8540K33306k49633n21927p39441j55564P47605N24902
2187.2H22467346K92435M45557L85818k33612J5793L25012j02997m37469l53241O80313
2196.9H23484955O14776M4556P3776K28272N14679l052k85492k1591j94702m81949
2206.5H23974228K39105Q42590M72565Q2398k24152J5030K72140K50779m02680n48782
$$ y = [821400604, 820977097, 820657120, 821159897, 821867981, 822343903, 822644348, 823004456, 822903061, 822902145, 823093338, 822739410, 822279663, 821759033, 821716080, 822471619, 823214188, 823515854, 823744736, 823746109, 823635788, 823559113, 823136215, 822914124, 822607956, 822510071, 822733154, 822877960, 823288574, 823439865, 823689423, 823851852, 823441696, 823030624, 822823181, 822532120, 822140198, 822070694, 822018661, 822191620, 822588577, 822734146, 822609558, 822628098, 822861404, 822611771, 822089844, 821350403, 821194839, 821942444, 822467346, 822759781, 823205338, 823591156, 823357544, 823373337, 823698349, 823595352, 823157883, 822804642, 823484955, 824099731, 824144287, 824218063, 824446335, 824961014, 824957962, 824672470, 824650879, 824456177, 823974228, 824213333, 825055923, 825528488, 825610886, 825386734, 825401764, 825673904, 825924683, 825522003, 824973221]
2216.1H24973221J40304k95028k77481M60510P03430L37677j40991j98670l8833J93939
2225.8H25858078j24435l86124p9880J45188m00925j40000N06134k1972J23978K14767
2235.4H25694809M8675l35083q06961n92880n01098J60827P50580O57501J48621J73416
2245.1H25398407K08054k92817l22342m52575J10016O0959j77231K65960K82669M21906
2254.7H25503006p6675k58866k73208j74408j40610j66626K91824l04107k70844J23215
2264.4H24252701K77710L86810K77252J10321n10482j9074N9814k66342n3634O1721
2274H24576797r1171l26767L18222N15595O01806L82m54865J984k85721j42669j35270
2284.6H24578323J88599J62659j51291K61154K19345M5853r2545M45404j5716n62287
$$ y = [824973221, 825113525, 824818497, 824541016, 825001526, 825704956, 826042633, 825901642, 825702972, 825664139, 825858078, 825733643, 825347519, 825267639, 825412827, 825011902, 824871902, 825378036, 825356064, 825480042, 825694809, 825743484, 825408401, 824601440, 824008560, 823507462, 823668289, 824418869, 825076370, 825224991, 825398407, 825606461, 825313644, 824991302, 824538727, 824648743, 824709702, 824532471, 824798431, 825081100, 825503006, 825426331, 825167465, 824894257, 824719849, 824579239, 824412613, 824704437, 824400330, 824129486, 824252701, 824530411, 824917221, 825194473, 825304794, 824794312, 824775238, 824835052, 824568710, 824515076, 824576797, 824485626, 824158859, 824477081, 824992676, 825594482, 825594864, 825139999, 825141983, 824856262, 824713593, 824578323, 824766922, 824929581, 824778290, 825039444, 825258789, 825304642, 825212097, 825657501, 825641785, 825079498]
2294.3H25079498k38418k85950j16882r5902Q05817K56119n59616M4631j59683l46451
2303.9H24383163m88510M58374M27780j05285M13360P5150m5700l96423l84446j12762
2313.5H24224701J77231J58005j67695J6098k28195L59040J64871l92761N2261K01874
2323.2H24565430P9727J20087L44238j41068R46350K87323j767196j309967r26972
2331.9H22197952M96369J178054J488114R58328o42013j15815j05285p76673q13522
2340.6H23865509k50320M37545O4392o05545J34278J149063P5302k65121J139450Q23974
2350.2H26568527q80508N4168N53589L44162O63910m65088n74264J37100J874390l30735
2359.8H27945251j381149Q28018k326812k112427J343689R24377J14594J161651P83234
$$ y = [825079498, 824841080, 824555130, 824438248, 824342346, 825148163, 825404282, 824844666, 824889297, 824729614, 824383163, 823894653, 824353027, 824780807, 824675522, 825088882, 825164032, 825118332, 824721909, 824337463, 824224701, 824401932, 824559937, 824392242, 824408340, 824180145, 824539185, 824704056, 824311295, 824363556, 824565430, 824645157, 824765244, 825109482, 824968414, 825914764, 826202087, 824434891, 823124924, 822197952, 822694321, 823872375, 825360489, 826318817, 825676804, 825560989, 825455704, 824679031, 823865509, 823615189, 824052734, 824117126, 823511581, 823645859, 824794922, 824870224, 824605103, 825744553, 826568527, 825688019, 825742187, 826295776, 826639938, 827303848, 826838760, 826264496, 826401596, 828275986, 827945251, 826564102, 827392120, 825065308, 822952881, 824296570, 825220947, 825335541, 826497192, 827280426]
2368.5H27280426p16324o72531j65939R9106m80729k95715K16904K68631k15454k27661
2378.2H25090714O14624J41525N01785N34515m53796m25568j72042N25589L84674k03553
2387.8H26538467k13089K13852O31867J60370k12021n53360l72467k04315l5401L38745
2397.4H26292648r0027J37330Q5372j55792K86408J15738m07410l96194J57547k5635
2407.1H25999985k55738J48850O1035O867K40860j61896k79312m0436k69699l2730
2416.7H25417786n0049N1193J89972l08991J03303M34417J60141j38397j41449k95868
2426.4H25422058o70853k04849P0954J30539k3423K2660O03027K03094l25851m08096
2436H24819260m42047o9581L01590N0888n12619n23071K0828K77481L83149K77786
$$ y = [827280426, 826564102, 825891571, 825725632, 825824738, 825344009, 825048294, 825265198, 825533829, 825318375, 825090714, 825705338, 825846863, 826348648, 826883163, 826429367, 826003799, 825831757, 826357346, 826742020, 826538467, 826325378, 826539230, 827171097, 827331467, 827119446, 826566086, 826193619, 825989304, 825953903, 826292648, 826202621, 826339951, 826425323, 826269531, 826555939, 826671677, 826264267, 825868073, 826025620, 825999985, 825744247, 825893097, 825954132, 825960999, 826201859, 826039963, 825760651, 825720215, 825450516, 825417786, 825367737, 825418930, 825608902, 825299911, 825403214, 825837631, 825997772, 825859375, 825717926, 825422058, 824751205, 824546356, 824617310, 824747849, 824724426, 824747086, 825350113, 825553207, 825227356, 824819260, 824377213, 824307632, 824609222, 824660110, 824147491, 823624420, 823645248, 823922729, 824305878, 824583664]
2445.7H24583664j61514l3799k13851m84467l19443l34778j39541J15967M57153K86331
2455.3H23755722J33209j61209o04095j297j5717j27640m272p6981J374k3194J77079
2465.9H23052979k6856k3270O6834L5477l66974r91135l40729R6054Q0414L15399K74353
2476.5H22172546j63421j87226l6010k67716k5787l72849k78778J85166k6856J26877
2486.2H21125946l8605J89133J12152k95257j39008k33536j8768L1738j59759l13645
2495.8H20260391m42047j33667K85721K16980q4763L662L5019k41928n34439j52969
2505.5H19211960L47442J68076l03040l26080J17645j92108k4338N44510J26267m98047
2515.1H19172287p07016j8845K11411l60184m66995J7624L85208J36337R8267K31247
$$ y = [824583664, 824422150, 824388351, 824174500, 823690033, 823370590, 823035812, 822896271, 823012238, 823469391, 823755722, 823888931, 823727722, 823123627, 823122330, 823106613, 822978973, 822974701, 822897720, 822899094, 822875900, 823052979, 823026123, 823002853, 823069687, 823105164, 822738190, 821747055, 821406326, 821502380, 821582794, 821898193, 822172546, 822009125, 821821899, 821785889, 821518173, 821492386, 821119537, 820840759, 821025925, 820999069, 821125946, 821087341, 821276474, 821388626, 821093369, 820954361, 820720825, 820702057, 820733795, 820574036, 820260391, 819818344, 819684677, 819970398, 820187378, 820102615, 820106277, 820141296, 819899368, 819364929, 819211960, 819559402, 819727478, 819424438, 819098358, 819216003, 819023895, 818999557, 819544067, 819670334, 819172287, 818465271, 818446426, 818657837, 818297653, 817830658, 817848282, 818233490, 818369827, 818468094, 818699341]
2524.7H18699341l6850n90820m55323k6703j75171o3018j679J51215L88489K3193q164
2535.4H17904510J67389k72445n06592l65372l07541j97143J41907N93338J83486o2713
2545H17278824n2872m32129Q6823p5836n34592p2556j6708p7591O10O5384J24054L8376
2556.6H16331787k88238r4223J03836k67029l59650l03726Q5144K6093j58921K13013
2566.2H15288086L55759N6610l73688k21939l97263l43551J7471l37753l57666L7613
2575.9H13723679J77459J03684O73904L79334n51224m43192l45001O9504K62451p1792
2585.5H13978806m34571k08740J24359j80435K11868K36969k12326o66351p36466o3476
2595.1H12049637j74866m8523L55072l0517k89078k06375m3183L49656J06124m36859
$$ y = [818699341, 818662491, 818071671, 817616348, 817589645, 817414474, 817351456, 817349777, 817500992, 817889481, 817912674, 817904510, 818071899, 817799454, 817292862, 816927490, 816619949, 816422806, 816564713, 817158051, 817341537, 817278824, 817225952, 816793823, 816880646, 816804810, 816270218, 816197662, 816180954, 816103363, 816103973, 816169357, 816293411, 816331787, 816043549, 815949326, 816053162, 815786133, 815426483, 815122757, 815207901, 815233994, 815075073, 815288086, 815643845, 815700455, 815326767, 815104828, 814707565, 814364014, 814381485, 814043732, 813686066, 813723679, 813901138, 814004822, 814678726, 815058060, 814506836, 814063644, 813718643, 813788147, 814050598, 813978806, 813544235, 813335495, 813459854, 813279419, 813491287, 813728256, 813515930, 812849579, 812113113, 812049637, 811874771, 811826248, 812181320, 812150803, 811861725, 811655350, 811612167, 811961823, 812067947, 811631088]
2604.8H11631088m98276o10122j3199L37524L41950L1738m52118K17667j11008m98581
2614.4H10376663j77688j08719k83356o25534R5749K54211L06244K68784m93698k16751
2624.1H09395905P4157j00250n62668o69555j34659J74713o7444k66418R5214J10093
2633.7H08049088J18713J68991l4866m23279n97687m44641m24271o4010R2544J38016
2643.4H06578598q850m1885J36261r0790k9984m38461m50592j13449m73633l95203
2653H04672012J39771M32129J9455k84653k33688J1673r4071n53284m37622k15683
2662.6H03456039k2659L6087M86374K49405o54831l81241O6529J32751j90353k15989
2672.3H02962112l45535l36304J90888o5689n3024k06833j39466K64511l95050p16476
$$ y = [811631088, 811132812, 810522690, 810509491, 810847015, 811188965, 811220703, 810768585, 810986252, 810875244, 810376663, 810198975, 810090256, 809806900, 809181366, 809277115, 809531326, 809837570, 810106354, 809612656, 809395905, 809470062, 809369812, 808807144, 808137589, 808002930, 808177643, 808110199, 807843781, 807938995, 808049088, 808167801, 808336792, 808301926, 807878647, 807280960, 806836319, 806412048, 806348038, 806440582, 806578598, 806569748, 806527863, 806664124, 806573334, 806543350, 806104889, 805654297, 805540848, 805067215, 804672012, 804811783, 805243912, 805263367, 804978714, 804745026, 804756699, 804662628, 804109344, 803671722, 803456039, 803433380, 803469467, 803955841, 804205246, 803550415, 803169174, 803235703, 803368454, 803178101, 802962112, 802616577, 802280273, 802471161, 802405472, 802352448, 802145615, 802006149, 802270660, 801875610, 801159134]
2681.9H01159134k06375R384m61807j37863M90417K60849L8376j29852k91825l25393
2691.6H00405045j96076l18527m29916l78876l815M59747Q5678k21862l10440l37601
2701.2G98753357l41339L8376L42636l40195m27780j78452k32086j62887K61840K78397
2710.9G97991867m31518l68653k38418j45798l4561l37830n38483n04684O3934K64359
2720.5G95720215K18429L38746J18103o714l1510n42373r39255l28980J35346q1787
2730.2G94600220m04892l49274J9760J27411n646l67736m96064n53512l41416N4856
2739.8G92283707P1335P7362k91901j46790L95508K41089J55106J4495m54940n30854
2749.4G91814117j97906k70157n83191m20379Q2473J34507J42593K89078k96326n47104
$$ y = [801159134, 800952759, 800962143, 800500336, 800362473, 800852890, 801113739, 801152115, 801022263, 800730438, 800405045, 800208969, 799890442, 799460526, 799081650, 799077835, 799537582, 799623260, 799401398, 799090958, 798753357, 798412018, 798450394, 798793030, 798452835, 798025055, 797846603, 797614517, 797451630, 797713470, 797991867, 797560349, 797191696, 796953278, 796807480, 796772919, 796435089, 795896606, 795391922, 795455856, 795720215, 795938644, 796277390, 796395493, 796388779, 796357269, 795814896, 794875641, 794546661, 794682007, 794600220, 794195328, 793846054, 793865814, 793993225, 793987579, 793619843, 793123779, 792570267, 792228851, 792283707, 792355042, 792432404, 792140503, 791993713, 792389221, 792630310, 792785416, 792799911, 792344971, 791814117, 791616211, 791346054, 790762863, 790342484, 790424957, 790559464, 790702057, 790991135, 790694809, 790147705]
2759.1G90147705k07291l38058p25479l16620K66342n646J3123M2953k23083k94266
2768.7G88359680j89285n34q4152k25449n60989n12085j81961r9488j13449l81088
2778.4G86011200k05002J1063k65503m29917l36303l73993l43399j23673O5460J40305
2788G84150238k25830l0747o2789o65131n06821l15399k12784o00586m02298N44053
2797.7G81671906K2735p90100m50897j1215l79029m79126j75705j60675n32226r16291
2807.3G77799377l39584j8997j74713K3422m349l30658l39813j05362l92151n68161
2816.9G75549011o39343n09110j02539n19790p26395j54037Q6822k43378m07257k27584
2826.6G72106400l61023p64771p86514m33502m34037n30090k0218R4299m71115j20773
$$ y = [790147705, 789940414, 789602356, 788876877, 788560257, 788826599, 788820953, 788834076, 788877029, 788653946, 788359680, 788170395, 788169861, 788085709, 787860260, 787299271, 786787186, 786605225, 786505737, 786392288, 786011200, 785806198, 785817261, 785551758, 785121841, 784785538, 784411545, 784068146, 783944473, 784009933, 784150238, 783924408, 783893661, 783830872, 783165741, 782658920, 782343521, 782130737, 781530151, 781127853, 781671906, 781694641, 780904541, 780453644, 780442429, 780063400, 779584274, 779408569, 779247894, 778715668, 777799377, 777459793, 777440796, 777266083, 777289505, 777285156, 776954498, 776614685, 776509323, 776117172, 775549011, 774909668, 774400558, 774298019, 773778229, 773051834, 772897797, 772984619, 772741241, 772333984, 772106400, 771745377, 770980606, 770194092, 769760590, 769326553, 768796463, 768776245, 768870544, 768399429, 768278656]
2836.2G68278656j85394j169434j257095j074753r12094j172409p85752k83279r31549
2844.9G60506897m77219r82437j893616j117248j118774j429291j425171j060257m98962
2853.6G50503922l00904K00577Q02078O99387j755n69916r46808q53424m97665j97830
2863.2G48837662M9896N3177k33612p50962n97915m58908q79593o65970q0185k87399
2872.9G44986191q87146o97479k87171r4986M1657Q2245Q7585k48947q13980o82831
2882.5G41485138j08032k76795n22308q08640n74646o027m93240m13742l75214n59769
2892.2G37346725k69317n79376r77097r61990k71683j76773m27857j93557o32172r24911
2901.8G31931992l65372O6833o30264q95767k46430k28042k81525m04129o66962m08782
$$ y = [768278656, 768093262, 766923828, 765666733, 764591980, 763679886, 762507477, 761721725, 761438446, 760506897, 760029678, 759047241, 757153625, 756036377, 754917603, 753488312, 752063141, 751002884, 750503922, 750203018, 750403595, 751205673, 751905060, 751903305, 751333389, 750386581, 749533157, 749035492, 748837662, 748887558, 748940735, 748707123, 747956161, 747358246, 746899338, 746019745, 745353775, 745273590, 744986191, 744099045, 743401566, 743114395, 743019409, 743061066, 743143311, 743230896, 742981949, 742167969, 741485138, 741377106, 741100311, 740578003, 739769363, 739194717, 739188690, 738695450, 738281708, 737906494, 737346725, 737077408, 736498032, 735520935, 734558945, 734287262, 734110489, 733682632, 733489075, 732856903, 731931992, 731566620, 731633453, 731003189, 730107422, 729860992, 729632950, 729351425, 728947296, 728280334, 727871552]
2911.4G27871552l50190o22329k21863n72510j223221r23996j325836j211548m45633
2920.1G20974426j58691l57437l96881L4332l47595l2196K22854j94626p8659k92129
2929.8G19373398j64108J82952L80555J02234O2255O53382M88891J47477p1183J16043
2939.4G21271896L56675J65557M42124N24902O9046L19672O80771K74429k40173r02710
2949.1G22962189p52335l4637P5302j55869n22079k02790L2807k1744L9673J4725j7777
2959.7G21417465m02908l44620k63901l29361Q6823N57785O45294O34308R66339R74732
2969.3G23941956Q95767M26788j33896J47171N14756M10156L58963R11636J078873
2978G28552170J221924P15637q7738L58276K67945K07672J63726K02256M92706K20413
$$ y = [727871552, 727521362, 726899033, 726677170, 726104660, 724881439, 723957443, 722631607, 721420059, 720974426, 720815735, 720458298, 720061417, 720095749, 719748154, 719715958, 719938812, 719744186, 719665527, 719373398, 719209290, 719392242, 719772797, 719875031, 719937286, 720590668, 721079559, 721227036, 721155853, 721271896, 721628571, 721794128, 722236252, 722761154, 722830200, 723149872, 723830643, 724105072, 723864899, 722962189, 722209854, 722175217, 722250519, 722094650, 721572571, 721369781, 721402588, 721380844, 721420517, 721435242, 721417465, 721014557, 720669937, 720406036, 720076675, 720163498, 720721283, 721366577, 722000885, 722967224, 723941956, 724837723, 725264511, 725130615, 725277786, 725792542, 726202698, 726561661, 727473297, 728552170, 729774094, 730489731, 730401993, 730760269, 731028214, 731235886, 731399612, 731601868, 732094574, 732314987]
2987.6G32314987O58112P68890P57065P04803J4878o2790j45188l36074n8136J00326
2997.3G34716873j53274J26648L01132J0910M05426M91409M2801m40369p40890m23660
3006.9G34337006o7444L79181P85446Q4762l11279J66855k8610j63803l04871o06384
3016.6G34270859q95920q63953k07367j55716q9263m6540J60446M63868j61744p74765
3026.2G31699905p43560k79465n68771m14277r8800o84967k10953K40631J58463m64173
3035.9G28634033n68466J45416k89230q98361q88367n62515k62223L76130K27508o74896
3045.5G25239029j26724J76315k22702n65643j119080j368332p51114O3401N0964Q9111
3055.1G21465225j43661o73828l34092r4909n66407l50112k27890q51212o51093o71234
$$ y = [732314987, 732973099, 733741989, 734499054, 735203857, 735218735, 735155945, 735010757, 734674683, 734616547, 734716873, 734563599, 734690247, 734991379, 735002289, 735407715, 735899124, 735941925, 735501556, 734760666, 734337006, 734269562, 734648743, 735434189, 735518951, 735207672, 735374527, 735345917, 735182114, 734877243, 734270859, 733374939, 732510986, 732303619, 732147903, 732058640, 732012100, 732172546, 732636414, 732474670, 731699905, 730956345, 730676880, 730108109, 729693832, 729595032, 728910065, 728699112, 728939743, 729098206, 728634033, 728065567, 728210983, 727921753, 727023392, 726135025, 725572510, 725310287, 725686417, 725913925, 725239029, 725112305, 725288620, 725065918, 724500275, 723381195, 722012863, 721261749, 721325150, 721376114, 721465225, 721321564, 720647736, 720313644, 720218735, 719652328, 719302216, 719074326, 718223114, 717572021, 716900787]
3064.8G16900787k72979M75769J84021j87378n44663k19574j38015q09021j108628
3073.5G14280319n43976L08381R3688j51977l33786k83966L8376J04217k07214q76236
3083.1G12427826n43900o34079q56628o68564n77774K05002J21155k4338M9286m57916
3092.7G09040070n78156n39627p84988j098557m54636N1346K29M0283k61001r7656
3102.4G05317307j63041o36749n53207o50025n60608m72641q82644n93109q5755j60446
3112G00559082m18777l48511j91803m80042m30984m69132p02514o33621n36118n45425
3121.7F95802155q37250k88620K16064k38189p06025p28073m47235q16955r51767o01807
3131.3F90402298m58221m14963k88162j30082o21643o39877n13763j035996r09042
$$ y = [716900787, 716627808, 717103577, 717287598, 717100220, 716555557, 716335983, 716197968, 715388947, 714280319, 713736343, 714044724, 714138412, 713986435, 713652649, 713368683, 713407059, 713511276, 713304062, 712427826, 711883926, 711249847, 710393219, 709724655, 709146881, 709351883, 709473038, 709448700, 709497986, 709040070, 708461914, 707922287, 707137299, 706038742, 705584106, 705635452, 705635681, 705675964, 705414963, 705317307, 705154266, 704517517, 703964310, 703314285, 702753677, 702281036, 701398392, 700805283, 700719528, 700559082, 700140305, 699791794, 699599991, 699119949, 698688965, 698219833, 697517319, 696883698, 696347580, 695802155, 694964905, 694676285, 694892349, 694654160, 693948135, 693220062, 692772827, 691955872, 691004105, 690402298, 689944077, 689529114, 689240952, 689110870, 688489227, 687849350, 687335587, 686299591, 685390549]
3140F85390549p01371r20410p68814n95627k74810J28097m23584n59387n98526n77240
3149.6F80098877r1400p75299q44651j025238j300506k76108k16217p07855n67093
3158.3F74294510m35791j241608j247330o02188o90078n41001o30417k62146R92k31399
3168F68413544o36292q98208o09971q38165p95135r34067p84912o21796p02667l52860
3177.6F61239471o52313j51214m74930j070557m81491o43616r16214j456527j091080
3186.3F54301529k08664m63028n07431l72391p59659n40390m41665j015396p43943
3195F49248962j030578q20694l75748q29162o76499p65152M349R384p61185j242218
3204.6F42761459j538467m14734p59277j052704o69212o65207O4811J43509r3422o82563
$$ y = [685390549, 684689178, 683768768, 682999954, 682404327, 682129517, 682257614, 681834030, 681274643, 680676117, 680098877, 680007477, 679232178, 678387527, 677362289, 676061783, 675785675, 675569458, 674861603, 674294510, 673858719, 672617111, 671369781, 670767593, 670077515, 669536514, 668906097, 668643951, 668644943, 668413544, 667777252, 666879044, 666269073, 665430908, 664635773, 663701706, 662916794, 662294998, 661592331, 661239471, 660587158, 660435944, 659961014, 658890457, 658408966, 657765350, 656849136, 655392609, 654301529, 654092865, 653629837, 653122406, 652750015, 651990356, 651449966, 651008301, 649992905, 649248962, 648218384, 647397690, 647021942, 646192780, 645516281, 644751129, 644755478, 644764862, 644003677, 642761459, 641222992, 640808258, 640048981, 638996277, 638327065, 637661858, 637726669, 637870178, 637776756, 637094193]
3214.3F37094193q36945p45277j053772r61953q62922q68264q47816m72069k91443
3222.9F30153732j11351m11071p67441m49791o02188r72481j240807p06138l03040
3231.6F24589424k11906m32434p34482k06108o20194r70535q41370m67262n43594j130867
3241.3F18430672j091042o61850P85713k38838j356850k594j68266p19833q05779j76315
3250.9F13995018p98225j634865p17278m45099m84428n36766k38380k76871j69373
3259.6F08693733j05285r68667j242828j199646m31824k51693l21617r6207m51775
3268.3F03624191j18065l08799p22313k77367o1493j005401j211281m23088p39174
3276.9E98757210n65720p3776n9013o45791q90579j17874m28352q46710q87261j036644
$$ y = [637094193, 636257248, 635511971, 634458199, 633496246, 632633324, 631765060, 630917244, 630445175, 630153732, 630042381, 629631310, 628863869, 628414078, 627811890, 626839409, 625598602, 624892464, 624589424, 624377518, 623945084, 623210602, 623004494, 622384300, 621413765, 620572395, 620105133, 619561539, 618430672, 617339630, 616677780, 617463493, 617224655, 615867805, 615865211, 615696945, 614977112, 614171333, 613995018, 613196793, 611561928, 610844650, 610399551, 609915123, 609378357, 609139977, 608863106, 608693733, 608588448, 607619781, 606376953, 605177307, 604745483, 604493790, 604172173, 604075966, 603624191, 603506126, 603197327, 602475014, 602197647, 602136154, 601130753, 599919472, 599496384, 598757210, 598191490, 598117714, 598058701, 597412910, 596522331, 596404457, 595976105, 595129395, 594242134, 593205490]
3286.6E93205490k80914K67372m79279m84962L02353m46663q70247l71742n25360n13459
3296.2E89802589o81228j113358n37719K46086K12936m80003j066704n83763n56679
3304.9E85242157j011276m91448k90756q98476r88311l06511k63367m69856p77054
3313.6E79745102q93478k75765q73985j300316l69225o7711n67665p55691q14743p04918
3323.2E73121605l29056n77392p53022j374397j120377m05883r57756m40445m47007
3331.9E66716270p24983q45489q55789R6054n96085j379929j176986r11446j194801
3340.6E59126816j281090o81686m85573M3793r70459j309395l42980q85925j016808
3349.3E52196693r65576r00993j039314j089783o10352n64155r21822j217270m21295
$$ y = [593205490, 592924576, 593191948, 592712669, 592227707, 592530060, 592083397, 591213150, 590841408, 590316048, 589802589, 589121361, 588008003, 587470284, 587716370, 587929306, 587449303, 586382599, 585798836, 585242157, 584230881, 583739433, 583448677, 582550201, 581561890, 581255379, 580992012, 580522156, 579745102, 578851624, 578575859, 577701874, 576401558, 576032333, 575964622, 575396957, 574641266, 573826523, 573121605, 572792549, 572215157, 571462135, 570087738, 568967361, 568561478, 567603722, 567163277, 566716270, 565991287, 565145798, 564290009, 564386063, 563789978, 562410049, 561233063, 560321617, 559126816, 557845726, 557164040, 556678467, 556722260, 555751801, 554442406, 554099426, 553213501, 552196693, 551231117, 550330124, 549290810, 548201027, 547590675, 547026520, 546104698, 544887428, 544466133]
3357.9E44466133j04904q01735j460190j518860j017837n19180j45684p21054j197128
3366.6E36979561j432381j197014n96046p76329n62439m91982j076736j568871r61837
3375.3E28315926l89023p13577l96538k50817o52923j167069q28514n87272j270562
3384E22059631p43522l01667o70738n95131j48735k89840p31659j37482o19316j530724
3393.6E16290817j82533P5417r78966q29430p62825m59595K60086m57839r88541j19972
3403.3E11846619l4714m63867k95105o39992p15256o93588n61752J59568j18675m69780
3412.9E08013458k86598K0218l66249p73773m43459o68640l18680m9362j47591q8005
3422.6E04891319p5416K01950J68648K80914O6528j23253l51486k49863k38609k90031
$$ y = [544466133, 544361229, 543559494, 542099304, 540580444, 539562607, 539043427, 538897743, 538176689, 536979561, 535547180, 534350166, 533754120, 532977791, 532415352, 531923370, 530846634, 529277763, 528315926, 527926903, 527213326, 526816788, 526565971, 525913048, 524745979, 523917465, 523330193, 522059631, 521316109, 521014442, 520343704, 519748573, 519599838, 519309998, 518578339, 518440857, 517821541, 516290817, 516108284, 516183701, 515204735, 514375305, 513612480, 513152885, 513412971, 512955132, 511966591, 511846619, 511811905, 511348038, 511052933, 510412941, 509697685, 509004097, 508442345, 508601913, 508483238, 508013458, 507726860, 507747078, 507380829, 506607056, 506163597, 505494957, 505176277, 505126915, 504979324, 504891319, 504815903, 505017853, 505186501, 505467415, 505533943, 505410690, 505059204, 504809341, 504570732, 504280701]
3432.2E04280701K89459m68979K70233O88362m17518l8834L6392K69432M29993M31747
3441.8E05770988l86772k39105N20592L64189J256828n61256p40624J380730J123543
3450.5E08489113j46485o40869Q15621N87005N68428J110650K88238L95813N08423
3459.2E11975937Q03337P16515K81448m26674K60849J203156O53953J155930N84144
3467.9E17208595j26648J42670R30595J403160L15743K17133M38995K85339J86692
3476.6E21002274M74586J184616J646500P71332m1085M44298j10168Q64105R33723
3485.2E27170181L56598J305046N74913N89600P96928P46994R07441P39288Q99696
3493.9E34086685R30519O88973l85437K78778J113052J093216J610756J710739J137123
$$ y = [504280701, 504570160, 504101181, 504371414, 505059776, 504642258, 504603424, 504639816, 504909248, 505339241, 505770988, 505384216, 505145111, 505665703, 506029892, 507286720, 506725464, 505984840, 507365570, 508489113, 508342628, 507701759, 508517380, 509104385, 509672813, 510783463, 511071701, 511467514, 511975937, 512779274, 513495789, 513777237, 513350563, 513611412, 514814568, 515468521, 516624451, 517208595, 517081947, 517224617, 518155212, 519558372, 519874115, 520091248, 520530243, 520815582, 521002274, 521476860, 522661476, 524307976, 525079308, 525038223, 525482521, 525372353, 526236458, 527170181, 527526779, 528831825, 529406738, 529996338, 530793266, 531540260, 532447701, 533186989, 534086685, 535017204, 535706177, 535320740, 535599518, 536712570, 537805786, 539416542, 541127281, 542264404]
3502.6E42264404m51431l84026P47872J190452Q50792R11522Q9073m74548K029190
3511.3E46773300J449967O71920J260186N98793N40466O19774J004028Q63648N14640
3520E54296722L45574J333198J553116l11012Q73184J980210J496772M95148L23029
3528.6E62385941M36058O50787R32426J136971J680717P24183J882247J033707j160087
3537.3E69702950J026535J093673R35784R55581J975479J430588J09291J137505J051407
3546E79418793J308861q16269J355400K305336J607208K407608j482277N13802J361808
3554.7E87980270J308136J966362J41755K063560J794739J030235N47028J671600J625824
3563.4F00129509K54440M319001J228370j814194r20143J2322M474373K267456Q26874
$$ y = [542264404, 541812973, 541428947, 542176819, 543367271, 544218063, 545129585, 545218658, 544744110, 546773300, 548223267, 548895187, 550155373, 550754166, 551294632, 551914406, 552918434, 553782082, 554296722, 554642296, 555975494, 557528610, 557217598, 558090782, 560070992, 561567764, 562062912, 562385941, 562821999, 563472786, 564405212, 565542183, 567222900, 567947083, 569829330, 570863037, 569702950, 570729485, 571823158, 572758942, 573714523, 575690002, 577120590, 577229881, 578367386, 579418793, 580727654, 579911385, 581266785, 583572121, 585179329, 587586937, 586104660, 586618462, 587980270, 589288406, 591254768, 591396523, 593460083, 595254822, 596285057, 596832085, 598503685, 600129509, 600383949, 604702950, 605931320, 604117126, 603196983, 603209305, 607683678, 609951134, 610778008]
3572F10778008J344375J749115O83060J170921K408104K45705K203254J692086L75099
3580.7F22649727J880417J884842J440735R97047M302177K151566j639099M77791j568947
3589.4F32576256L702163L487931K386894J197891L36457L215103j439896J726532
3597.1F47189331L589172N97840L110199N02014N54886K589721J222992J800156L107224
3605.8F64263535K214813j199036L464508j15433p43866P742310J215286k990875M129257
3614.5F77980499j146774L390350N134888n13382K01035j460419K73971L364335L431472
3623.1F90655975K479554K121353J892013K539215P656479R17359j3166047L329621
3630.9F98425522M244766N784454J922913k592926J916504L628158L291169M80804
$$ y = [610778008, 612122383, 613871498, 614554558, 615725479, 618133583, 618379288, 620582542, 622274628, 622649727, 624530144, 626414986, 627855721, 628852768, 633154945, 635306511, 633667412, 634145203, 632576256, 636278419, 639766350, 642153244, 643351135, 643687592, 646902695, 645462799, 647189331, 650778503, 651376343, 654486542, 654988556, 655543442, 658133163, 659356155, 661156311, 664263535, 666478348, 665279312, 668743820, 668628387, 667884521, 675626831, 676842117, 673851242, 677980499, 676833725, 680224075, 685358963, 684845581, 685046616, 683586197, 683860168, 687224503, 690655975, 693135529, 695256882, 697148895, 699688110, 707344589, 708261948, 695095901, 698425522, 702670288, 708454742, 710377655, 707784729, 709701233, 713329391, 716620560, 717101364]
3638.6G17101364L16467J468125K434768R69773l81622K627029L867874O360703j27488
3647.3G34636993n039291N924072N5619n073166k816849M826507M467621L983689M912872
3655.9G45878067r106064J100617N407486J556549R85336o17294J404113O68793P49054
3664.6G48026657J467590P76062M389267K364808n53360K061538p369003J79138P262268
3673.3G58604965Q421173q73718j8784485K854614P237015M325867k534256l87268
3681G58863907K959061J842346J038665l32641n47409L427276N530167r282684l134232
3689.7G60364456P813950o583100n59463N171661Q47016J193466n28870q37250Q28705
3698.4G67710571j71890K679520M276046n447769l779602M202347J308746J09406N75104
$$ y = [717101364, 717417831, 718885956, 721320724, 722290497, 721908875, 724535904, 728403778, 734764481, 734636993, 729597702, 735521774, 735577393, 730504227, 727687378, 732513885, 736981506, 740965195, 745878067, 736772003, 737872620, 743280106, 744836655, 745821991, 745204697, 746608810, 747277603, 748026657, 749494247, 750270309, 754659576, 757024384, 756471024, 758532562, 751163559, 751342697, 758604965, 767026138, 766152420, 747367935, 750222549, 757459564, 761785431, 759251175, 758863907, 761822968, 763665314, 764703979, 764371338, 763823929, 767251205, 772781372, 763498688, 760364456, 768178406, 761595306, 761035843, 766207504, 767054520, 768247986, 767719116, 766881866, 767710571, 767538681, 770218201, 774494247, 769046478, 765266876, 769469223, 770777969, 770887375, 771462479]
3707G71462479K877655M125061p007828N112839N651855j4876785M010773M026870
3714.8G75382919p63778K53601L029632J685868m316864K21176N924530k125855n331039
3723.4G73960190M256363J078415r25446l327866n416M593963J234207N291520k501374
3732.1G83654556q054199R280624k90527j0054550K037582J205902j037445K748642
3739.8G79490585M389115l664398K192077J1475678j0170136j6575699J0566712O484680
3747.5G84188614O755218k932205j1469650J0084152q464126p501603O061783M620590
3755.3G81342773L755417m865951K503204N946503q694229k540589L700333J143036
3763G82290497L04870L075180l389358m771118M433746N747833l09219r719543J445770
$$ y = [771462479, 774340134, 778465195, 771457367, 776570206, 782222061, 767345276, 771356049, 775382919, 774619141, 774872742, 777902374, 779588242, 775271378, 775492554, 781417084, 779291229, 773960190, 778216553, 779294968, 778369522, 775041656, 775036240, 779630203, 780864410, 786155930, 783654556, 775600357, 784880981, 784590454, 774535904, 776573486, 777779388, 776741943, 779490585, 783879700, 780215302, 782407379, 793883057, 783712921, 767137222, 777703934, 784188614, 790943832, 788011627, 776541977, 786626129, 778162003, 770660400, 776722183, 781342773, 785098190, 780232239, 782735443, 788681946, 779987717, 777447128, 781147461, 782290497, 782595367, 785670547, 782281189, 777510071, 781943817, 787691650, 787382431, 777662888, 779108658]
3771.7G79108658K703781J6022R00650m89807P23266J432038L938598Q14133q338471
3780.3G80808868J173859J446686O99005K097626k779770j115952O02951J35575K65655
3789G83334503k53525J37864Q1710J075745k35291P57905L443908l462448l892441
3797.7G80987930K186814M447097O723023o502686j1618576L005982K753906N647354
3805.4G87630844O227570j1345444n396042M489822K434693Q62656K11105P3776J417770
3814.1G86606750O199341j132278j5352173N573807O018219M749527K279968j9223633
3821.8G75719528J399689N434875K266236K350311j18637m628525r69925J827164M076996
3830.5G87357712J676636q694611L861999Q199616o443787r02404Q472518j0056533
$$ y = [779108658, 781812439, 781828461, 782729111, 782239304, 782962570, 784394608, 788333206, 789147339, 780808868, 781982727, 783429413, 784128418, 786226044, 783446274, 782330322, 782933273, 783068848, 783334503, 783080978, 783218842, 783300552, 784376297, 784141006, 784898911, 788342819, 784880371, 780987930, 783174744, 787621841, 794344864, 787842178, 776223602, 779229584, 781983490, 787630844, 793858414, 782512970, 777116928, 781606750, 784041443, 784904099, 785115204, 785188980, 786606750, 792806091, 791673813, 776321640, 781895447, 787913666, 792663193, 794943161, 775719528, 777119217, 782554092, 784820328, 787170639, 787052002, 782423477, 781453552, 783280716, 787357712, 789034348, 780339737, 784201736, 792401352, 785957565, 785055161, 793527679, 783471146]
3838.2G83471146n037156Q268738o313171o97785O156693k437592k732086K961579
3845.9G83640366J769332M02604J804351p97119J668473M722824p802735R46656j6185074
3854.6G70169678K424469J1682968n80139j675110K033233J937638K736282n559387
3862.3G83169632M60587P665100p435837o194840M584961N533371O230927p399979
3870G86613922r804840K804031O431580L443375j0656052J177979L820495K47345K822952
3878.7G86900787M480744o720581o796112O844253N71289J041870M752045j3491363
3886.4G77582932Q25729M049911J707840N174942r89837j0383301J219330M052810
3894.1G83240356q77761J047287O00433K629776J813965j0336457O125412L565903
$$ y = [783471146, 778433990, 786702728, 780389557, 779691772, 785848465, 783410873, 780678787, 783640366, 785409698, 785812302, 787616653, 786819534, 788488007, 793210831, 785408096, 786354752, 770169678, 772594147, 784277115, 783696976, 782021866, 784055099, 785992737, 788729019, 783169632, 783630219, 791295319, 783859482, 777664642, 782249603, 787782974, 794013901, 786613922, 776809082, 779613113, 786044693, 789488068, 778832016, 780009995, 783830490, 784077835, 786900787, 791381531, 784660950, 777864838, 784709091, 785280380, 786322250, 791074295, 777582932, 778408661, 782458572, 784166412, 789341354, 788351517, 777968216, 779187546, 783240356, 782362595, 783409882, 784010315, 786640091, 788454056, 778117599, 784243011, 787808914]
3901.8G87808914m848099M422608m433212k570725l4180R74579K695160n99747n35278
3910.5G82880020J74561J044006K99683l99018J557160K218780m168396n161895M690475
3919.2G83135376J015167l935470K459030J976623J146088k634659l067627J820984
3926.9G81915512J353226J547622p61947o33087J417770l480072j729736J844482Q06122
3935.6G82279892Q55865L54844p06330N3101m53263R36814J522751m054489n87235
3944.3G80201950J913910J007156J225357k500839N0354K5330k643814J455536J216735
3953G81951675O7597j0986M69818P22656j31378L62243j087188p5074N92728j773300
3962.6G81088791J93863J053009j99661P6751O32706R80682l02581j446686L9902L39431
$$ y = [787808914, 782960815, 787383423, 782950211, 780379486, 780345306, 781319885, 784015045, 783415298, 782880020, 783054581, 784098587, 784398270, 783999252, 785556412, 787775192, 783606796, 778444901, 783135376, 784150543, 780215073, 782674103, 784650726, 785796814, 783162155, 780094528, 781915512, 783268738, 784816360, 784054413, 783421326, 784839096, 781359024, 779629288, 781473770, 782279892, 783135757, 783490601, 782784271, 782837372, 782384109, 783320923, 784843674, 780789185, 780201950, 782115860, 783123016, 784348373, 781847534, 781897888, 781923218, 779279404, 780734940, 781951675, 782019272, 782008286, 782478104, 783200760, 783069382, 783431625, 782344437, 782269363, 782862091, 781088791, 781282654, 782335663, 782136002, 782212753, 782845459, 783826141, 783523560, 782076874, 782116776, 782456207]
3972.2G82456207j71661L84903n1727o21567n63431J80283O41937L2272n79681k25678
3981.9G81481857M81491p63p3852o8512m81415j95770N14374R73053k5483o27899k92053
3992.5G81685028O22940J050797o34385o14547L45459k13623k02027J06583
4000.2G82146225
$$ y = [782456207, 782284546, 782669449, 782617722, 781996155, 781432724, 781613007, 782254944, 782287216, 781707535, 781481857, 781963348, 781962585, 781888733, 781820221, 781338806, 781143036, 781657410, 782630463, 782604980, 781977081, 781685028, 782307968, 783358765, 782724380, 782109833, 782455292, 782241669, 782039642, 782146225]
##END=$$ End of the data block
