##TITLE=$$ Begin of the data block
##JCAMP-DX=5.00 $$ ACD/SpecManager v 10.08
##SPECTROMETER/DATA SYSTEM=Varian
##DATE=18 Dec 2012 10:13:08
##DATA TYPE=INFRARED SPECTRUM
##DATA CLASS=XYDATA
##ORIGIN=
##OWNER=
##NPOINTS=3735
##FIRSTX=399.26403809
##LASTX=4000.35498047
##MAXX=4000.35498047
##MINX=399.26403809
##MAXY=83.41976929
##MINY=31.28093910
##XFACTOR=1.0000000000
##YFACTOR=0.000000100000000
##FIRSTY=69.45234680
##DELTAX=0.96440572
##XUNITS=1/CM
##YUNITS=TRANSMITTANCE
##XYDATA=(X++(Y..Y))
399.3 694523468 689607315 689560013 693840561 694879837 690603867 687122879 694798431 695573425 695502701
407.9 695502701 700924988 694366455 691617584 695874176 694191513 689135437 688320465 693044586 695185013
416.6 695185013 696598511 704619598 707723083 707462234 701204605 689390640 682821655 684396744
424.3 684396744 687453918 690332489 691513672 692556305 692263107 696561966 701749878 697834473 692622223
433 692622223 690687332 689019165 689068680 690673141 690040054 689597855 689730225 694145889 702185364
441.7 702185364 698826218 687133560 683899460 690518951 693679581 687555542 685197067 688656006
449.4 688656006 690075226 691762848 693170395 687072601 685457458 686646118 685492706 681083298
457.1 681083298 675355377 680593719 683492737 686686172 686473465 685832977 687456207 684681168 684281464
465.8 684281464 680693130 674353867 676337967 681461945 686258163 689347916 687674561 685358200
473.5 685358200 684279633 682558594 682366867 679260330 679916534 682839966 678672409 682717438 690718994
482.2 690718994 691135635 689463196 688860550 687859344 684971848 684731750 684607086 684134445 686820984
490.9 686820984 690506897 689813690 688221664 688733902 688291016 690560684 690163269 685625000 683670044
499.6 683670044 682891541 684295425 683810043 683130493 686278915 689084167 687680130 683484879 683308334
508.2 683308334 681320267 675240860 674080887 676632080 675010300 673820267 677224503 679856873
516 679856873 679933319 678615112 677067795 672466965 668174667 666841354 668450623 670854797 669586182
524.6 669586182 669507980 670745392 672210464 673141022 670453415 667340851 665433197 665991745 666959763
533.3 666959763 666476212 667126999 670688171 672689438 672325058 671581497 669434662 669934845 669882050
542 669882050 667695770 667392120 667980118 669464188 670926132 673397446 674302368 674440536 675229111
550.7 675229111 674083786 674163208 674462509 673834457 673428574 674155121 675119247 675515442 676696548 676867905
560.3 676867905 675653610 673996887 674163818 673704987 671502762 671490707 673153381 677243042 680143356
569 680143356 679597473 678405762 676606140 675072632 673335342 671667709 671611176 672457199 670949097
577.7 670949097 670961151 674083939 675441513 675169373 675091095 674913864 672839127 670152893 668889618
586.4 668889618 669138794 670646973 672120056 674648972 676072845 675950775 675940552 674738464 671750183
595 671750183 669438095 669378433 669080658 668601074 667866821 668259506 668198853 666123886 664646606 661072845
604.7 661072845 656811371 651426620 644996719 638917198 629621468 619454613 609099426 599847641
612.4 599847641 590022964 581195641 575416794 572598457 572841835 569917336 566871834 562772255 556282539
621.1 556282539 548288918 540984344 538142395 538706932 546175499 557088203 570362854 583799248
628.8 583799248 595743790 604740524 609370651 612880478 612347946 609297028 604493179 597344704
636.5 597344704 591386452 587549362 586483345 589325638 598544197 611462059 626876831 641775513
644.2 641775513 656117325 668634949 677355347 683442841 687322693 689793625 690656128 691676102
651.9 691676102 694149704 694985123 695218735 697622833 700398102 702248306 703834839 704654007 705049820
660.6 705049820 704405899 702716751 702969284 704411316 706609802 710102081 712210617 707587814 710077515
669.3 710077515 713524933 713637619 712896652 712109756 710631943 710571899 711035767 713007355 715617065
678 715617065 717375183 719563675 719929886 719154205 718180466 716969986 715950317 714421463 713989334
686.7 713989334 715336609 716750259 716848297 717055206 716914749 715236588 713433914 710880508 708218536
695.3 708218536 706532135 705598679 705698624 706763535 708111267 708549118 708705063 709600525 709720078
704 709720078 708168869 706748047 706976776 707428284 708214951 711108551 714137192 716654053 718711700
712.7 718711700 719383316 720826569 721971817 721726532 722065735 722387619 722918625 724191895 726483536
721.4 726483536 729151459 730753937 731871033 732296524 731287994 729309845 727595901 725694275 724018707
730.1 724018707 724150085 724623337 725761566 727495346 728195419 727500534 726376877 725623474 724034424
738.7 724034424 722297821 721424713 722012482 723769684 725654221 727475891 729401245 731483994 731874237
747.4 731874237 731676483 732823334 733965225 734995193 736901016 739634933 742103043 745104446 747972565
756.1 747972565 749979401 751848221 752078400 751688461 751356049 751725388 753202591 754196777 754280167
764.8 754280167 754565048 756017075 756866302 757276382 756405487 754293213 752989044 751911469 751946335
773.5 751946335 752575531 754250107 756945877 758614273 760020523 762327652 764444427 764431915 764194946
782.1 764194946 764057083 763819580 764473877 766082153 768465881 770324554 772781601 774180222 774653854
790.8 774653854 775022736 773357239 772160645 771257324 770124664 770016251 771829376 774297409 774955444
799.5 774955444 774925995 775148315 775045090 773784790 772745056 772576752 773024597 772765427 772328339 774001007
809.1 774001007 774715881 775038834 776020050 776296387 775916595 774658508 773872986 773067474 772835617 773646927
818.8 773646927 775151291 776828995 777455750 777705460 777259369 776070251 774334412 773238907 772084579
827.5 772084579 769888687 768619080 767634735 766416168 766275101 766431732 764409943 760942841 757504501
836.1 757504501 754143677 750484314 746203384 744114380 744122467 743733215 743745956 743806381 742401428 740762863
845.8 740762863 739839859 739083252 738950882 738903427 739239426 741774521 744768143 746963730 749954300
854.5 749954300 752874374 754466019 755634079 757174454 759166641 760746841 760991440 761411209 763720627
863.1 763720627 766553116 767450485 767960281 769021988 768746262 768114548 768104248 768068466 767787170 768750992
872.8 768750992 770605545 772171021 773688278 774326248 774821930 775099640 773881073 771588516 769313812
881.5 769313812 766377411 764011612 763917160 763640213 763715820 763593750 762560425 761655045 760394135
890.2 760394135 759397964 758462524 758326950 758408279 758023453 758014297 759178314 761172562 762123566 762255478
899.8 762255478 760989609 760036621 759939346 758661652 758086853 758246918 757767868 756570816 754993973
908.5 754993973 752801895 751163940 749794006 747295685 744852066 742206573 739884567 737678375
916.2 737678375 735809708 734484329 732915192 731292114 728811340 726678314 725177994 723090286
923.9 723090286 720671768 719113464 717666702 716084824 716081848 716322403 716581726 716754684 716550751
932.6 716550751 716840973 717454300 718378677 719580994 722492294 725444794 727306290 729949417 732312622
941.3 732312622 734815903 737238922 739368057 741473389 742890167 744136200 745268631 747023468
949 747023468 748740463 750607605 751775131 751844406 751981735 750668106 749978790 749745789 748253937
957.7 748253937 746793747 745004959 743340988 742367477 741404266 739813461 737668610 735599976 733343658
966.3 733343658 730901260 728966370 727176590 726274796 725941620 724755020 724249191 724476242 723562851
975 723562851 721705399 720433044 719453964 718073807 717127533 716805954 716328430 714600296 712547684
983.7 712547684 710987854 709592361 707650833 704634171 701664124 697980576 693976212 690577774
991.4 690577774 686021805 678509216 668010483 655688705 646387329 648485031 659413147 669477234
999.1 669477234 674438934 676424255 677739258 678166122 677840195 677054443 676216202 675726242 675409470
1007.8 675409470 675524979 674963760 672697220 670685501 669427490 667450714 665861359 665018387 664070816
1016.5 664070816 662213440 659743576 657791748 655720215 653648758 651462021 649239273 646736069
1024.2 646736069 644582596 643333511 641563110 639612465 637528114 635738792 633340340 631173477
1031.9 631173477 629158554 626038628 624021187 622065048 620977325 620532341 620377235 619907188 618389587
1040.6 618389587 617969818 616859589 616102333 615575294 615105515 614971199 614418602 615072861 616091537
1049.3 616091537 617488022 617967148 618278313 618855896 618993416 619021301 619127274 620347176 620427628 620370026
1058.9 620370026 619267578 617747536 618309059 618401566 618283195 617376938 616512833 615614243 614378471
1067.6 614378471 613188667 612209930 612937126 613307762 612465401 610766716 610327950 609554443 607489662
1076.3 607489662 606132507 604659615 603638229 602026329 601664467 601387596 600602303 599944725 597770462
1085 597770462 595669479 592857285 590389824 586189194 581583328 577650604 571940155 566471291 559203148
1093.6 559203148 551192017 541372948 531540604 521341248 509631615 500167580 489711761 479999657
1101.4 479999657 468686028 457722778 447319641 437411041 429123611 418461418 410304070 401300621
1109.1 401300621 393579102 385449104 377389221 372077866 366635208 364431725 361489944 360986404
1116.8 360986404 359660263 359645462 361184196 361290703 363507538 363924828 366589203 367784500 369270248
1125.5 369270248 370391235 370583611 371766853 370384674 371400681 369388008 367465401 365241432
1133.2 365241432 361948509 358927040 353744392 352431259 350008659 348132362 344359436 340981903
1140.9 340981903 339421310 336123276 334179268 329244080 326424179 322495689 319585361 317672195
1148.6 317672195 315159740 315324974 312926464 313354282 312809391 313482704 313902740 314234657 317011108
1157.3 317011108 317720985 321091118 322378120 325865059 329019165 331867752 336734085 340453529
1165 340453529 346600456 350779190 357172813 362639427 369202957 377337265 384170151 392913513 400143051
1173.7 400143051 409400368 416661606 424782410 433142090 440076294 448946495 456089134 464578552
1181.4 464578552 471825981 479220619 486245880 492583771 499335289 504271507 510132599 515130692
1189.1 515130692 520594559 525192451 529750824 535028381 540270195 546884117 551861305 557078934
1196.8 557078934 561887093 567151222 572245827 576363869 581318130 586189880 591996422 596623459
1204.5 596623459 601622696 606585846 610665436 614872780 618096313 621119537 623168564 626254234
1212.3 626254234 629443092 631989555 634542999 636392593 638858299 640447769 641745605 642835693
1220 642835693 643716660 644324875 644306564 645035248 645525284 646583557 647755890 648698120 649404221 649726944
1229.6 649726944 650228043 650211334 650802536 651408615 651858902 652545547 653651733 654954376 655896454
1238.3 655896454 657023544 657630615 658123932 658192596 658531876 658918533 658897095 659450760 659613571 660335464
1247.9 660335464 661289978 662365952 662787857 662857742 663823776 664005203 664358749 664410629 664251709 664391403
1257.6 664391403 664812012 665803070 666708984 668260040 669176559 669946136 670560608 670704575 670753860 670578766
1267.2 670578766 671342850 672341537 674080811 675719833 677307892 679280853 680676956 681882629 682377701
1275.9 682377701 683392868 684681549 685892563 687319489 688892975 690919266 692342300 694327087
1283.6 694327087 696700363 698152161 699398270 701013641 702209549 702889099 704174271 705543365
1291.3 705543365 707075424 708787689 710401382 712292786 714072266 715582657 716657333 717202301
1299 717202301 717476654 717829895 718540192 719377823 720526123 721872940 723092270 724384384 725226822
1307.7 725226822 725508194 725498581 725334091 725782623 726028290 725804291 726283569 727247620 728587875 730100555
1317.4 730100555 731139755 731279221 731027069 731048203 731117859 731360703 731821671 732492981 733078079 733827438
1327 733827438 735186005 736238708 736881180 737151566 736954269 736779709 736119003 735566177 735600586 735854568
1336.7 735854568 736651917 737205124 737306442 736995468 737114258 737847137 737841263 737140961 736351242 735921631
1346.3 735921631 735853806 736179199 736664886 736685638 736733932 736711655 736504288 735912247 735062637 734145508
1355.9 734145508 733277359 732575989 732091522 732842484 733767319 734407654 734328995 732375336 732259903 732180099
1365.6 732180099 730808640 729852448 729011688 727614059 727246857 727993469 728661423 728910828 727912140
1374.3 727912140 726325455 725416718 725096817 724156647 722916794 722529984 722082291 721986694 722071991 722720184
1383.9 722720184 723712311 724931793 725794449 723310013 722930069 723727798 723670197 723624954 723772812 725011368
1393.6 725011368 725029373 723202972 723482895 724386902 724313278 720785599 718877106 719070663 718819427
1402.2 718819427 718793716 719130630 718231964 718084488 718821106 718582840 718428268 717624435 716380386 715318451
1411.9 715318451 714084091 713982849 714321060 715194092 716225433 717717285 719435730 714238739 713163910
1420.6 713163910 715071716 715634079 715254822 713321609 713782730 715224991 716355133 718382568 719621887
1429.2 719621887 718927460 718901749 719592819 719469376 719339371 721133652 723268509 719632492 719568863
1437.9 719568863 722975159 724831924 725556412 726113434 726287766 726622391 726356964 726247864 727305374
1446.6 727305374 727823029 726477966 727809219 730228729 731427765 731961288 732050934 732876129 733749084
1455.3 733749084 733796158 732010803 729571915 731546326 733545303 736354218 738150024 739312134 741720581
1464 741720581 740422134 738844376 739432297 739746628 740677032 742339401 744976807 747164688 747893600
1472.6 747893600 747726746 750312424 753159866 751997528 751958618 753539581 754324646 755432281 755844727
1481.3 755844727 756359253 758245239 759875946 761150513 763020935 762511444 761005249 762803802 760658798
1490 760658798 756055374 757194138 759196701 760080566 761667328 763181458 757367554 758859940 758728943
1498.7 758728943 754908371 755613632 754913559 754063034 754306717 756729126 759686508 754546127 745825195
1507.3 745825195 747214966 748951721 747056427 748361969 747007065 743265762 743913345 743817596 744525528
1516 744525528 742141724 739412689 743385315 746689758 744345474 738326721 736153183 737852249 740422516
1524.7 740422516 737788162 737210770 737777710 736354599 736730270 737301178 737158890 737142258 735608063
1533.4 735608063 729096527 730306702 731275024 732243271 735775757 730674591 724053955 730082169 729882736
1542.1 729882736 727278214 729628372 729478378 724538879 726263733 727610626 729153900 729163284 726822815
1550.7 726822815 728944702 731140823 733496933 731071777 730373459 734267197 738231201 733932648
1558.5 733932648 716375427 724526291 731072388 734687958 736124649 736896439 735754395 734722824
1566.2 734722824 735321732 735820618 736824341 731007919 732115555 734898911 735323105 735994034 737587357
1574.9 737587357 738537216 728391113 729056854 729750061 728669205 727776871 726037521 725788040 724598541
1583.5 724598541 723891373 722746277 721101608 719545822 717344437 715530624 712151260 710471268
1591.2 710471268 708035126 706487579 705420303 703433075 702567139 699777145 698094254 695394516
1599 695394516 692926559 690123291 687580490 685683136 681838531 680825958 679291153 678103333 675465775
1607.6 675465775 673605804 671680527 667766113 666423111 663086548 661461029 659780121 660500107
1615.4 660500107 660974350 650351791 651446609 650301285 649419403 647226410 647328339 646548004 639152756
1624 639152756 638937111 638098793 639105530 636770821 634818153 634409485 633471832 633240662 631888695
1632.7 631888695 633665428 635157890 629554558 625613289 627047615 626990967 627607613 629483414 628953972
1641.4 628953972 630287018 629915047 631527176 634196777 632457809 631717491 628888626 632793694 635649834
1650.1 635649834 640049667 645642624 651326447 640886002 638088951 641304474 642488022 644024200
1657.8 644024200 645336304 647459183 649951019 652270279 654250107 653123398 657019196 659554443
1665.5 659554443 661393280 664367752 667399750 667098007 666065521 669937439 671046753 674652023
1673.2 674652023 679556046 680574036 679282303 682134247 685344772 687357788 689546890 690447235
1680.9 690447235 694567413 699918442 700913315 697834015 699475327 705256958 708705826 709357300 710883484
1689.6 710883484 712252808 714869537 717487640 720781021 725731583 731415634 728643341 730962753
1697.3 730962753 736047440 741905518 744101562 732973099 740217133 745604477 749013290 751446228
1705 751446228 753849182 754415436 755643387 759136429 760677948 760598297 762275314 764911270 767833633
1713.7 767833633 767778625 767744217 772213287 774806213 767367172 770333481 773966751 775423279 776509705
1722.4 776509705 776573792 776100464 777009506 778047867 779066162 780707092 782770844 781587067 781634064
1731.1 781634064 786407852 790403137 786525726 777494431 781726761 785448990 786950531 789595718
1738.8 789595718 788468475 785803757 789876099 792728806 791555710 790982132 793385468 795120621
1746.5 795120621 796195755 797289276 797375336 800117569 799112015 797858047 801636200 803635178 805130692
1755.2 805130692 806618576 804134903 804295044 806320801 808247452 811458054 809434280 807636108
1762.9 807636108 810294342 811266403 811603317 812971191 814047623 811128006 812926712 817196274 817117691
1771.6 817117691 812650909 810557022 814620438 816822510 815498199 816543350 816948166 818132629
1779.3 818132629 818531342 816405869 816742935 818170090 819514847 819004974 818592682 820005646 820324554
1788 820324554 820068665 821252441 822143173 822593307 819074402 817575378 821233673 822695084 821541443
1796.7 821541443 822113724 824037018 824073868 822279282 823160629 822217026 821625290 822565384 823047333
1805.3 823047333 823972321 824712296 824715424 825410538 826965714 825515594 824542694 825146408 825195007 825611954
1815 825611954 825480118 825718231 825339203 825514297 826456528 826689835 827312469 827071915 827969818 829207840
1824.6 829207840 826520844 825640106 827324295 829478531 829939499 825898056 826086044 827995911 828225403
1833.3 828225403 828758698 829189529 829210434 828677750 827651443 828372879 828772278 829306564 829942398 831817398
1842.9 831817398 832718964 826216431 827702332 830312500 830192337 829197540 829175186 829864426 829510498
1851.6 829510498 829883194 830179138 830556107 830807800 830345383 830603561 830470810 830479736 830616837 830671234
1861.3 830671234 830356979 830347519 830936584 831511688 832265091 832267075 833182602 832275543 829511642 829690857
1870.9 829690857 830525436 831545334 831736298 831708527 831957016 832096329 832122040 832249756 832260513 831729584
1880.6 831729584 831718750 831552277 831761703 831912308 831571121 831663284 831943130 833715057 834197693 831304932
1890.2 831304932 831235199 832451706 832332458 832484512 832315063 830906754 831542664 832434540 832498322 832756119
1899.8 832756119 832944412 833175049 832932281 832617340 832016220 831658936 832041016 832206650 832286148 832820969
1909.5 832820969 832871170 832537842 833012924 832841187 832628860 832135391 831962051 833284760 831468277
1918.2 831468277 830341949 832068405 833266220 834128113 833166428 831651001 831817398 832003250 831615753
1926.8 831615753 831565857 831595917 831580048 831635056 831831055 832589874 832602921 832349167 832177658 831969376
1936.5 831969376 831862793 831497116 831275330 831278534 832820663 833033752 830688324 831605682 832766190
1945.2 832766190 832419357 831899872 831409225 831106644 831243820 831373520 831061935 830796356 831054611 831641693
1954.8 831641693 831620178 831612167 831577911 831332245 831213760 830516052 830192947 830340729 830696335 831217041
1964.5 831217041 831596069 832015533 831446533 830814133 831277847 831399460 830497971 830070801 830366669 830357513
1974.1 830357513 830413971 830638504 830924606 830992889 831013565 830953369 830370331 829807816 829514694 829531860
1983.7 829531860 829289551 829161911 829734192 830047836 829837112 829618149 830129089 830238724 829057388
1992.4 829057388 828786621 828998032 828918762 828626022 828500214 829308395 829711456 829253616 829195633 829500275
2002.1 829500275 829626846 829309769 828932648 828558044 828281708 828159332 828006897 828269958 828723221 829120712
2011.7 829120712 829169540 829041595 828893127 828418808 827754135 826762314 826590729 827007980 827340469 827751541
2021.3 827751541 828074951 828415909 828062973 827843781 827789001 827163162 826767273 826587830 826734390 826887741
2031 826887741 827031326 827152100 827448578 827910919 827684250 827194519 826645966 826275787 826023026 825887527
2040.6 825887527 825759048 825928421 826780930 827182007 827461472 827337341 826663437 826214066 825955887 825823212
2050.3 825823212 825155869 824803619 825123596 825814285 826295013 826177521 826062088 825522003 825093460 824838409
2059.9 824838409 824412613 824074783 824104996 824298096 824253159 824638977 824707336 824558792 824635696 824431534
2069.6 824431534 823721237 822683334 822507248 822681656 822489548 822263260 822465363 822771454 822548218
2078.2 822548218 822433319 822089462 821655502 821388016 820818558 820496902 820516434 820473480 820597458 820996399
2087.9 820996399 821412735 821691132 821436157 821127167 820837021 820404129 820295563 820401688 820754700 821059418
2097.5 821059418 821743774 822354507 822443008 822759705 822825775 822785721 822474976 822146683 821856918 821712265
2107.2 821712265 822266541 822639847 823227844 823630676 823622742 823666382 823603973 823604736 823044205 822500229 822339783
2117.8 822339783 822473373 822872543 823284988 823784103 824130020 824090500 823286743 822677383 822455673 822015152
2127.4 822015152 821769028 821685333 821840363 822211380 822467499 822660828 823506775 824228668 823870850 823158646
2137.1 823158646 822700958 822747955 822546005 822381744 822649765 822956543 823420410 823717728 823994598 824190598
2146.7 824190598 824220123 824031448 823515244 823165512 823265381 823510056 823771820 824313278 824836731 825205078
2156.4 825205078 825085678 824826202 824737015 824463348 824101105 823408508 823497467 824098053 824419632 824911957
2166 824911957 825141983 825127411 824869919 824819794 824633560 824016418 823445435 823122330 823319397 823479767
2175.6 823479767 823744431 823941345 824193039 824202423 823398056 822989044 822989349 822906342 822492523 822543106 823293304
2186.3 823293304 823737564 824018860 824390945 824815826 824732437 824543228 824437714 824319687 824463577 824436188
2195.9 824436188 824711075 825160446 825446014 825835724 826268311 826303787 826019211 825851288 825755386 825809631
2205.5 825809631 825444412 825387650 826037827 826576385 826879272 826984024 827329102 827203293 826650467 826110458
2215.2 826110458 825726242 825747910 825591736 825750885 826259003 826835251 827351379 827405319 827172928 826815948
2224.8 826815948 826259766 826026535 826235199 826162109 826453705 826525879 826556549 827107010 827003098 826809387
2234.5 826809387 826621246 826807480 826807632 826243286 825849228 825352173 825512238 825819855 826024246 826112442
2244.1 826112442 826339874 826773300 826511078 826177979 825908508 825975037 825823746 825890198 826368256 826302414
2253.8 826302414 826521835 826634293 826801910 826702652 826239929 825848389 825541153 825647202 825569229 825835953
2263.4 825835953 825883942 826020432 826379852 826376343 826566238 826343689 826301727 825935898 825467834 825467300 825632095
2274 825632095 825994568 825770950 825872192 826280518 826708603 826714554 826372681 826355057 826255035 826502380
2283.7 826502380 826332474 826133881 826194839 826107178 826011047 825886536 826171341 826503754 827008743 826671600
2293.3 826671600 826086960 825914536 825738907 826143646 826322861 826857376 826630249 826140213 826440811 826326294
2302.9 826326294 826446686 826020203 825582581 825130539 824822845 825273209 825665894 825964508 825839844 826121750
2312.6 826121750 825821381 825686493 826004944 825598145 825714569 825916443 826430511 825885239 825231705 825377426
2322.2 825377426 824816818 825139084 825715179 826100311 825893326 826050339 825949707 824702301 824757614 824978485
2331.9 824978485 824919510 825108337 826018143 826208115 825326462 825613327 826227036 826152039 824899063 823937759
2341.5 823937759 823979263 824633102 825430222 825547714 825456314 825441360 826129074 827159424 827441406 826688538
2351.2 826688538 826074600 825356598 825646515 826920853 826779556 827204132 826288147 824979553 825045624
2359.8 825045624 825183868 826008530 824838486 824447327 825717850 826151276 826174088 826759109 827546463
2368.5 827546463 827032013 826753387 826867447 826930771 827083130 827213974 827030182 826441422 826257782 826625519
2378.2 826625519 827352524 827793427 828156891 828132477 827575150 827500916 827519836 827629700 827939987 827869263
2387.8 827869263 827528610 827704620 828296738 828480835 828066025 827436523 827383728 827373428 827261124 827481995
2397.4 827481995 827909241 828429108 828595581 828607025 828126831 827736282 827672501 827213135 827120209 827040710
2407.1 827040710 826766281 826867371 827318573 827560196 827340851 827098236 827244797 827682953 827432175 827045517
2416.7 827045517 826951675 826694870 826338577 826125793 826627655 827159271 827434082 827608185 827430496 826870728
2426.4 826870728 826183624 825871429 825956421 826357880 826278381 826080856 826402359 826721497 826884232 826467896
2436 826467896 825980759 826047592 826150208 825533142 825001144 825312347 825395966 825452576 826000748 826306763
2445.7 826306763 826016769 825896149 825706329 825152130 824745560 824332275 824502563 824719238 824710846 825054550
2455.3 825054550 825457382 825711136 825266418 824802933 824489822 824208603 824243240 824139481 824199753 824304428
2465 824304428 824346161 824306030 824041977 823978806 824098740 823795090 823320847 823289642 823226089 823209991 823360367
2475.6 823360367 823542709 823621445 823459854 823299942 823223801 823341370 822908707 822526245 822740555 822536392
2485.2 822536392 822234192 822057495 822098389 822210007 822314682 822507324 822386398 822243195 822012405 821694641
2494.8 821694641 821597366 821608505 821640854 821469650 821271439 821704330 822154922 822014771 821820221 821243134
2504.5 821243134 820643158 820682755 820781326 820417175 820118942 820435104 820494156 820357666 820553589 820737534
2514.1 820737534 820478897 820181732 820140915 819627075 819299088 819311295 819641190 820131226 819919968 819876938
2523.8 819876938 820105591 820083542 819582291 819184875 819246674 818887405 818549957 818682556 819194183 819508972
2533.4 819508972 819291077 819097443 819093399 819055252 818794937 818601303 818385391 818185806 818276443 818564529
2543.1 818564529 818620834 818577881 818709335 818394623 818136063 817895432 817656403 817957687 817964706 817705231
2552.7 817705231 817689972 817874527 817975693 818111191 817973175 817471771 817350998 817002869 816438904 816277161
2562.4 816277161 816469574 816617050 816469955 816706390 817387161 817474899 816890106 816713486 816527863 816372299
2572 816372299 816557693 815933838 815212021 815454407 815907516 816069717 816355591 816285934 816021652 815823975
2581.6 815823975 815050812 814778824 814775314 814619751 814787827 814823914 814652557 814339371 814509430 814766617
2591.3 814766617 814667206 814222183 813615189 813707657 813620758 813307419 813490524 813584518 813471222 813461151
2600.9 813461151 813431625 813418350 813511276 812992630 812175751 812079010 812426453 812478180 812682114 813042068
2610.6 813042068 812732468 812521896 812576904 812379837 811826248 811132584 810900574 811048584 811399307 811453476
2620.2 811453476 811353531 811309204 811100769 811063690 810990829 810666962 809961624 809343338 809536896 809894562
2629.9 809894562 809611282 809219437 809295578 809741440 810085754 809743729 809498596 809327545 808845291 808452530
2639.5 808452530 807903442 807704086 807862320 808292160 808648529 808293228 808030853 807929077 807570267 807062759
2649.1 807062759 806738129 806625824 806519775 806340714 806289062 806703339 806939468 806660767 806299744 806080017
2658.8 806080017 805721741 805272293 805081863 805089493 805061035 804844894 805250244 805785522 805642166 805459442
2668.4 805459442 805154953 804609604 804226074 804243317 804001007 803754807 803755951 803806000 804349060 804229889
2678.1 804229889 803763046 803840408 803583755 802877350 802574768 802666550 802114487 801691437 801912766 802207565
2687.7 802207565 802210083 801999741 802050629 801790161 801436234 801135864 800940323 801058960 800996323 801012115
2697.4 801012115 800965195 800573044 800225067 800239410 800165176 800043716 799973984 799641647 799690018 799668579 799278030
2708 799278030 798934326 798888397 799337234 799477463 798982086 798470764 798322906 798001556 797792282 797728806
2717.6 797728806 797160873 796936646 797463531 798115234 798086929 797775955 797666550 797526779 797143860 796282349
2727.3 796282349 795856323 795849838 795935059 795908432 795739975 796094971 796168289 795863266 795524902 795187302
2736.9 795187302 794936981 794462509 794110107 794093704 794331284 794372559 794095535 793881683 793923111 793822784
2746.5 793822784 793241043 793164139 793601227 793575134 793057938 792462616 791807404 791585464 792106705 792332687
2756.2 792332687 792210541 792037811 791856613 791654816 791097946 790670776 790508804 790466309 790594177 790889282
2765.8 790889282 791040421 790674667 790173416 789833755 789678574 789411316 789084015 788844070 788413010 788020859
2775.5 788020859 787791214 787763138 787506180 787161942 787585602 787784119 787456131 786971359 786020432 785565872
2785.1 785565872 785549393 785394135 785374069 785567932 785980301 785778885 785177460 784725952 784134827 783839569
2794.8 783839569 783612518 783202667 783037033 782865372 782297897 782001038 782014618 781607819 781165390 780798111
2804.4 780798111 780492706 780355072 780157852 779681015 779272461 779313278 779284058 779093475 778361588 778008041
2814 778008041 778390884 777805481 777122040 776641769 775972672 775748825 775459518 775080109 775255051 775407562
2823.7 775407562 774698257 774219894 774165726 773556290 772445145 771480637 771325760 771371002 771289597 771004028
2833.3 771004028 770591278 770288162 769655304 769096451 768639679 767797318 766601639 765416946 764443283
2842 764443283 763781204 763142471 762224197 761892242 761294708 759437332 757571335 756214294 754941559
2850.7 754941559 753933640 753541107 753060837 752437973 752294617 752453003 752678299 752907410 752855225 752262421
2860.3 752262421 751778946 751464691 750801239 750142365 750016861 750098419 749839096 749493179 749074707 748538284
2870 748538284 747931137 747659607 747257309 745914459 745038376 744868774 744763489 744738007 744803696 745103683
2879.6 745103683 744834213 743990555 743270950 742659912 742060699 741586990 741293716 741317978 741260223 740519791
2889.3 740519791 740023575 739900208 739348907 738508530 737897110 737179108 735933304 735360107 735450897 735532379
2898.9 735532379 735432587 734647446 733953629 733973465 733672867 732463226 731496811 731084976 730943069 730876312
2908.6 730876312 730538940 730453873 730178757 729564209 729284210 728930664 727605133 726150360 725633850
2917.2 725633850 724770737 723654099 723114014 722733383 722204895 722058716 722404556 722155228 721797943
2925.9 721797943 721672134 721395721 720683975 720229340 720758667 721142654 721481628 721596603 721711502 722350159
2935.6 722350159 722863388 723156509 722921982 723058243 723569870 723855591 724243774 724478531 724917679 725430069
2945.2 725430069 725662079 725739594 725629044 724955292 723983612 723801804 724127960 723855591 723207397 723243484
2954.8 723243484 723245850 722811737 722894058 723171234 723188629 722907181 722536850 722348709 722226791 722486877
2964.5 722486877 723210602 723415375 723533707 724648972 725980453 726815948 727108383 727280197 727302856
2973.2 727302856 727387695 727939301 728655701 729742889 730626755 731750793 732746658 732621078 732903290
2981.8 732903290 733442307 733319626 732916183 733171082 733499908 733534775 734409485 735406265 736467972 737462616
2991.5 737462616 737652588 737366562 737131195 736844864 736287689 736331329 736601715 737032089 737522430 737487717
3001.1 737487717 737983398 738735733 738620300 737739105 737079926 736622620 736297607 736611862 736964722 737160645
3010.8 737160645 737403107 737731628 737837067 737582321 737265854 736942673 735888138 734315720 733912277
3019.5 733912277 734226303 734609680 734912338 734868317 734897003 734493866 733823242 733478775 733101959 732340546
3029.1 732340546 731821442 731719971 731863022 732255402 732142410 731819534 731383972 730918198 730468292 730033569
3038.7 730033569 729885254 729338303 728827591 728184357 727859802 728066177 727654572 727477417 727441025 727163315
3048.4 727163315 726483307 725607452 724989090 724511795 724449234 724075089 723787918 723545456 723019867 723003540
3058 723003540 722550125 721826935 721811142 721952362 721709061 721117706 720359421 720176849 720332565 720036087
3067.7 720036087 719854813 719648209 719295273 718859711 718017654 716952896 716191635 716110764 716310959 716657791
3077.3 716657791 716415100 715938950 716172943 715991058 715471878 715009766 714506836 713890305 713084259 712764969
3087 712764969 712416763 711980667 712308502 712518387 712323456 712184067 711747131 711174011 710157623 709020004
3096.6 709020004 708717499 708625641 708592224 708550491 708152084 707692642 707392807 707063446 706852646 706559525
3106.2 706559525 705612793 704936600 704527817 704031067 703633957 703133926 703259888 703454437 703140717 702668686
3115.9 702668686 702043610 701403580 700393524 699401245 698913498 698418732 697815704 697496948 697427139 697353973
3125.5 697353973 696867676 695954437 695259171 694735565 693964233 693226852 693171005 692769699 691780472 691473465
3135.2 691473465 691365509 691150208 690447540 689330597 688215485 687043686 686411057 685979919 685629654
3143.9 685629654 685643921 685486450 684608078 683798065 683368988 682932739 682826233 682051544 680978699 680229263
3153.5 680229263 679574814 679313965 678823471 678278885 677484665 676603165 675810547 674670563 673720932
3162.2 673720932 673108978 672678223 671922302 671256332 670935593 670722885 670669403 670236664 669361038 668112335
3171.8 668112335 666910934 666088791 665616302 664993973 664607697 664482956 663631592 663130951 662526703
3180.5 662526703 661764908 661390915 660494308 659447708 658326416 657420731 656843414 656405716 655818710
3189.2 655818710 655167084 654709778 654114685 653673096 652883987 652032623 651340256 650605011 649834518 649177780
3198.8 649177780 648877945 647859573 647218323 647028961 646449814 645682907 644473953 643748779 643086777
3207.5 643086777 642169952 641029816 640458298 640671387 640743484 640725327 639741478 638949318 638058777 636637115
3217.2 636637115 636139793 635404816 634182396 633468781 633649406 633587379 633117981 632442627 631580238 631388588
3226.8 631388588 630576363 629667015 629180260 628470764 627983513 627458458 626961784 626592560 626124535 625147171
3236.4 625147171 624152222 623377762 622611389 621469536 620348625 620026855 619504623 619506721 619429550 618806610
3246.1 618806610 618694344 618219795 617283630 615623474 614852295 614842873 614031067 613664703 613637886 613562355
3255.7 613562355 613023071 612026100 611257668 611032257 610609779 609364738 608280907 607434464 606985588
3264.4 606985588 606684799 606759949 607031021 606417885 605930557 605900803 605507507 604497643 603561363 602586823
3274 602586823 602095261 602308617 601547890 600536423 600042953 600334702 600747261 600006828 598730812 597425880
3283.7 597425880 596634026 596266365 596394730 596545029 596079865 595433884 595017014 595192146 594817162 593751259
3293.3 593751259 592687950 591865311 591385612 590658913 590173988 589923363 589696083 589478683 588966331
3302 588966331 588506050 588064384 587292595 586448402 586285286 586430588 585595207 584043579 583182983 582807770
3311.7 582807770 582396774 581908493 581238899 580663261 579766388 579131775 578758354 577894478 577232094 576552696
3321.3 576552696 575877419 575487709 575020905 574282799 573329277 571995735 570920296 570689011 569978714
3330 569978714 569176064 568474960 567507858 566732330 565830994 565505676 565115967 563959999 562837410 562002258
3339.6 562002258 561270828 560371056 559698219 558813095 557667694 556676140 555944290 555636177 555115623
3348.3 555115623 554278603 553449745 552163544 550310326 549408569 549259872 548607521 547811012 547117577
3357 547117577 546604729 545683022 544541626 543346596 541968002 541204910 540866051 540292435 538887939
3365.7 538887939 537453461 536195602 535317421 535283661 534567833 533672752 532768745 531481857 530448685
3374.3 530448685 529237289 528354378 527757568 527035027 526877632 526892052 526029243 524793663 523738174
3383 523738174 522659035 522046280 521651840 521345177 521280289 520772934 519910278 519360847 519248657 518676491
3392.7 518676491 517219467 515971069 515513420 515520401 514949265 514096222 513961258 513784752 513346214 512932014
3402.3 512932014 512656479 512458763 511686554 510679855 509743195 509423447 509419937 508757858 508369560 508533897
3412 508533897 508493233 507962952 507563019 507433815 507424355 507259407 506548042 506372871 505896149 505030746
3421.6 505030746 505059128 505336304 505520363 505255394 505077858 505201683 505128899 504545250 504182930 504461021
3431.2 504461021 504445419 504695854 504778862 504775658 505223351 505546722 505819473 505976639 505925522 505647850
3440.9 505647850 505796547 505604897 505835762 506664009 507140083 508250656 507835503 507450943 507999153
3449.6 507999153 508243561 508858528 508642540 509069710 509865799 509984322 510304108 510878258 511870003 512592545
3459.2 512592545 513325653 513869286 514105873 514135170 514408875 515023499 515673523 517139587 517871704 517831039
3468.8 517831039 518073959 518700294 519422874 519862671 520576668 520869255 520956917 521383018 522333832 523479538
3478.5 523479538 524450264 525308609 526083527 526922684 526821632 527636147 528310432 528073540 529380341
3487.2 529380341 530545654 531113815 531660042 532441406 533025856 533391762 534459763 534985313 535740623
3495.8 535740623 536728516 537282104 538188934 539161606 540032463 541345901 542575417 542718277 543060875
3504.5 543060875 543452492 544081612 545214310 546751137 547485352 546644592 547787743 549505997 550474319
3513.2 550474319 551052017 551554031 552760582 553378410 554230995 554721832 554453888 555347748 557329102
3521.9 557329102 558902054 559333916 560516930 562057648 563250504 563619919 563785095 564165039 564633522
3530.6 564633522 565752106 567220306 568651543 569412308 571442070 572517624 571492004 572621384
3538.3 572621384 573942184 575126801 576198196 577517395 578684196 579569588 580736656 581544991 583417091
3547 583417091 582614136 582889900 584785118 586620331 589205322 588495483 589207497 590336685 592009506
3555.6 592009506 594291420 594122047 596157455 598112679 598302689 598332863 600649338 602583427 602820625
3564.3 602820625 607494698 608160896 606311607 606833572 606301613 609585762 611019516 612105255 614054375
3573 614054375 616162186 617587814 618915138 620965843 620928955 623116608 625073509 625485115 627278290
3581.7 627278290 629162560 631031685 632177544 636283760 638257523 635779114 636637039 635525513
3589.4 635525513 638491516 641997757 645514984 647451553 647465668 650284042 648605270 650223083 653565826
3598.1 653565826 654207916 657744293 658941193 659417801 661469269 663240662 664977875 667372589 670008163
3606.8 670008163 669488754 672554855 671238327 670463028 678691025 680378876 677594147 681781464 681436996
3615.4 681436996 684549866 688598099 687958145 689432373 688639679 687854385 690591583 693891678 696913986
3624.1 696913986 700250778 702700272 704595490 710536499 709734268 697911453 701816330 706437759
3631.8 706437759 712537689 714907150 712473907 714476242 717812805 720233231 720521622 721417084 723226471
3640.5 723226471 725243988 726145020 725631866 727551727 731665192 738695068 740514374 736143494 739208603
3649.2 739208603 737624893 733755188 732347260 737461777 741809235 745870438 751514130 741958771
3656.9 741958771 741257401 746426620 748197861 749159622 749125671 750667496 750910645 751631699 753182373
3665.6 753182373 753747177 758497772 761383514 760675888 763802414 756063080 755113373 762304611 771254959
3674.3 771254959 770347900 749338684 752737427 760810242 765937119 763601685 763114471 765819168
3682 765819168 767262192 768142548 767109528 766431274 771005096 778229370 770009689 766124802 773733826
3690.6 773733826 765987091 764734650 769643250 770237427 771519089 771088867 770302811 770926056 770871658
3699.3 770871658 774083786 778652496 772987900 769003372 773672256 775580673 775512466 775434189 778063507
3708 778063507 782752457 775993576 780162354 785838547 771033096 774286041 778847961 778828278 778744278
3716.7 778744278 781180344 782880096 779104309 779520111 785498886 782901077 777594147 781816254
3724.4 781816254 782270889 781917114 778950806 778552017 782791748 784137955 790387650 788048325 779766846
3733.1 779766846 790636902 793558578 781172104 778837433 780306549 780214767 782690048 786852417
3740.8 786852417 783469620 786440659 798801575 790624237 772811508 781970444 787759476 793913116
3748.5 793913116 792383575 781580124 788930511 780320511 774318237 780618591 785581665 788716354
3756.2 788716354 783899536 787069244 793446121 785438004 782168427 785010071 785775223 786253967 790008163
3764.9 790008163 787598114 782115402 785012436 790317917 790702286 781458511 782939682 785714722
3772.6 785714722 786013565 786985397 786121597 786712112 788055649 791935349 792738953 783790207 785364761
3781.3 785364761 787196045 787655869 789729080 785667801 784190598 786533279 787600632 787844086 787484360
3790 787484360 787758560 787933884 788170013 787428436 788887329 793091507 789633102 785126190 787015305
3798.7 787015305 791424484 798396149 793515854 782165222 784106445 785832367 790494995 796292953
3806.4 796292953 785689545 781483078 786452713 788202133 788244324 788486404 789141693 791176758 797467117
3815.1 797467117 796462021 780289154 784817963 791090698 796362457 797827377 779104691 780890503
3822.8 780890503 785791931 787854614 790763321 791010437 786342850 785933304 787517014 791248322 793366776
3831.4 793366776 784339905 788338394 796699066 789198074 787650452 796200638 787652817 783003998
3839.2 783003998 790391083 782701569 782622452 790699310 788606644 784950180 788072281 789333420 788978271
3847.8 788978271 790960693 790660095 793002472 799561996 794101410 793578873 773527679 776228867
3855.6 776228867 788843765 788008499 785196609 787584915 790515060 793420181 787969513 787890015 794729004
3864.2 794729004 787312393 780688705 785271835 791342773 798030472 789870758 780415039 784670181
3871.9 784670181 790950165 793857956 783582458 784400864 788241882 788296051 790318222 795092316 789037628
3880.6 789037628 780597992 786864853 787802429 789246216 793970032 780751495 782519150 786975021
3888.3 786975021 788033066 792350616 791923981 782595520 783168793 787168732 786689911 787634201 788221359
3897 788221359 791047592 793275223 782592468 788017502 791050491 785418854 789669495 785705566
3904.7 785705566 783619232 783982468 784677734 786823578 786219940 786208572 786706085 787663574 787944641
3913.4 787944641 787487564 789185104 791036911 786611481 782541275 787125931 787724915 783534164 786224442
3922.1 786224442 789166412 790552139 788293915 784704208 785640259 786644058 788010788 787373962 786321182
3930.8 786321182 788551712 786147614 784245148 785792160 785394440 786212921 787463303 786782227 786007004
3939.5 786007004 785056610 786430664 788454361 785075073 784367752 785962524 787062149 788466873 786078568
3948.1 786078568 786276779 787212296 784852982 786084976 786765976 786056519 785719910 785774155 786280670
3956.8 786280670 785554581 785996704 786240234 786622086 786749115 784740372 784618454 785100250 785317917
3965.5 785317917 785724106 786372986 787402191 786123581 784835129 785734253 785936279 785759583 786274033
3974.2 786274033 786199951 785995789 785812454 785845108 786752930 786834641 785933838 785725708 785849228 785825195
3983.8 785825195 785936584 785454025 784944534 785538330 786661453 787148209 786484146 786397552 786695709 786908951
3993.5 786908951 786840286 784915771 784362335 785294495 784933319 784859009 785460281
4000.2 785460281
##END=$$ End of the data block
