##TITLE=$$ Begin of the data block
##JCAMP-DX=5.00 $$ ACD/SpecManager v 10.08
##SPECTROMETER/DATA SYSTEM=Varian
##DATE=18 Dec 2012 13:33:28
##DATA TYPE=INFRARED SPECTRUM
##DATA CLASS=XYDATA
##ORIGIN=
##OWNER=
##NPOINTS=3735
##FIRSTX=399.26403809
##LASTX=4000.35498047
##MAXX=4000.35498047
##MINX=399.26403809
##MAXY=75.09471893
##MINY=43.88899231
##XFACTOR=1.0000000000
##YFACTOR=0.000000100000000
##FIRSTY=66.94753265
##DELTAX=0.96440572
##XUNITS=1/CM
##YUNITS=TRANSMITTANCE
##XYDATA=(X++(Y..Y))
399.3F69475327o334839n063706j049881J462403l265076l450394L031922J600265
407F56406021Q49838n894165o369934L016281J750641j158218r1400L22799J461945
415.7F50293808K694015l526992j8867493k413635J1482048P141228R786453M700699
423.4F61290131p643204o051178O561L961487O783295M300689l112411q245850k260818
432.1F49028702k07138n315171j213302K448654M375381M617005j691895k243194P09381
440.7F50508423j407776Q21533L466416J1749L38898J49002l410645l573913j957779
449.4F44945908j48240J299820L354035j99204l611984n61905J680298K00119j085052
458.1F45873795j282807l351211L562240M651489o587142n378457M55323K065849j619072
$$ plain form
399.3 669475327 663140488 658076782 657026901 658489304 655224228 651773834 654805756 656406021
407 656406021 657255859 651361694 644991760 648008041 649758682 648600464 648509064 648831863 650293808
415.7 650293808 652987823 649460831 630593338 628179703 639661751 646802979 656589432 661290131
423.4 661290131 653646927 647595749 647602310 651563797 658347092 662647781 659535370 651289520 649028702
432.1 649028702 648821564 643506393 642293091 644741745 649117126 653734131 652042236 649799042 650508423
440.7 650508423 649100647 649922180 653388596 653400345 653739243 653888245 650477600 646903687 644945908
449.4 644945908 644797668 646097488 649451523 649252319 645640335 645078430 646758728 646958847 645873795
458.1 645873795 644590988 641239777 644802017 649453506 642866364 637487907 637943230 640009079 638390007
466.8F38390007k169838L52593R10453O235352M059677l774490j804352m752770k477531
475.5F34969101M229011K066918K624054N28869m64477K171478l443069k329865N182343
484.1F45534363K747116k734528j338577K421799J136932j84631k886276l901749J603775
492.8F42398224J487274q57010R97391K270584J8311l663J885529j89438m603500l870430
502.5F39533272K15072J165429M641647r32770k819443N019608J870499j65558k949295
511.1F45578461n353394j172180J535950J019668k230263K53487K091446j187439M6921
519.8F40582657q36296j688919j048737p21664N09834L08723N53971J287422j90277
528.5F38756714Q96301J230621j866073k411995q2398K410698p0457k708550n5351
$$ plain form
466.8 638390007 636220169 636572762 637483215 643718567 647778244 644003754 642199402 637446632 634969101
475.5 634969101 639198112 641265030 643889084 644417953 643953476 646124954 642681885 640352020 645534363
484.1 645534363 648281479 645546951 644208374 646630173 647767105 647582474 644696198 640794449 642398224
492.8 642398224 643885498 643028488 644025879 646296463 646314774 646311111 648196640 648007202 643403702 639533272
502.5 639533272 639748344 640913773 645555420 644622650 641803207 646822815 648693314 648527756 645578461
511.1 645578461 640225067 639052887 640588837 641608505 639378242 639631729 641723175 640535736 640582657
519.8 640582657 639746361 638057442 637008705 636287041 636796875 637105598 637659569 638946991 638756714
528.5 638756714 639653015 640883636 639017563 636605568 636523170 638933868 638863411 636154861 636099510
537.2F36099510J343613L66783J72653J205101j94053n81856l73993k038422j0109
545.9F35989227R29833m77982J59722J817970J078605m87747n34591k532730j263161
554.5F34679146K335281J907654l00217l84559M41971o05393j273041k079811J48621
563.2F34869652J724968m57726K31362N70373M63753Q81576P97997j0529j275596j315804
572.9F36480026k005005o12182J166725J857529J458091k0103m00849j380386r30900
581.5F35612946L34930k39258n99518P4578J161995O69860j99279P97729J171570o90689
591.2F38094864j115189r13315j002960L50342J39122P34139R33036o37092n69573
599.9F36013374k5367j69449j563492j145058n02281j977539r39446R64394P95555
$$ plain form
537.2 636099510 637443123 637809906 637982559 639187660 638993607 638411751 638037758 635999336 635989227
545.9 635989227 636919060 636441078 636600800 638418770 639497375 639009628 638475037 635942307 634679146
554.5 634679146 637014427 638922081 638621864 638237305 638679276 638073883 636800842 634721031 634869652
563.2 634869652 636594620 636136894 636368256 636938629 637402382 638283958 639081955 639071426 637795830 636480026
572.9 636480026 634475021 633862839 635029564 636887093 638345184 638325081 637924232 636543846 635612946
581.5 635612946 635947876 635708618 635109100 635183678 636345673 637015533 636816254 637613983 638785553 638094864
591.2 638094864 636979675 636066360 635063400 635413742 635552864 636287003 637220039 636582947 636013374
599.9 636013374 635988007 635818558 634255066 633110008 632607727 630630188 629690742 630655136 631450691
608.5F31450691j50833o85615j021996j253242j432953k027398k635345j996918L16963
617.2F20563354K545205K861061M17824j256295j78756k16637j186638n74264J8730
625.9F22993584J230468K387467K199516K607536J927872K201157J986351O39534J53045
634.6F38326530k664604k172622j99814k56348L42636J058159L132515K270889L96271
643.3F40233612M21753L28598L01819M87823J044617N14603O43310R14765J879425
651.9F46770325J660614m65927K20108p68967o41327N35278o87637L92990J130905
660.6F48146362N77698j363220N8060K193222Q77227K235794J132126o218567P09839
669.3F48348541R18579R47800P55386L77350M5929J79444P33184L83454M38080J02615
$$ plain form
608.5 631450691 631299858 630614243 629592247 628339005 626906052 624878654 622243309 620246391 620563354
617.2 620563354 623108559 625969620 626387444 625131149 624952393 624735756 623549118 622974854 622993584
625.9 622993584 624224052 626611519 628811035 631418571 633346443 635547600 637533951 638173485 638326530
634.6 638326530 635661926 633489304 633289490 633033142 633375778 634433937 637566452 639837341 640233612
643.3 640233612 640655365 640983963 641285782 641773605 642818222 643332825 643976135 644890900 646770325
651.9 646770325 648430939 647965012 648185120 647416153 646774826 647310104 646622467 647015457 648146362
660.6 648146362 648724060 647360840 647418900 649612122 650489349 652725143 653857269 647638702 648348541
669.3 648348541 649267120 650214920 650970306 651347656 651393585 651573029 652306213 652689667 653127747 653230362
678.9F53230362J98212P64770J63956k87552O36063P4539j087036l70026l67355l91465
688.6F52564468L71933L53318o17905J10702N41687r60540o05774j006851r94797p2937
698.2F49683304l51257N7601M97361O50329l88489j74789p9727j164932N71518K80990
707.9F49581909n03158J765136K098313O61545O52999J254654P81479L74222M12674
716.6F57079773L42789m09088m15650L24020L16849J508866K256012J437835N63736
725.2F63005142J19095k41470j086579j102676p68356l12958J94702P57370J477203
733.9F62041473J383362N42755N89066P04040j386642j220398M25491M59671P69959
742.6F64308777K92969R58938K071228J910019J270142L05710K41088j2893O03866
$$ plain form
678.9 653230362 653428574 654193344 654357300 654069748 654705811 654780350 653693314 653323288 652955933 652564468
688.6 652564468 652936401 653289719 652671814 652782516 653324203 652363663 651757889 650751038 649756241 649683304
698.2 649683304 649332047 649389648 649887009 650537338 650148849 649974060 649894333 648729401 649300919 649581909
707.9 649581909 649078751 650843887 652942200 653603745 654256744 655511398 656292877 656667099 657079773
716.6 657079773 657422562 657013474 656597824 656921844 657238693 658747559 661003571 662441406 663005142
725.2 663005142 663124237 662882767 661796188 660693512 659925156 659612198 659806900 660564270 662041473
733.9 662041473 663424835 663967590 664556656 665260696 663874054 662653656 663079147 663538818 664308777
742.6 664308777 664601746 665560684 667631912 669541931 670812073 671117783 671358871 671345978 671949844
751.3F71949844J608200J502533J408158J574554J352616R72366L75976l46908Q34274
760F81231613M28620m48456K00958L51181J349335P07931J56632J02997k28501j90582
769.6F83661728j409378p55615J82266n7984J28632J114426J910705R85871P51190
778.3F86511841J007080Q71124P30362R20792O12106P27539J515045J194382J434174
787F95524445L17688N4321L85208o53687L35541l21197m21295J572189J089020L74069
796.6F98256302O94580L57513k75955j97906m79813m90799J15051M86069J241226J227417
806.2G00933685O27671Q52737M67529q5907k02713j084671l16467R71909R69162P58133
815.9G03891068L17153P39594N53970k1286l814k18125l15170Q7204J28479n49545
$$ plain form
751.3 671949844 673558044 675060577 676468735 678043289 679395905 680368271 680744247 680397339 681231613
760 681231613 681660233 681211777 681412735 681763916 683113251 683821182 683977814 684080811 683852310 683661728
769.6 683661728 682252350 681496735 681679001 681621017 681749649 682864075 684774780 685760651 686511841
778.3 686511841 687518921 688390045 689120407 690041199 690653305 691380844 692895889 694090271 695524445
787 695524445 695842133 695896454 696281662 695627975 695963516 695642319 695221024 696793213 697882233 698256302
796.6 698256302 698950882 699308395 699032440 698834534 698354721 697863922 697978973 698465042 699706268 700933685
806.2 700933685 701561356 702414093 702881622 702795715 702593002 701508331 701191864 702163773 703132935 703891068
815.9 703891068 704208221 704947815 705501785 705480499 705476685 705258560 704943390 705030594 705159073 704609528
825.5G04609528R3917M36478O1874j270904j909943l68805j235580k046814j586914
834.2F96782837j467972j256180r62295r30252j296997m25034r61075k137222j813812
842.9F85531998q86689j40228p44934o35910o66885j93940J054688J63879J40534O43387
852.5F84265900L01284J443634J787034R40551J816025K190476R88082L34855M61120
861.2F94528961J488953J802292Q00094m16641L69873J690903J107712Q86612N45578
869.9G02804337Q74481O57959k46659J32599N57404P18231K5940N65414J49613j95770
879.5G06043549K25830j390076j057434j683579k710800j492691n09186K41013M39835
888.2F98106461L12500k34299j26343j06888n37567l30582m75006k21939O82526Q40530
$$ plain form
825.5 704609528 704703445 705139923 705201797 703930893 702020950 701652145 700416565 698369751 696782837
834.2 696782837 695314865 694058685 693096390 692166138 690869141 690444107 689483032 687345810 685531998
842.9 685531998 684645309 684505081 683760147 683124237 682457352 682263412 683318100 683481979 683622513 684265900
852.5 684265900 684567184 686010818 687797852 688738403 690554428 692744904 693732986 694067841 694528961
861.2 694528961 696017914 697820206 698620300 698203659 698573532 700264435 701372147 702258759 702804337
869.9 702804337 703678818 704336777 704090118 704222717 704780121 705498352 705524292 706089706 706239319 706043549
879.5 706043549 706269379 704879303 703821869 702138290 699427490 697934799 697425613 697666626 698106461
888.2 698106461 698418961 698184662 698058319 697951431 697413864 697083282 696608276 696386337 697068863 697909393
897.9F97909393O7292N48477J145019K85874p06101j342773j234818j237640j174545
906.5F94260178q71430Q1253K57645l55148q0185j284180k490997k348633j590424
915.2F85578079j118545j966553j633072m44641n16663p70950m67072k75650p04650
923.9F77680283j273880j825791k309646j712265j095581m04969R77097O54449K59552
932.6F70949249P92847P74231M09622k28348j297N41382J448746K606583K205200J833648
942.2F81331863J895066J741485J226654K08893N1346O90155J161041R82361J016007
950.9F90304871Q47778K90146K5711k02332k27203p27768j188583j195526j228867
959.6F86698227j218720p46917m44794q81119j740494j806869j107483j548386j394805
$$ plain form
897.9 697909393 697976685 698525162 699670181 699956055 699249954 697907181 696672363 695434723 694260178
906.5 694260178 693388748 693470001 693727646 693372498 693292313 692008133 689517136 687168503 685578079
915.2 685578079 684459534 682492981 680859909 680415268 679898605 679127655 678660583 678384933 677680283
923.9 677680283 676406403 674580612 672270966 670558701 669463120 669058151 670035248 670689697 670949249
932.6 670949249 671742096 672516327 672925949 672697601 672696304 673237686 674686432 677293015 679498215 681331863
942.2 681331863 683226929 684968414 686195068 686403961 686455307 687145462 688306503 689288864 690304871
950.9 690304871 691152649 691442795 691468506 691266174 691038971 690311203 689122620 687927094 686698227
959.6 686698227 685479507 684732590 684287796 683406677 681666183 679859314 678751831 677203445 675808640
968.3F75808640j354676j343307j70365J12992K54364m30374o72532k50549j455994
976.9F70498199k163696j313019j99203n76706q57773k37427m4479m23355j266708
985.6F63415833j239625j429519k131424j943283j488037j317139q30383o99692j490707
994.3F50846024k090683k323227j230927J75858r6436j024551j644821q87070O82754
1003F42406921p3547j343613r28573j275559j437797j417847j630554r00154q58345
1011.7F32540932p18651k50893j14403l86886j014481j065025j040268k036781k930222
1020.3F22983322j803665j264420j199264m79698r01757p46154j35117n30319r68323
1029F14954605j297722k031479j350708p76977j211205k02369N43632O67496K06146
$$ plain form
968.3 675808640 674453964 673110657 672940292 673053284 673307648 672877274 672204742 671954193 670498199
976.9 670498199 668334503 667021484 666822281 666245575 665387802 665150375 665105896 664682541 663415833
985.6 663415833 662176208 660746689 658615265 656671982 655183945 653866806 653036423 652336731 650846024
994.3 650846024 648755341 646432114 645201187 645377045 645280609 644256058 642611237 641724167 642406921
1003 642406921 642333374 640989761 640061188 638785629 637347832 635929985 634299431 633399277 632540932
1011.7 632540932 631822281 631571388 631456985 631070099 630055618 628990593 627950325 625913544 622983322
1020.3 622983322 621179657 619915237 618715973 618236275 617334518 616588364 616453247 615922928 614954605
1029 614954605 613656883 611625404 610274696 609497719 608286514 608084145 608627777 609295273 609501419
1037.7F09501419j04752m28619j068458j063996m89197L56942j06888k3155k57454
1046.4F06315842L23715J544723J59188L15933N88531l32183j301155j457062o7215
1055.1F06090317K63176j67656n87006M27780J298333K19116j360855p71065J81656
1063.7F05593796p61452L4905P5569k66381K63062K16293j37520q89053m8752l3188
1073.4F04047279l29322l45498j54571M93889q6327N2109N49164O89010p09114n51452
1083F03655167J027832L99513L26118M86565J09100m36973R6588N19981L43094m47807
1092.7F06079178j394463l71856q62923j139984j033516n88493K28118r41047j26686
1101.4E99848328j86539j191368j328659j330528n80788l94058k90833k74124Q9188
$$ plain form
1037.7 609501419 609396667 608968048 607899590 606835594 606346397 606703339 606596451 606573296 606315842
1046.4 606315842 606639557 608184280 608343468 608659401 609247932 608915749 607614594 606157532 606090317
1055.1 606090317 606353493 606185837 605598831 606026611 607324944 607544060 606183205 605412140 605593796
1063.7 605593796 604832344 604867249 604942818 604676437 604939499 605155792 605018272 604129219 604080467 604047279
1073.4 604047279 603717957 603372459 603217888 603711777 603625450 603677559 604226723 604915733 604206619 603655167
1083 603655167 604682999 605082512 605408630 605895195 606004295 605567322 605663910 606183891 606526985 606079178
1092.7 606079178 604684715 604312859 603449936 602309952 601276436 600687943 600916061 599975014 599848328
1101.4 599848328 599661789 598470421 597141762 595811234 595230446 594836388 594545555 594271431 594360619
1110E94360619p63436q54721q16269j445007n35126l51181L22724N49507M15344L78342
1119.7E91260796Q18595L66135m45289O04286k80876k73171l40958l28407l26118j231957
1129.3E89823036R30939J168365N20058J02081L48969R63631J16691m9934p45049Q5716
1139E93264503O35033P86858J46408r76219m74587j023674l43590q55026j238022m10919
1148.6E89510765k93655M83398M24576K76833p26815j30653J00403n27764L61748P11441
1158.3E90190277Q78754J19476P12891J281585J963616J829834P72972J495285J071854
1166.9F00316544J363296J359711J891594K626457K352638K840309J901436J872406
1174.6F16524391J713486J223869J894608J959114J475677J260643J916581J663780
$$ plain form
1110 594360619 593597183 592742462 591926193 590481186 589946060 589594879 589917603 590467110 590882454 591260796
1119.7 591260796 592079391 592445526 592000237 592604523 592323647 592050476 591709518 591381111 591054993 589823036
1129.3 589823036 590753975 591922340 592442398 592544479 592893448 593857079 593973770 593923836 593178787 593264503
1139 593264503 593899536 594686394 594832802 593856583 593381996 592358322 592014732 591159706 589921684 589510765
1148.6 589510765 589217110 589700508 590125084 590401917 589675102 589544449 589644852 589117088 589478836 590190277
1158.3 590190277 591069031 591188507 591901398 593182983 595146599 596976433 597749405 599244690 600316544
1166.9 600316544 601679840 603039551 604931145 607557602 609910240 612750549 614651985 616524391
1174.6 616524391 618237877 619461746 621356354 623315468 624791145 626051788 627968369 629632149
1182.4F29632149J442413J270981Q97827J099587N24940L82652Q08869Q16459N77088
1191F37452965J160507J332321N92613O36750M23660O18668O56356Q4992R4070J67923
1200.7F43220825N08042K57797R9640O68945M80347k47422k96554N3100L1434j30539
1210.3F44645615l00751l4332K5634j14898J70669N19333L45917l83835n01709o10886
1220F43760757l81546l58123q77915k12784K44751j4495n33982k33612J48468j69830
1229.6F41371689J4877P6218J87759k21176n52368N1880N58319K18963k48107o791
1239.3F41451263m2724L0975J5946K85949K89612k54364K1973j22299k61078k43302
1248.9F41171951l1433r1934j34888L13950k1210J55716O6223l5858j94931k89307
$$ plain form
1182.4 629632149 631074562 632345543 633243370 634342957 634867897 635250549 636059418 636875877 637452965
1191 637452965 638613472 639945793 640538406 641175156 641598816 642217484 642873840 642958832 643052902 643220825
1200.7 643220825 643728867 643986664 644086304 644755249 645235596 644988174 644691620 644744720 644776154 644645615
1210.3 644645615 644344864 644310532 644336166 644221268 644391937 644911270 645257187 644873352 644371643 643760757
1220 643760757 643379211 643021088 642143173 641930389 642175140 642160645 641626663 641393051 641541519 641371689
1229.6 641371689 641386566 641462784 641650543 641429367 640876999 640928879 641487198 641706161 641458054 641451263
1239.3 641451263 641408539 641439514 641455460 641741409 642031021 641776657 641798630 641676331 641415253 641171951
1248.9 641171951 641140518 641048584 640913696 641227646 641206436 641362152 641428375 641392517 641197586 640908279
1258.5F40908279L46528n7374j14059j16119L27606O92367M46701O10123K08435M70047
1268.2F43722534J49841k40631J85929K47955O72760P87582P74155N96619P14493O44760
1277.8F48255997K08358K07215L7002N61676Q58231O80771R57184Q79898Q79288J079406
1287.5F54605026Q95386O60324K93579L8681P24030J248550N53513M91638J254654
1296.2F60765381J049805Q63113Q87375M37546L29284L03574L30200M94614O42700
1304.8F66103592Q87680O62155L99857N76324M97132M54483N30777J27716j55259Q9417
1314.5F70173874M19922K62222L45001R72290P60727L40424K73590L57132P27997M04892
1324.1F75038071K6092L87497TL31116M80194K47421L47977L91846j07422k98767N35659
$$ plain form
1258.5 640908279 641254807 641197433 641083374 640967255 641294861 641987228 642433929 643044052 643252487 643722534
1268.2 643722534 643872375 643631744 643817673 644065628 644738388 645525970 646300125 646896744 647611237 648255997
1277.8 648255997 648464355 648671570 648708572 649270248 650128479 650809250 651766434 652646332 653525620 654605026
1287.5 654605026 655500412 656160736 656454315 656492996 657217026 658465576 659019089 659510727 660765381
1296.2 660765381 661815186 662678299 663565674 664003220 664332504 664636078 664966278 665460892 666103592
1304.8 666103592 666991272 667653427 668053284 668629608 669126740 669581223 670112000 670239716 670084457 670173874
1314.5 670173874 670593796 670856018 671201019 672173309 672934036 673274460 673548050 673905182 674633179 675038071
1324.1 675038071 675064163 675451660 675839157 676170273 676650467 676897888 677245865 677637711 677530289 677231522 677767181
1334.7F77767181P00074n65338k76413K12631l06931j12152L80554L96958k35215l01132
1344.4F77660217j97372k7008K57110J70823J55639k28119j77993k86408m26102m64325
1354F76436462p45391m84086j79748L35693L29132N0812M2114N1423k59247j540070
1363.7F74037094n59235j52664n13153l06167m21982l82157j74255l34396P2326J16425
1373.3F71381836j367798j563568m57916J78222p3852j12534K04621k63214m8829j831
1382.9F67875137o9656P2403N84335J269074K17972N16586J143265P79419O35681N31692
1392.6F73555908P69577k8534j145477n07202j82114j42975j382904l28521K46276
1401.3F70854034k78778m6157K93502p07245r98992k44751p88346n18875l27454l41339
$$ plain form
1334.7 677767181 678467255 677901917 677625504 677838135 677531204 677419052 677799606 678196564 677961349 677660217
1344.4 677660217 677462845 677435837 677692947 677863770 678019409 677791290 677613297 677326889 676900787 676436462
1354 676436462 675691071 675206985 675027237 675362930 675692062 675742874 675784988 675836411 675577164 674037094
1363.7 674037094 673477859 673325195 672812042 672505875 672083893 671701736 671527481 671193085 671265411 671381836
1373.3 671381836 670014038 668450470 667992554 668170776 668096924 667984390 668189011 667925797 667876968 667875137
1382.9 667875137 667805481 667877884 668462219 669731293 669949265 670465851 671609116 672388535 673024216 673555908
1392.6 673555908 674325485 674296951 673151474 672644272 672462158 672319183 670936279 670607758 670854034
1401.3 670854034 670575256 670529099 670822601 670115356 669116364 668871613 668083267 667564392 667236938 666895599
1410.9F66895599p6599m03671k9755J54877J85394J3886m29840m43421k079620J34735
1420.6F63921585R68094N51453J02768j083527k39487P93152K41470j69372j71051
1429.2F64915085j222992j42593J111068J70365l85971O64291J083450j458282k53678
1437.9F64480743J292649M18625J23596O1569j3580P93914N43976L8605M42886P68052
1447.6F68951035n61600k82974P17926K99453J679K90680Q29468J078948J289292n60608
1457.2F72053299k153854J665878J383819J391983O02417M25110J916657l02048p46002
1465.9F76237259J557617J255798O63224O53991J623307J759872L18222L39432K096405
1474.6F86505127K478790Q09021M83933J478958R17816Q36105L57056j15204R20105
$$ plain form
1410.9 666895599 666819000 666415329 666385574 666540451 666725845 666739731 666309891 665866470 663786850 663921585
1420.6 663921585 664889679 665441132 665543900 664460373 664220886 665014038 665255508 665086136 664915085
1429.2 664915085 663692093 663549500 664660568 664830933 664444962 665109253 666192703 664734421 664480743
1437.9 664480743 665773392 666192017 666315613 666377182 666363602 667157516 667701492 667740097 668182983 668951035
1447.6 668951035 668389435 668106461 668824387 669123840 669125519 669416199 670245667 671324615 672613907 672053299
1457.2 672053299 669899445 671565323 672949142 674341125 674943542 675368652 677285309 676983261 676237259
1465.9 676237259 677794876 679050674 679713898 680367889 681991196 683751068 684069290 684408722 686505127
1474.6 686505127 688983917 689792938 690276871 691755829 692673645 693509750 693866806 693751602 694671707
1483.2F94671707J432648O92673J134109J141892j014862Q46481J64490k441941m05121
1491.9F96222076L92456J45417r613L49807l207244R80072N86547k755432j69449p06481
1501.6F91828156j019593p01980P63168N75104m960480k612534k55889R25750j640091
1510.2F82901611J93558j099930l198776n02701l62778L20282j907882l325653J364975
1518.9F74382706K682495j357193n179672J07574k88238J104965j946564j157150P1640
1527.6F68420563j716233n33447J97601Q7204m80880o54373l138733O85043K28424
1536.3F63095169o71768J270981k047577k452927K376404K80838k021637L9597L82385
1545F60251465j856537P72781K42615Q37860O79703j485214L70712P60269J732559
$$ plain form
1483.2 694671707 696104355 696797028 697931137 699073029 698058167 698904648 699069138 696627197 696222076
1491.9 696222076 696614532 696759949 696750336 697100143 693892899 694872971 695459518 692704086 692534637 691828156
1501.6 691828156 690808563 690106583 690869751 691444855 686484375 683871841 683615952 684541702 682901611
1510.2 682901611 683095169 681995239 678796463 678293762 677930984 678251266 676343384 673017731 674382706
1518.9 674382706 677065201 675708008 670528336 670635910 670347672 671452637 669506073 668348923 668420563
1527.6 668420563 666704330 666170883 666368484 666455688 665974808 665320435 662181702 662866745 663095169
1536.3 663095169 662423401 663694382 661646805 659193878 661570282 661851120 659829483 659869080 660251465
1545 660251465 658394928 659167709 659410324 660248184 660927887 659442673 659813385 660573654 662306213
1553.6F62306213r42459J45340K586060K258682j644897j2056122O270218L907623
1561.4F62830658K084808J138611Q54492m5089j08033J145325R57871J034851l113556
1570F66779938J49612J171951q8424N81360R21554N58701m750214J124039R44671o06231
1579.7F66786957k32544p86057l26156j123352q70819o11649p20139r22012j535873
1588.4F59658356j54343q04672j001206j622772j104126p29599j954269j427078j896744
1597F48963547q23441j222610j045990j280670j449662r26361k480049j574974k017670
1605.7F36142120j720581k257881j321144j050568k582359r70383k064323j094399
1613.4F23080482j509552k93312L09449q145409o66504j295929q50715j867218o17295
$$ plain form
1553.6 662306213 661363754 661509094 664095154 666353836 664708939 652652817 658923035 662830658
1561.4 662830658 664915466 666054077 666908569 666863480 666755447 667900772 668858643 669893494 666779938
1570 666779938 666929550 668101501 668013077 668594437 669515991 670074692 665324478 666448517 667393188 666786957
1579.7 666786957 666554413 665768356 665442200 664318848 663448029 662836380 662116241 661194229 659658356
1588.4 659658356 659504013 658699341 657698135 656075363 654971237 654241638 652287369 650860291 648963547
1597 648963547 648140106 646917496 645871506 644590836 643141174 642214813 639734764 638159790 636142120
1605.7 636142120 634421539 632163658 630842514 629791946 627209587 626239204 624174881 623080482
1613.4 623080482 621570930 621277618 621587067 613441658 612775154 611479225 610628510 608761292 608143997
1622.1F08143997m51546m127082r27964j370697J72272k770157k842941q46520r79881
1630.8E93999481o00776j439019L95356k01073k434960k105255L46451j140900k63023
1639.5E86556282J059876j237641N96886m82559N50804J461792q41637J121330k375679
1648.1E86409454J239319O79894J818275J758766l341446J094361k0943K233543R31168
1656.8E92802391J445541O33660J012420Q45070P04728J807212j023368J927337J378861
1665.5F01533852J332664J840401J998634P87888q35648K779350l1280J427841K699967
1674.2F13533669J791725j9188J387863K501106J253281K224350N22766J901321L935166
1682.9F29032059M27208m64707P87010L735733K624283J073647J618576J116753J885223
$$ plain form
1622.1 608143997 607692451 603565369 602637405 601266708 601438980 598668823 595825882 594979362 593999481
1630.8 593999481 593398705 591959686 592355042 592153969 589719009 587613754 587960205 586819305 586556282
1639.5 586556282 587616158 586378517 586975403 586492844 587043648 588505440 587663803 588785133 586409454
1648.1 586409454 587648773 588328667 590146942 591905708 588564262 589658623 589637680 591871223 592802391
1656.8 592802391 594247932 594881592 595894012 596739082 597443810 599251022 598227654 600154991 601533852
1665.5 601533852 602866516 604706917 606705551 607493439 606657791 609437141 609405861 610833702 613533669
1674.2 613533669 615325394 615306206 616694069 619195175 620448456 622672806 623195572 625096893 629032059
1682.9 629032059 629459267 628994560 629781570 633517303 636141586 637215233 638833809 639950562 641835785
1691.5F41835785J825943K171097K667236K866898j700135K646714M537582M569397
1699.3F61420517M724350o281586L681336L178787K628097K065659J578674J942063
1707F74937897J475525K650451K103882J056519J464386J469116K154465P18002p09000
1715.6F87321243J737137J437225l573684J236877J977616K87017o7138p4845n02166
1724.3F89779282K95944O35986L07846O26984K149429J059647o15387K291946L782959
1733G00314636j13449o462173J849136K254639J265793K221679Q07877k213745K233505
1741.7G02157898K528763j30997o9275J851959K045975J095963Q40225J010132L109207
1750.4G14439850J441040r09958K721100K112884J741791K504044k11182r9106J444779
$$ plain form
1691.5 641835785 643661728 645832825 648500061 651366959 649666824 652313538 656851120 661420517
1699.3 661420517 666144867 659863281 663544617 666723404 669351501 671417160 672995834 674937897
1707 674937897 676413422 679063873 681167755 682224274 683688660 685157776 687312241 688030243 687321243
1715.6 687321243 689058380 690495605 686921921 688158798 690136414 690423431 690356293 690281448 689779282
1724.3 689779282 690075226 690711212 691019058 691646042 693795471 694855118 694239731 696531677 700314636
1733 700314636 700201187 693739014 695588150 697842789 699108582 701330261 702138138 699924393 702157898
1741.7 702157898 704686661 704555664 704486389 706338348 708384323 709480286 710320511 711330643 714439850
1750.4 714439850 715880890 714970932 717692032 719804916 721546707 724050751 723839569 723740463 725185242
1759G25185242J796951K772293o1417j256027J314774R12018O29806Q98743J073990
1767.7G33266373j621704M64477K471695O80008j600037j523208K647247J759415j089630
1776.4G35454636O85806M64477P59430P70493n62058J14975P72248Q46557l80706j76850
1786G38749008P95365M51660K7237O68563L39127j99127j045303k13852K484741J100159
1795.7G43157578j284333K3728J162948m7226j424179J199341J51978l93601J063919
1804.4G43610153L50266J67923K14462l31268L27911J174469o89697n74188O45141
1813G44895172K88162J72882j8615P68890l9215r7198N27343l79028K8763n29633L08762
1823.7G45926285J260605j194229l34321J188736J397629Q47092k303391o12869Q56857
$$ plain form
1759 725185242 726982193 729754486 729693069 728437042 729751816 730663834 731293640 732192383 733266373
1767.7 733266373 731644669 732109146 734580841 735260849 733660812 732137604 734784851 736544266 735454636
1776.4 735454636 736140442 736604919 737364349 738134842 737572784 737687759 738460007 739306564 738925858 738749008
1786 738749008 739544373 739996033 740023270 740691833 741030960 740831833 739786530 739572678 742057419 743157578
1795.7 743157578 741873245 741896973 743059921 743012695 741588516 742787857 742939835 742546234 743610153
1804.4 743610153 743960419 744128342 744342804 744011536 744339447 745513916 744824219 744250031 744895172
1813 744895172 745183334 745356216 745337601 746106491 746067276 745970078 746497421 746118393 746147156 745617523 745926285
1823.7 745926285 747186890 745992661 745658340 746847076 748244705 749091797 746788406 746175537 747032394
1832.3G47032394J35956K75574Q5449J77689L35312m09851L27301l4027K8686K97470
1842G48251953J132660J562576l369217O943J260681j69220o96563n3406O88553j30081
1851.6G48484879k14692J22300L47290L509j61056N00030M58908R5978m47235J29013
1861.3G49318924P0190m1885K58942J26190L47290l40729L64304l13034j350708K27813
1870.9G48667297L92533M52347j33820m4708R7198J48697M68674K83127l22800p57599
1880.6G49250946Q7509K3270L20206L64303l03345p6370l15399P79037O35834j444320
1890.2G49321671k44675M13055N5084N15214K44522j063309m1733M28543m9591j73035
1899.8G49405746r9639L93600J4191l20130l74832J450K32162k43377J86080Q15354
$$ plain form
1832.3 747032394 747168350 747443924 747529373 747707062 748042374 747632523 747959824 747925797 747954483 748251953
1842 748251953 749384613 750947189 747577972 747584915 748845596 748676376 747979813 747926407 748614960 748484879
1851.6 748484879 748270187 748392487 748739777 748743286 748582230 749082260 749541168 749637146 749189911 749318924
1861.3 749318924 749389114 749347229 749606171 749732361 750079651 749738922 750103226 749790192 748439484 748667297
1870.9 748667297 749059830 749512177 749378357 749333649 749430847 749579544 750048218 750331345 750008545 749250946
1880.6 749250946 749338455 749361725 749681931 750046234 749742889 749666519 749351120 750130157 750765991 749321671
1890.2 749321671 749076996 749490051 749545135 750060349 750304871 749241562 749199829 749628372 749578781 749405746
1899.8 749405746 749306107 749699707 749713898 749393768 749018936 749020386 749252548 749009171 749195251 750010605
1909.5G50010605j47171o50330L86505l12881m79279q7967k14996Q68607m40140q29392
1919.1G48103561N39093O36139P29294r08890r30709N48782K19879l95813k99988k66876
1928.8G47974472j57700J59302L9520J60065j42975j88522J47858K17437K213n22919
1938.4G47688751k74734k07901O24160P36161j352692j68457N11704j32218R7962J32141
1948.1G47654877j33057j78375j63193k01263k91291J6632K38877l08838k07825K36283
1957.7G46662827L0212m02222l21960J39465n188J48392P6446k91519j3122j59149
1967.3G45864182l21274R4146L32337k4719j86539M6616m120l71018n67169k8992J57852
1978G44991302l356L7307N6687K7313k86560k01264j0299o0044K7237q3160m49905
$$ plain form
1909.5 750010605 749863434 749213104 749599609 749286728 748807449 748719482 748504486 749373093 748932953 748103561
1919.1 748103561 748642654 749278793 750008087 749099197 748168488 748717270 748937149 748541336 748241348 747974472
1928.8 747974472 747816772 747976074 748015594 748175659 748032684 747844162 747992020 748209457 748211670 747688751
1938.4 747688751 747414017 747206116 747830276 748566437 747213745 747045288 747556992 747424774 747522736 747654877
1948.1 747654877 747521820 747343445 747180252 746978989 746687698 746704330 746943207 746634369 746426544 746662827
1957.7 746662827 746693039 746290817 745968857 746108322 746103134 746251526 746327972 746036453 746023331 745864182
1967.3 745864182 745542908 745637054 745969391 745944672 745758133 745804749 745800629 745429611 744862442 744833450 744991302
1978 744991302 744987946 745025253 745081940 745109253 744822693 744621429 744611130 744551086 744578323 744495163 744045258
1988.6G44045258n77851J30844O59867k47269l96729K48414l68119o97479k63596N1499
1998.2G42584839k20795m78515L35311M30222K3956P7m0894M120m01154l89022k69166
2008.8G41578979l21731j7166k02332k31933K43606J56327L1280R8496l23639j49765
2018.5G40862122j56174n56336k81066p6752o8054j13297Q2321o1111j84708o6757
2028.1G39380188m84238l94058j45416L8757N9128P1411M7989l73077q7357J67389
2037.7G38280716j02310l76053l7918q2855l23639J99432l96500m55322J3962l9444
2047.4G36680069M2267j77689Q2550P401j98364j70365o9122K65808l8834j83944j52131
2058G36087646k15072j15433j27334k93198l06473M5014K78701m00924p18537L10364
$$ plain form
1988.6 744045258 743467407 743598251 744258118 744010849 743614120 743862534 743494415 742796936 742533340 742584839
1998.2 742584839 742364044 741885529 742220840 742651062 742675018 742675095 742634201 742638321 742237167 741848145 741578979
2008.8 741578979 741257248 741240082 741037750 740805817 741049423 741205750 741237030 741335526 741011887 740862122
2018.5 740862122 740705948 740149612 739868546 739791794 739723740 739610443 739692764 739631653 739446945 739380188
2028.1 739380188 738895950 738501892 738356476 738395233 738454361 738525772 738573761 738200684 738113327 738280716
2037.7 738280716 738178406 737802353 737764435 737681580 737357941 737557373 737160873 736705551 736719513 736680069
2047.4 736680069 736722336 736544647 736627197 736634598 736436234 736265869 736196747 736462555 736423721 736239777 736087646
2058 736087646 735872574 735757141 735629807 735336609 735030136 735075150 735353851 734952927 734234390 734544754
2067.6G34544754K05841m17709k52304m0436K53906J37329J05820l41263k81296J57242
2077.3G34071884l11966j99585k52075l51028j58539q1406J71738L53241L26233o6681
2086.9G33501816k30866l54004k56576j36490o2943R6207k04620k94342k77252K47726
2096.6G32028656M61578r5291k91519j69449J43051N6229J1368m31366l38135M64325
2106.2G31839447O1798N6229J44195j69067k3499r5596k26440R842J2207k54746p2708
2116.8G31281662p6065K03628L07694j58386R2392r7123l95507N0888n1270n82046
2126.5G30575867k95029J92642K64817J04522j77612J96915J74408j55640j67465k34375
2136.1G30479050P5988j30386l00827j5411P2708K35519K60315K33612K40784j17874
$$ plain form
2067.6 734544754 734750595 734332886 734080582 734040146 734294052 734431381 734537201 734195938 733914642 734071884
2077.3 734071884 733759918 733560333 733308258 732957230 732798691 732717285 732889023 733242264 733568497 733501816
2086.9 733501816 733270950 732916946 732660370 732523880 732460937 732557144 732352524 732058182 731780930 732028656
2096.6 732028656 732490234 732394943 732103424 731933975 732077026 732133255 732144623 731713257 731375122 731839447
2106.2 731839447 731901245 731957474 732101669 731932602 731909103 731813507 731587067 731596909 731609116 731354370 731281662
2116.8 731281662 731205597 731409225 731716919 731558533 731650925 731553802 731158295 731209183 731157913 730575867
2126.5 730575867 730280838 730473480 730738297 730842819 730665207 730862122 731036530 730880890 730713425 730479050
2136.1 730479050 730555038 730424652 730123825 730108414 730181122 730416641 730676956 730910568 731151352 731033478
2145.8G31033478m82712k32468j25885r6512J65406J80740j54419n64422j59836L71780
2155.4G29935150L73001J71433p0877k49939l7079K51465j56784n6610l2731l52630
2165G29774399o7597J62583K27508J63193L24783l2806j39008K25296j90658k76718
2174.7G30170975k40479n7831j26724k30102J82953J75018K53143K3117l13949k24610
2184.3G29611511j68457o9427p7k18353J24970P42416K62451L5477j52130j58844J81122
2194.9G30190659j81427k35978m17709j01700K72293J14899K27432K23847L03726k20795
2204.6G30175247l98407q4533J9760M3411j43585j40305l76663q2169K42539J84936
2214.2G29440231J87683J49384J84936k12326l1204p7820o03332l11508K6397r1629
$$ plain form
2145.8 731033478 730550766 730318298 730192413 730095901 730261307 730442047 730287628 729723206 729563370 729935150
2155.4 729935150 730308151 730479584 730408707 730158768 730121689 730373154 730216370 730159760 730127029 729774399
2165 729774399 729706802 729869385 730096893 730260086 730584869 730552063 730413055 730638351 730447693 730170975
2174.7 730170975 729930496 729872665 729745941 729515839 729698792 729873810 730126953 730150070 729836121 729611511
2184.3 729611511 729443054 729373627 729373550 729155197 729280167 730022583 730285034 730320511 730168381 730009537 730190659
2194.9 730190659 730009232 729773254 729355545 729253845 729526138 729641037 729868469 730092316 730396042 730175247
2204.6 730175247 729776840 729692307 729712067 729755478 729611893 729471588 729094925 729012756 729255295 729440231
2214.2 729440231 729627914 729777298 729962234 729749908 729718704 729640884 729037552 728726044 728752441 728660812
2223.9G28660812L2044M67224K5406l03421m4327K09732J10397l24554k52228k59552
2233.5G28321533Q4152K70844n570m425J49765L31955n0506j71051k92206n43442l86658
2244.1G27704391j06735j23367k29569K16523K33078L79333K52838J29776K36130n54047
2253.8G28138351m96673m49219j69372J97525j66932J10627L17917N00030M6921k57416
2263.4G27771759M3716j62506l23715l58047m2801k66571k77252M81796M00085K6932
2273G27293396J86920J95770k71911m92554k73285O3324j21689n6991J85470J65482
2282.7G26873932L60641L3036j4420M3411Q8806k77786o56357R4910m14352n28717
2292.3G25603104L05175M80805J31912q5373L51257j68991k67944l33862k27509K47193
$$ plain form
2223.9 728660812 728692856 729160080 729185486 728882065 728837738 729047470 729157867 728833313 728581085 728321533
2233.5 728321533 728405685 728676529 728670959 728666534 728816299 729148254 729097748 728926697 728634491 728091049 727704391
2244.1 727704391 727597656 727474289 727244720 727461243 727694321 728073654 728326492 728456268 728692398 728138351
2253.8 728138351 727641678 727192459 727023087 727220612 727053680 727164307 727482224 727982254 728029175 727771759
2263.4 727771759 727815475 727652969 727329254 726971207 726928406 726661835 726384583 726866379 727266464 727293396
2273 727293396 727480316 727676086 727404175 726911621 726638336 726701660 726579971 726522980 726708450 726873932
2282.7 726873932 727234573 727267609 727253189 727296600 727385406 727107620 726451263 726546173 726131821 725603104
2292.3 725603104 725908279 726389084 726520996 726435623 726786880 726617889 726349945 726016083 725788574 726035767
2302G26035767m29001n7068J23062j01242Q8882M31290M04587k20184o5461l95279
2311.6G25815353l65448m17404j19629M90342P9421O26069L41415M272l48434m42505
2321.3G25663452J29700r67484m29306j0147J58005O52389k84957j59912P21664R29642
2330.9G26403046k3880o03180o06537o20041p01675r32160r5138Q58459J205597O03332
2340.6G25487823L07389m38156k11182R69086n42603q08029k21786p5455Q10928Q91495
2350.2G26169510L33252j24512n84488l92990o83594q42666J083450J545792o87790
2358.9G25815964j701584j31912O68335o89316l52249L76663Q4457j21002M56696J627807
2368.5G26033859L41492j392365o98928M48532J8234j78986M08783J54724L17154N58319
$$ plain form
2302 726035767 725606766 725549698 725672760 725571518 725660400 726091690 726496277 726276093 726210632 725815353
2311.6 725815353 725449905 725032501 724912872 725403214 725482635 726108704 726450119 726454391 726105957 725663452
2321.3 725663452 725793152 724825668 724396362 724386215 724544220 725196609 724911652 724751740 725473404 726403046
2330.9 726403046 726379166 725775986 725169449 724549408 723847733 722915573 722820435 723678894 724884491 725487823
2340.6 725487823 725795212 725357056 725145874 726114960 725572357 724764328 724542542 724467087 725278015 726169510
2350.2 726169510 726502762 726378250 725793762 725400772 724717178 723874512 724957962 726503754 725815964
2358.9 725815964 724114380 723982468 724650803 723961487 723609238 723985901 724070358 723949356 724406052 726033859
2368.5 726033859 726375351 724982986 724284058 724732590 724750824 724571838 724980621 725135345 725452499 726010818
2378.2G26010818o1569m64248k51770K74353N50155p3471p24945j31607N01480M01840
2387.8G26031036J78757n1651j39389P477R4681l50800n67779j28785K92969L82309
2397.4G25748825R9106j90735l55301j33972L93066K07444n71595m47082N8365m8676
2407.1G24759445L7995K51693L59116q3542l44620M6158k13318k75345j65939j73950
2416.7G24197693j6632J7242K17133J18713n9814k84729k01493K31400J71509k6779
2426.4G24364243k94037k63291l20739k17896L84674J65482k63062l58200j81427J4114
2436G23029861M6845K49634m7760n1270J63193m30527m08096J98974K6093l34473j78070
2446.6G22264404k18124k10877K39792L72620K13699k93960l11356J39694k72445k45819
$$ plain form
2378.2 726010818 725949249 725485001 725233231 725507584 726057739 725984268 725259323 725127716 725629196 726031036
2387.8 726031036 726209793 726158142 726018753 726026230 726120911 725770111 725202332 725073547 725366516 725748825
2397.4 725748825 725847931 725657196 725301895 725167923 725560989 725768433 725196838 724749756 724808121 724759445
2407.1 724759445 724797440 725049133 725408249 725324707 724980087 725026245 724812927 724537582 724371643 724197693
2416.7 724197693 724181061 724198303 724415436 724534149 724474335 724189606 723988113 724219513 724391022 724364243
2426.4 724364243 724070206 723806915 723486176 723268280 723652954 723818436 723555374 723197174 723015747 723029861
2436 723029861 723076706 723326340 723278580 723227310 723390503 722959976 722551880 722750854 722776947 722442474 722264404
2446.6 722264404 722046280 721835403 722075195 722447815 722661514 722367554 722056198 722195892 721923447 721677628
2456.3G21677628K66799N5771l76892j09863J75629l27759j80130j5869j08795N3787
2465.9G21110306k63443j80130k67792l37143M10843M48608j87225k27203j49460l28674
2475.6G20028687j13450j37939j29700k83737n20172O6681K39105L14407J22910p9498
2485.2G19507294R536p05871p52869K4338L79333k9296n2491J84021j93328k54822
2494.8G18115845l39203m8905M425l56369j77230j76316M4556L13797K82593J4343
2504.5G17677536j1978q4381m43192j4877J13602k58408l83377k17133p5912o0578
2514.1G16241302N3254l1510K37046J9455l49885j92794m11911j64795J29699M2191
2523.8G15572052R7351K5024j26342n188P7972j62582j58615k65808m47083k01263
$$ plain form
2456.3 721677628 721944427 722000198 721623306 721513443 721689072 721361313 721181183 721165314 721056519 721110306
2465.9 721110306 720846863 720666733 720398941 720061798 720472641 720921249 720734024 720506821 720357361 720028687
2475.6 720028687 719915237 719777298 719647598 719363861 718843689 718910370 719149475 719463882 719586792 719507294
2485.2 719507294 719516830 718810959 718058090 718082428 718461761 718432465 718379974 718563995 718370667 718115845
2494.8 718115845 717776642 717727737 717732162 717375793 717198563 717022247 717066803 717380600 717663193 717677536
2504.5 717677536 717665558 717581177 717137985 717123108 717236710 716978302 716594925 716377792 716301880 716241302
2514.1 716241302 716294556 716263046 716500092 716519547 716169662 715976868 715564957 715400162 715529861 715572052
2523.8 715572052 715669403 715694427 715568085 715562897 715640869 715478287 715319672 715053864 714606781 714405518
2533.4G14405518J26953K88620M62036K99454n08881o80466k62527m7684N1041r6817
2543.1G14037247j75324K0752r0256k24533L56446Q8195n09491k2735k518l67050k86331
2553.7G12824402N4703l968o0959J00861r3231j51673k05383l4027j57013j62201J67389
2564.3G12278900k65655j6022J37787k05994l3951j31378j09177l3035k87399k88010
2573.9G11046066K42310j3580n03312O5842j04217k24381L05710r16k80685l49655
2583.6G10183182l50800o866r461k55279k86331j73493P0877L72620M17633j16959
2593.2G09845123o99005o26297l61633l01209m1504J63880j54343k05536J66397J07270
2602.9G07893143k08817k47879k83813m02756k13318N3406J44806o9351j94855k30713
$$ plain form
2533.4 714405518 714532471 714821091 715283127 715582581 715073700 714393234 714130707 714083023 714134064 714037247
2543.1 714037247 713861923 713882675 713792419 713567886 713924332 714012527 713503036 713480301 713477783 713110733 712824402
2553.7 712824402 712879105 712875137 712814178 712915039 712821808 712670135 712464752 712430725 712273712 712111511 712278900
2564.3 712278900 712013245 711997223 712135010 711929016 711895065 711763687 711654510 711621475 711334076 711046066
2573.9 711046066 711288376 711274796 710771484 710837326 710733109 710508728 710814438 710813522 710532837 710183182
2583.6 710183182 709832382 709825516 709816055 709560776 709274445 709100952 709171829 709544449 709962082 709845123
2593.2 709845123 709146118 708519821 708158188 707856979 707815475 707979355 707825012 707619476 707785873 707893143
2602.9 707893143 707684326 707436447 707152634 706749878 706536560 706589966 706734772 706665421 706470566 706239853
2612.5G06239853k97699J79901j10474n80825k14310j10092l2044l43017j32447M41285
2622.1G05040131m8447l15781l11813k43225j57700k09045o1340k05002k72599k28729
2631.8G02986450m05121j13754J53809j13449k43683m72870l82233K28577K61688k56805
2641.4G01642609o60859l66134j50299l05176l98407l20129K80914K35748r2087j07421
2651.1F99758759l01590k84272l16925j65405J44653K0295o31562n73730J76849M0512
2660.7F97867584o0196J21842L2196j26496j82724k98843n62210k62070j54800l07465
2670.4F96066818j26266Q3389J82343P7743o2942l32489k97547l90625l87497J74256
2680F94987183j84250n95932k06299J68762J89819j26724l52478l88412k13623k70920
$$ plain form
2612.5 706239853 705942154 706122055 706011581 705430756 705216446 705106354 705074310 704731293 704598846 705040131
2622.1 705040131 704991684 704675903 704364090 704120865 703963165 703754120 703692780 703487778 703215179 702986450
2631.8 702986450 702581329 702467575 702621384 702507935 702264252 701791382 701409149 701637726 701899414 701642609
2641.4 701642609 700981750 700615616 700465317 700160141 699761734 699441605 699722519 699958267 699866180 699758759
2651.1 699758759 699457169 699172897 698855972 698690567 698835220 698855515 698223953 697650223 697827072 697867584
2660.7 697867584 697807388 697929230 697961426 697834930 697652206 697353363 696791153 696529083 696374283 696066818
2670.4 696066818 695940552 696023941 696206284 696284027 696221085 695888596 695591049 695200424 694812927 694987183
2680 694987183 694802933 694207001 694000702 694169464 694359283 694232559 693880081 693491669 693278046 693007126
2689.6F93007126k34680J96685Q1711k06756k52686l20129k19879p4616j11084k75879
2699.3F91589813l00827k07825j15280O2638j70822l39127o9428r1705K31018K76337
2708.9F90864792m77066m65698k32239n20020l92456k1209p0878J5488J57166q9569
2718.6F88768311m19083o40411l40271r8038j49079m4860j01700l0289Q8272J13144
2728.2F87145996j40152n59006k82135k55890m48226l4943k38724m03213o5079k12860
2737.9F84505768j1292R5978j48773q6670j37634j09406l13110m34876j90963m9363
2747.5F83119659L7232p6828q6899k77023k64359O1722j54877k43301l87192o34689
2757.2F81093445j80283L968m07258o9580L00293j52282m66385n32151l86199k71836
$$ plain form
2689.6 693007126 692772446 692969131 693050842 692844086 692591400 692271271 692051392 691976776 691865692 691589813
2699.3 691589813 691288986 691081161 690965881 691028519 690857697 690518570 690449142 690357437 690588455 690864792
2708.9 690864792 690387726 689922028 689689789 689169769 688777313 688756104 688685226 688700714 688857880 688768311
2718.6 688768311 688349228 687708817 687368546 687270508 687121429 687076569 686974869 686944580 687032852 687145996
2728.2 687145996 687005844 686446838 686164703 685908813 685460587 685425644 685186920 684783707 684718628 684505768
2737.9 684505768 684494476 684590454 684441681 684355011 684217377 684107971 683794861 683359985 683169022 683119659
2747.5 683119659 683156891 683080063 682993164 682716141 682451782 682513504 682358627 682115326 681728134 681093445
2757.2 681093445 680913162 680917130 680509872 680440292 680740585 680588303 680121918 679589767 679203568 678931732
2766.8F78931732j05972O6299r6283P1946J94702j37558n64881m90417j63803j58386
2776.4F77547379l53089p80868n45731k0218Q4763O5536j45874m22211m89425K8915
2786.1F74969177k86331o74744J89286p3700n96848k05002k99072k40555j7852l61710
2795.7F72402649l71170j73798l73535n54657n90286n20096l76816J14060R0561l99781
2805.4F69247131l07464m66690l77045j17493l50647p14874q66089j42441K01874j58081
2815F65948181k69470l12271n31998m33502j76621o77948o82525j13449l1204m96064
2824.7F62223129p42416l13492m48303m29306m91562o95725k85415l92990j33896P4081
2834.3F58364105m67834q86154q19397m66385r05686j374359j049347o38580j008530
$$ plain form
2766.8 678931732 678825760 678892059 678795776 678867722 679062424 678924866 678359985 677869568 677705765 677547379
2776.4 677547379 677194290 676413422 675867691 675847473 675932236 675997772 675851898 675429687 674940262 674969177
2786.1 674969177 674682846 674008102 674197388 674123688 673526840 673321838 673022766 672782211 672764359 672402649
2795.7 672402649 672031479 671857681 671484146 670929489 670339203 669819107 669442291 669556351 669646912 669247131
2805.4 669247131 668939667 668472977 668095932 667978439 667627792 666912918 666046829 665904388 666106262 665948181
2815 665948181 665678711 665366440 664834442 664400940 664224319 663546371 662863846 662750397 662719193 662223129
2824.7 662223129 661480713 661167221 660718918 660289612 659798050 659102325 658816910 658423920 658290024 658364105
2834.3 658364105 657896271 657010117 656190720 655724335 654818649 653444290 652394943 651756363 650747833
2843F50747833j257324j210098j910782j247101l59116j379013j825790r48715l85285
2851.7F40224609n61981o96945n80330k63061k15340k5673L08418M8676m2305k72980
2861.3F37923088j17950J59416l56064l38249m08974p66487n25246l57322m65889m23355
2870.9F34322968m92211n32875l43323m38347j27868J02157o0958j54038p43675o26717
2880.6F30905113k16751k75307j94244l44849m07333k38228J47934k89993j089096
2889.3F27997246r05915q89053n80902k49748l29476r6016k73361o26564p00035o55250
2898.9F22690926q11539o66962m09546o57005n86395o02532l96042m5166j40037l50189
2908.6F18025513q02498n24750l59726p46612q89473r49440o42739r77936j308136
$$ plain form
2843 650747833 649490509 648280411 646369629 645122528 644763412 643384399 641558609 640609894 640224609
2851.7 640224609 639662628 638965683 638385353 638122292 637906952 637881279 638189697 638238373 638196068 637923088
2861.3 637923088 637805138 637964554 637608490 637270241 636861267 636094780 635569534 635212212 634746323 634322968
2870.9 634322968 633830757 633297882 632954559 632516212 632388344 632490501 632429543 632275505 631531830 630905113
2880.6 630905113 630688362 630413055 630218811 629873962 629466629 629228401 629376335 629086342 627997246
2889.3 627997246 627091331 626202278 625621376 625371628 625042152 624946136 624672775 624046211 623346176 622690926
2898.9 622690926 621879387 621212425 620802879 620145874 619559479 618956947 618560905 618515739 618375702 618025513
2908.6 618025513 617223015 616698265 616338539 615591927 614702454 613753014 613110275 612132339 610824203
2917.2F10824203p44628m65088q49686j170197p42225k58598K44598J34201l52860
2925.9F06619720j05018o523L16810L68080Q9951K54707k1629j35651P0954K62146
2935.6F07713547N87005N57328N60379M31289O6300K94952M36058J87416J58387L49617
2945.2F11342278J91307k18697J3657R651j33438j52321n29595k67295j82343m70886
2954.8F09602318m57421l13758L3607O2103j86386n45273k29072L64380J31607N1536
2964.5F08513641K71912N81398M57382k36053K13508R99947L17154j41564O21300J074143
2974.1F12672768M22210O5003O77376L87535J21917N77927L83492K33154r2621k83012
2983.8F15165749J41639N44281P19567K64625o8741L61596M67605q6059r5711K77443
$$ plain form
2917.2 610824203 610079575 609614487 608764801 607594604 606852379 606593781 606838379 606972580 606619720
2925.9 606619720 606514702 606508179 606824989 607193069 607283020 607537727 607516098 607380447 607451401 607713547
2935.6 607713547 608300552 608857880 609418259 609849548 609915848 610210800 610646858 610834274 610992661 611342278
2945.2 611342278 611533585 611314888 611328545 611338196 611204758 611052437 610522842 610255547 610073204 609602318
2954.8 609602318 609144897 608831139 608864746 608926849 608740463 608195190 607966118 608330498 608462105 608513641
2964.5 608513641 608785553 609366951 609824333 609588280 609801788 610801735 611118889 610977325 611598625 612672768
2974.1 612672768 613094978 613159981 613837357 614224892 614346809 614924736 615308228 615541382 615448761 615165749
2983.8 615165749 615307388 615851669 616571236 616835861 616767120 617128716 617596321 617510262 617414551 617691994
2993.4F17691994K89879j10169k34833L4829k07863P6L18680L28140K56958j59073
3003.1F18208618j95846m75426n32646l20092j53999L5553j58539l8185L0899j9264
3012.7F16381073o11954n47027J85165k42538l26882l67012l24783k06642m11148j57776
3022.4F13370476k68593l60146n54466n57098l45650o76117o58340k08893K33917p7934
3032F09897156k72484p8507n93643p20978m68063n69153n63430n78194m09622j56441
3041.6F05486641m64935k18697j70174j090164q64067n6915k35596n98945j43509l31955
3051.3F01311684r05991l29704k62604n22270l37219k87018m39835o44531n81741n50614
3060.9E96450157l63121n2795k48261n27801j97869n26504r46694m34875n11513l08189
$$ plain form
2993.4 617691994 617981873 617871704 617636871 617671700 617463837 617463913 617782593 618110733 618367691 618208618
3003.1 618208618 618012772 617537346 617004700 616684608 616530609 616566162 616407623 616369438 616400337 616381073
3012.7 616381073 615769119 615222092 615407257 615164719 614837837 614470825 614146042 613939400 613528252 613370476
3022.4 613370476 613101883 612741737 612187271 611630173 611284523 610608406 609950066 609741173 609975090 609897156
3032 609897156 609624672 609546165 608952522 608231544 607763481 607194328 606630898 606052704 605643082 605486641
3041.6 605486641 605021706 604803009 604632835 603542671 602678604 602621689 602386093 601787148 601643639 601311684
3051.3 601311684 600405693 600075989 599813385 599291115 598953896 598666878 598227043 597582512 597000771 596450157
3060.9 596450157 596087036 596034241 595785980 595258179 595060310 594533806 593587112 593152237 592640724 592332535
3070.6E92332535j55258k49291j48353m91906j68647k55013q84743o13517j63193l45688
3080.2E88856926m40178k65579l54271k10877m59976o39000n22690k57492l8490n96809
3089.9E85071564n57785n01023l60336j47209k65236k5253o47469q15887k44828j28135
3099.5E81378403k50054o89544j123352q33016q2550k17781l40271o6605k24647p49588
3109.1E76800995p00722j41945l04298m80423o31447k44865k21215r38949o76461n63812
3118.8E71896858m51813k73284r1896m80691r16976k69890m04778o62002o89431n33027
3128.4E67123070l94554m16527j22261n94063j026955o40945k21100r77020q94280
3137.1E61835365O00167K36206r34258j011314k76184m26407p32575n47256p49245
$$ plain form
3070.6 592332535 592177277 591927986 591779633 591287727 591119080 590864067 589979324 589365807 589202614 588856926
3080.2 588856926 588416748 588151169 587796898 587586021 587126045 586487045 585964355 585706863 585668373 585071564
3089.9 585071564 584513779 584012756 583652420 583505211 583239975 583214722 582567253 581751366 581506538 581378403
3099.5 581378403 581128349 580438805 579315453 578482437 578399887 578182106 577841835 577775230 577550583 576800995
3109.1 576800995 576100273 575958328 575654030 575173607 574542160 574297295 574076080 573137131 572460670 571896858
3118.8 571896858 571445045 571171761 571079865 570599174 569682198 569412308 569007530 568345528 567656097 567123070
3128.4 567123070 566728516 566311989 566189728 565595665 564568710 563927765 563706665 562729645 561835365
3137.1 561835365 562435532 562671738 561737480 560726166 560449982 560023575 559291000 558743744 557994499
3145.8E57994499m46663m70009o75354p42416j79367M4670q00438p08847o82793o81571
3155.4E52651711n81589m65203k43225n07431p35969j052513o86036L205K49214m73747
3165.1E48158417j218567r06410p94449n24330k97356l77541r08546j177025m26254
3173.8E41527939m5662n38521p91016k30369o26221n31730k404p57103j161232p95440
3183.4E36048241K8801n75104o56090J39923n23872m75502p72095j374588j056480
3192.1E30783234n41840K9450K1438o51131p70607m02450q04062k78244j22910o24580
3201.7E26638298k15301o86951j090584n84068N3863o85920j188355l90816n84907
3210.4E21265259n46723l36685N6763R6092r48944j217422o59752q622m28428p41043
$$ plain form
3145.8 557994499 557547836 557077827 556402473 555660057 555480690 555525360 554724922 554016075 553333282 552651711
3155.4 552651711 552070122 551604919 551361694 550854263 550118294 549065781 548379745 548382950 548632164 548158417
3165.1 548158417 546939850 546033440 545238991 544714661 544417305 544039764 543131218 541954193 541527939
3173.8 541527939 541482277 540943756 540152740 539922371 539296150 538764420 538762016 538004913 536843681 536048241
3183.4 536048241 536077042 535501938 534845848 534985771 534461899 533986397 533214302 531839714 530783234
3192.1 530783234 530241394 530270844 530292282 529641151 528870544 528468094 527664032 527385788 527262878 526638298
3201.7 526638298 526422997 525736046 524645462 524061394 524115257 523429337 522240982 521850166 521265259
3210.4 521265259 520718536 520381851 520438614 520534706 519585762 518368340 517708588 517699966 517271538 516530495
3220E16530495m70543o52352o77147n19752k56920q7471n8861k76870o92406q52966
3229.7E11985207n46189n23224o36444n33218n20210j41831o47201j022759n47905
3238.4E06866226k55203J85585k58255q27942n97114J46713M9476n14793l04108o05163
3248E03885422p04003n80177k84614k83928n11780k80457m81720j55639j99395p37495
3257.7D99666214o44264k58065l15589p82395j71089K08130j61438l93944m61616o07262
3267.3D96078682l55148P6522o74781o52161j16806l03078n84907o10428j71471n16624
3276.9D92169800q12302n36041r5062k43111p58705j90354j47933l95394j55563l30849
3286.6D88504486n94902n90782m11034k02865k67640n94635l50570l30277o08520l22266
$$ plain form
3220 516530495 516059952 515407600 514730453 514210701 513953781 513866310 513807449 513530579 512838173 511985207
3229.7 511985207 511439018 510915794 510279350 509746132 509225922 509084091 508436890 507414131 506866226
3238.4 506866226 506611023 506796608 506538353 505710411 505113297 505260010 505309486 504794693 504490585 503885422
3248 503885422 503181419 502601242 502316628 502032700 501520920 501240463 500758743 500603104 500403709 499666214
3257.7 499666214 499021950 498763885 498448296 497665901 497494812 497702942 497541504 497147560 496685944 496078682
3267.3 496078682 495723534 495800056 495125275 494473114 494356308 494053230 493468323 492857895 492686424 492169800
3276.9 492169800 491357498 490821457 490726395 490483284 489724579 489534225 489386292 488990898 488835335 488504486
3286.6 488504486 487909584 487318802 486907768 486704903 486437263 485842628 485492058 485161781 484553261 484230995
3296.2D84230995j40533m57993n17044Q0719k20985q17147n77163l59192q6289k00882
3305.9D80934486o11152l08075j55640n47256l84369m62952m14543j12076p30972r62143
3315.5D76245308m58565k23427o27517l38440j76201m01573J19362n27649q72155o79817
3325.2D72059326m63142l45116r39636m77600q15773p95861q0299j13983R0408o84204
3334.8D67434120q71696n00031j31111R1209o43463l90281j45722q77800r05189k35634
3344.4D62824402k07749m74319n45349m15115j10932p22008j132202l17726L03345
3353.1D59202347l66211p27921l44162n82657m21066m51774m72489K01264k93847j169166
3362.8D54574318p77550l70941n64117p43523o19621L27148K30751o33201m73977m50325
$$ plain form
3296.2 484230995 484090462 483632469 483115425 483196144 482975159 482158012 481580849 481221657 481135368 480934486
3305.9 480934486 480323334 480015259 479859619 479312363 478927994 478465042 478050499 477938423 477207451 476245308
3315.5 476245308 475786743 475563316 474935799 474597359 474421158 474019585 474138947 473611298 472739143 472059326
3325.2 472059326 471596184 471251068 470311432 469833832 469018059 468222198 468141899 468027916 468118324 467434120
3334.8 467434120 466562424 466062393 465931282 466022491 465379028 464988747 464843025 463965225 463060036 462824402
3344.4 462824402 462616653 462142334 461596985 461181870 461070938 460348930 459216728 458899002 459202347
3353.1 459202347 458836136 458108215 457764053 457181396 456760330 456308556 455836067 456037331 455743484 454574318
3362.8 454574318 453796768 453425827 452861710 452118187 451498566 451825714 452056465 451423264 450949287 450498962
3372.4D50498962l23371m41018p22389m20723o8703o4277j36986K5597l47557q74443
3382.1D47125092j080742j58730M04968m37698k85492r5940N9433N8976o70739m75883
3391.7D44443245k4796p27157p01142P31774O26526n33676j075516n84641M34380k14234
3401.3D42374763o74743J28479K18925l71017n78118n88340l72963K66113J31187k7961
3411D40506325K14844j85624o07490k30560j28708l42789k14424j21651O07452N38712
3420.6D40036087j50490O3668r2698m17556l53623K07100J14441J39961M87366m2992
3430.3D39991264o44836m53072M04167M23203M12064j94626o94885M6348J83792L22304
3439.9D39795723J64757L32908K823k74124J23482L47595J110268o63567n62096P81365
$$ plain form
3372.4 450498962 450175591 449734573 449012184 448591461 448522758 448458481 448321495 448347092 447999535 447125092
3382.1 447125092 446044350 445885620 446290588 445852890 445567398 445471458 445530891 445589867 444919128 444443245
3391.7 444443245 444418449 443691292 442990150 443721924 444348450 443814774 442739258 442154617 442588997 442374763
3401.3 442374763 441700020 441828499 442047424 441676407 441098289 440509949 440136986 440403099 440534286 440506325
3411 440506325 440721169 440535545 439928055 439697495 439568787 439225998 439011574 438889923 439497375 440036087
3420.6 440036087 439885597 439949265 439856567 439439011 439085388 439292488 439406929 439546890 440034256 439991264
3430.3 439991264 439346428 438893356 439297523 439720726 440132790 439938164 439243279 439289627 439473419 439795723
3439.9 439795723 439960480 440293388 440296211 440022087 440145569 440493164 441603432 440939865 440377769 441159134
3449.6D41159134M0283K36511J32447J71547K5825l4027L81126M89502R17282Q20809
3459.2D44340439k2659q20427m7722N51185Q06580N78232O2752N40275q5907R232j5564
3469.8D45896416M1237O04896M57840R97620L13453Q9531M67644N1918j43585J69182
3479.5D48946152Q45718J230126J128845n99633l32946J46942j81313Q92792L45001
3488.1D52421684M5281O28051O38581l7575L88870J279335L9101K70386N29327j88293
3497.8D56014748L0861O04591J344871J000634K33612m29421M1886O89125j984r8343
3507.4D59430580J530190J129036o60592M32168M34494O41326O09322K3766N79261
3516.1D64149551O17752Q22106J96762L3760L02544R33342J221847n71823l9482Q72116
$$ plain form
3449.6 441159134 441199417 441435928 441568375 441739922 441765747 441731720 442112846 442602348 443519630 444340439
3459.2 444340439 444317780 443497353 443449631 444000816 444807396 445385628 445448380 445988655 445902748 445911980 445896416
3469.8 445896416 445937653 446542549 447000389 447998009 448311462 448400993 448868637 448920555 448776970 448946152
3479.5 448946152 449791870 451021996 452150841 451551208 451218262 451365204 451183891 452076683 452421684
3488.1 452421684 452466965 453095016 453733597 453696022 454084892 455364227 455403328 455673714 456203041 456014748
3497.8 456014748 456045609 456650200 457995071 458995705 459229317 458799896 458841782 459530907 459528923 459430580
3507.4 459430580 460960770 462089806 461429214 461861382 462295876 462937202 463546524 463570290 464149551
3516.1 464149551 464767303 465589409 465786171 465819931 466122475 467055817 468277664 467705841 467666359 468538475
3525.7D68538475J319428M30526l88565P94831J220436N96809n58395M08172O95076
3534.4D73056793Q19626J090851O4011R08699K88124k90032L01285J235008J466065
3543.1D78940430Q47282M26712p14874P03621j48850J82572J143570Q49151J957665
3551.8D84187279l39661K62833P67326O72493J570168m23127R87320J581345j9531
3560.5D89246445p67670P04384J375694O7215L139649K022247k88468j111717k732773
3569.1D91655006J957283J405983Q35114Q93822J210250J133957M5166J250420m10271
3577.8D99976730N80674J232757L46718J766891J455613J335678j91384J873017K657623
3586.5E11034317j401291k1171k143708J784592K433624J326180P62787l20626L007889
$$ plain form
3525.7 468538475 469857903 470288429 469899864 470694695 471915131 472511940 471953545 472361717 473056793
3534.4 473056793 473876419 474967270 475031281 475939980 476228104 475938072 476239357 477474365 478940430
3543.1 478940430 479787712 480214424 479499550 480203171 480054321 480236893 481380463 482229614 484187279
3551.8 484187279 483847618 484110451 484877777 485550270 487120438 486697311 487684631 489265976 489246445
3560.5 489246445 488478775 489183159 490558853 490626068 493765717 495787964 495499496 494387779 491655006
3569.1 491655006 493612289 495018272 495853386 496747208 497957458 499091415 499136581 500387001 499976730
3577.8 499976730 500557404 501790161 502136879 503903770 505359383 506695061 506503677 508376694 511034317
3586.5 511034317 509633026 509611855 507468147 509252739 511686363 513012543 513775330 513454704 516462593
3595.2E16462593j363563O3362L025551k82021J860313N19791l7842J481858L72581
3603.9E22102623O41632K204018L110084j541977J785813R72862k533073M943466J636352
3612.5E33321800k151069L927078j977616N74074L838349M62646J768799j98898j514511
3621.2E38050652J418571J815987R25369J151657J947861J569290N053711M792290
3628.9E56725388r540062J41334K329292M558945K611962k541466O84776K755547K720375
3637.6E60446091n9853O19202K176780J333428O86035J31149J678810K724572N684204
3646.3E75420418J718597m758949N831299K164879l223153l619918J790008K990875
3654E78314056L645363O347428o703873j334305L839989R84993J258774L72886J856079
$$ plain form
3595.2 516462593 515099030 515162392 518187943 517905922 519766235 520286026 520248184 521730042 522102623
3603.9 522102623 522744255 524948273 528058357 526516380 528302193 529275055 526741982 531685448 533321800
3612.5 533321800 531170731 535097809 533120193 533694267 537532616 537995262 539764061 539565163 538050652
3621.2 538050652 539469223 541285210 542210579 543362236 545310097 546879387 551933098 556725388
3628.9 556725388 547185326 547326660 549655952 554214897 556826859 554285393 554970169 557725716 560446091
3637.6 560446091 560386238 561005440 563182220 564515648 565201683 565332832 567011642 569736214 575420418
3646.3 575420418 577139015 572380066 578211365 580376244 577153091 573533173 575323181 578314056
3654 578314056 581959419 588306847 581602974 580268669 584108658 585093651 586352425 586725311 588581390
3662.7E88581390P13692L47366J378479Q927L547325L888473N63355O36826p235108
3671.4E92430725l05099O582450R313508N033187j6356391j932488M815750M401055
3679.1F03982697r91898j079445J395683J078415Q65250L97072J37329L064461O922607
3687.8F15772171m813995n524254P064209m748879k819824M026985J007271P16896
3695.5F10680580l23601o88018N7678l66135K440300M558945k115059l836517K273140
3704.1F12681313P64732L16505N75791J900558M858818o065025K350311Q404007j2436065
3712.8F13350945J11656L099098L13263M18281K346268K093010l558235o60858N397186
3721.5F22910614j489105n602455M560547K434082K79769k844924k140542L311158
$$ plain form
3662.7 588581390 589295082 589642448 591020927 591029854 594577179 598465652 599029007 599665833 592430725
3671.4 592430725 592125626 598708076 608021584 613054771 596698380 594765892 599581642 603982697
3679.1 603982697 602990799 601911354 603307037 604385452 605250702 605647774 605785103 608849564 615772171
3687.8 615772171 610958176 605433922 612498131 607749252 604929428 608956413 609963684 610680580
3695.5 610680580 610356979 609668961 609726639 609360504 611800804 616359749 614244690 610408173 612681313
3704.1 612681313 613446045 613762550 614338341 616238899 621097717 615032692 617383003 625787010 613350945
3712.8 613350945 613462601 616561699 616874962 617293243 619639511 621732521 618174286 617513428 622910614
3721.5 622910614 621421509 615819054 620379601 622813683 623093452 620248528 618107986 621419144
3729.2F21419144R01527M449272r39903q530350P923737M268188j0103836j477241
3736.9F17910538L144569l34396J101150L299866l760643J545601J1470260k115554
3744.7F32261391k0070763N924950M757271N793838P24411r980545R183617j814652
3752.4F26779518q469429K332230K424011L266678m460907J643982O678085o634827
3760.1F23559341l731079L198433J898575K10915L100853r50661n368385J131134M812202
3768.8F27861328L324814q718147j150475K445450K95906J068306R7847L57857l09449
3777.4F25273437K316819J931267p821274N1841K295266J389236K415962k564354j551818
3786.1F23736382J018066J76315M67377j59302n79643n05028M00200j4038J499672
$$ plain form
3729.2 621419144 622320671 626769943 625830040 617299690 625223427 629491615 619387779 617910538
3736.9 617910538 621055107 620720711 621821861 625121727 621361084 622906685 634376945 632261391
3744.7 632261391 612190628 618115578 622872849 628666687 629391098 619410553 628594170 626779518
3752.4 626779518 618310089 620642319 623066330 626333008 621872101 623516083 630194168 623559341
3760.1 623559341 619828262 623026695 624925270 625136185 628237038 627286377 621917992 623049126 627861328
3768.8 627861328 631186142 622467995 621317520 623762970 624058876 625127182 625225029 625582886 625273437
3777.4 625273437 627590256 629521523 621700249 621752090 624047356 625436592 627852554 625288200 623736382
3786.1 623736382 624754448 624930763 625398140 625238838 624659195 624154167 624554367 624540329 626040001
3794.8F26040001L923607k671013m969826L71742L629227P377205k206230j1097298
3802.5F20397415J080322J517563L232422N925446o497917n838585L670044J405067
3810.2F24891777m09813N22575q8500m4747N322037K643318j4676399K699966N567513
3818.9F26427727M345627M275131j5126229j198921L712464J219024K442360J123886
3826.6F27221069m363746q85735J875687L314590K500954q622093M77867P151069m199028
3835.3F24470634j812400J0005073m095802q898392P958489l663712k111511O609192
3843F28461571j789742m758835J300660P37190n27191J907234L04336N55153O512642
3851.7F32703018r48181Q50258j4029198l937187Q589401L59535k782211O58493J403046
$$ plain form
3794.8 626040001 629963608 627292595 622322769 622694511 626323738 633700943 631494713 620397415
3802.5 620397415 621477737 622995300 626227722 632153168 625655251 619816666 623486710 624891777
3810.2 624891777 624481964 625004539 624916039 624871292 630193329 632836647 618160248 620860214 626427727
3818.9 626427727 630773354 635048485 619922256 618723335 622435799 623654823 626097183 627221069
3826.6 627221069 622857323 621971588 623847275 627161865 629662819 621040726 621518593 628669662 624470634
3835.3 624470634 622658234 632663307 628567505 619669113 627627602 623963890 621852379 628461571
3843 628461571 626671829 621912994 623213654 623950844 623423653 625330887 625635223 626190376 632703018
3851.7 632703018 631754837 632605095 618575897 614638710 623228111 623587646 620805435 621463928 622866974
3860.4F22866974L965225k287178j909065O645012k278099q903618R21402N165977
3868.1F24186630Q917465m465217j2384606J508408N530243N763473r495849j778069
3875.8F17782478L587113j25084J675224N324478k220688r363899L572884K027206
3883.5F22259712J388931O657677j0402527k151909L328019L74908M240265J827393
3891.2F27522469q580246n2872K696915j834717O22101J068801K416611L852158r790383
3899.9F17920837J175614L358650m365730M444618K98004k532501q90541n5580J553650
3908.6F20907021q00667o86684n8098K54479j40610q31604J620598L176384k150154
3917.3F21290665m376603L664437J904373m280090P10792J655617J565628j665382
$$ plain form
3860.4 622866974 626832199 624545021 622635956 629280968 627002869 618099251 619020653 624186630
3868.1 624186630 633104095 628638878 616254272 617762680 623292923 629056396 619560547 617782478
3875.8 617782478 621369591 621244507 622919731 628244209 626023521 616659622 620232506 622259712
3883.5 622259712 623648643 630306320 619903793 617751884 621079903 621454811 625695076 627522469
3891.2 627522469 618942223 618889351 621586266 619751549 620373650 621442451 623859062 627711220 617920837
3899.9 617920837 619096451 622455101 618089371 622533989 622831993 620299492 619408951 619353371 620907021
3908.6 620907021 620106354 619419670 619361572 619616051 619475441 618643837 620264435 623440819 621290665
3917.3 621290665 616914062 620578499 622482872 618202782 618913574 620569191 622134819 620469437
3925F20469437l510895J324310J090470J428031n64613j068039K491989k506752k754326
3933.7F16399612J204949N31578N89828M82064k14119j67198j011887O76918K578506
3942.3F21070251l285064k043648J094971Q53538K164345j576347J28097O24008l437423
3951F15592728J110191J112595p20024K91557P27196N65757j182289q75854m09966
3959.7F16211891M53797L83224j408958n9624R70840K43836O2637M85954L55378p72782
3969.3F16926193j242065N81436J152916n62401o78024P7476N20859n08270p38144
3978F15529976O21986N01862J34735m52385p66029J07002N76973r0294q43506k02179
3987.7F15118141M65698J50681r94873r13162O00166N48363J09710J29090l96729J62277
$$ plain form
3925 620469437 616958542 618282852 619373322 620801353 620236740 619168701 621660690 619153938 616399612
3933.7 616399612 617604561 618136139 618725967 619208031 618993912 618826714 617814827 618491745 621070251
3942.3 621070251 617785187 615741539 616836510 617690048 619854393 618278046 618406143 619030151 615592728
3951 615592728 616702919 617815514 617095490 617387047 618114243 618680000 617497711 616621857 616211891
3959.7 616211891 616665688 617048912 615639954 615580330 616551170 616795006 616857643 617343597 617698975 616926193
3969.3 616926193 615684128 616265564 617418480 616856079 616178055 616255531 616776390 616268120 615529976
3978 615529976 616151962 616653824 616788559 616336174 615570145 615677147 616254120 616163826 615320320 615118141
3987.7 615118141 615583839 615734520 614739647 613826485 614426651 614975014 615084724 615213814 614817085 614979362
3997.3F14979362R55239J17950k97813
4000.2F15754738
$$ plain form
3997.3 614979362 615934601 616052551 615754738
4000.2 615754738
##END=$$ End of the data block
