##TITLE=$$ Begin of the data block
##JCAMP-DX=5.00 $$ ACD/SpecManager v 10.08
##SPECTROMETER/DATA SYSTEM=Varian
##DATE=18 Dec 2012 13:33:12
##DATA TYPE=INFRARED SPECTRUM
##DATA CLASS=XYDATA
##ORIGIN=
##OWNER=
##NPOINTS=3735
##FIRSTX=399.26403809
##LASTX=4000.35498047
##MAXX=4000.35498047
##MINX=399.26403809
##MAXY=75.86804962
##MINY=43.97602844
##XFACTOR=1.0000000000
##YFACTOR=0.000000100000000
##FIRSTY=67.65991974
##DELTAX=0.96440572
##XUNITS=1/CM
##YUNITS=TRANSMITTANCE
##XYDATA=(X++(Y..Y))
399.3 676599197 684944916 667602692 662570496 654618607 647429428 649701614 651578217 652742310
407 652742310 652607269 652408295 653250046 647127991 645140152 648558121 645791550 645690079 646152344
415.7 646152344 645931015 646334915 634217186 629672241 638670616 645693436 651821136 648206406 642341766
424.3 642341766 640614853 642705383 645709915 647849121 649148712 649502640 648477402 645229340 643123016
433 643123016 640150833 638680649 641185913 642695999 645416946 645273895 639980049 635999336 638099899
441.7 638099899 646197510 647363510 645678253 647064896 648639450 647005844 644149094 645180435
449.4 645180435 645192032 644696732 644795303 642151871 640704422 638885727 636721649 631780891 635083466
458.1 635083466 642297821 639129524 639338226 641217651 637645073 634538155 636534348 642210007 643463593
466.8 643463593 639620781 633249664 630859222 634467964 640780716 643222122 636009407 635557404 641941147
475.5 641941147 643355637 637016640 636329346 638868065 639144440 639787712 636967926 633900108 634144058
484.1 634144058 637391891 640982132 643767014 644780807 643302917 642453079 640582657 636993332 636401100
492.8 636401100 639086952 639499321 637787361 639396439 640498734 641990280 642038727 638953018 636680489
501.5 636680489 635918655 638218689 637950630 639429474 642131805 642949905 645486221 643283463 639750328
510.2 639750328 638655357 637600899 636664391 633798447 633794937 636263809 638238068 638275070 636701279
518.9 636701279 636095810 634328041 633053017 633040924 632478714 632511101 632667084 632625275 632323112 632504578
528.5 632504578 635075035 636089478 634119148 631272392 630522079 632276039 630985069 630020866 631584930
537.2 631584930 632978287 634319954 633162880 631615868 630994301 631148262 631469688 630420647 629716072
545.9 629716072 629835052 631608543 633058472 634080124 635878105 636298218 634433861 631080666 630577431
554.5 630577431 632511177 633187981 632376823 631613274 632641678 633648529 633104782 633019104 633805809
563.2 633805809 633036232 632140541 632272606 633382988 634886894 633136864 631480064 632072525 632346802
571.9 632346802 632821121 632921486 631776848 630508385 630789757 631611137 632994118 633768997 634299812
580.6 634299812 634401474 630992622 628367958 628302422 629169655 631093864 633342285 634518471 634339905
589.3 634339905 635063095 634247017 631686897 631307755 631409225 631326180 631542320 632247009 632206230 632235260
598.9 632235260 633320808 633352051 632078209 630402374 628734398 627369461 627093506 626382103 625382690
607.6 625382690 625651054 625632362 625736961 626384544 625900803 623717728 621456833 619496193 618828354
616.3 618828354 619247551 618907852 620158043 620963707 621124687 622263947 621099739 619350319 619232483
624.9 619232483 619929657 621455879 622983856 624880600 627788811 630470886 632459068 633097534 633737068
633.6 633737068 634394379 632387161 630329514 629677887 629813766 630635071 631656647 633900604 636222534
642.3 636222534 638061447 639119987 639863815 640748138 640790787 640570831 640733490 641678314 642442245 643712845
651.9 643712845 646059570 647457504 647221985 645463715 644946136 645053711 643733902 644519882 646317520
660.6 646317520 646183548 645627518 647095184 648708801 648621521 649495316 648786163 639318619 643448486
669.3 643448486 647356491 648691177 649972687 650767212 649878235 649533768 650290375 650722809 650965576
678 650965576 651386795 652082214 652232285 652024841 652064133 652488785 653427429 653339767 652499237 651911011
687.6 651911011 651298904 651492157 651972885 651815720 652430038 653003006 651197891 649393387 649098740
696.3 649098740 648525009 647790146 647234116 646898422 647585602 648740540 648513260 648035507 648929291 649072723
705.9 649072723 648741531 648226013 647706680 648905640 650072556 651455612 653363419 654757309 656133804
714.6 656133804 656842804 656656113 655805054 655529251 655846329 655890274 656639099 658396683 660623474 662068253
724.3 662068253 663276672 664010391 662866974 660880737 659583282 659387512 659103546 659253616 660943222
733 660943222 663037338 664257202 664353638 663980331 663303070 663294754 663598099 663385315 663805084 664959564
742.6 664959564 666473083 667823868 669381409 670130768 669703903 670287552 671092072 671145096 671184692 672432861
752.2 672432861 674080582 675581894 678001175 679235916 679792252 680383682 680283508 680592804 681058044
760.9 681058044 682163467 682737656 682420654 682674408 683480835 683777771 683418884 684398880 684212494 682752991
770.6 682752991 682538834 682519302 682865067 683523254 684754868 685691605 686526718 687826920 688438416 688395309
780.2 688395309 688185425 689722366 691321106 692504730 694476929 695839539 696378479 695895081 696293030
788.9 696293030 696320953 696029587 697182846 697703247 697773132 697921524 698919525 699367905 699414139 700460892
798.5 700460892 701079330 701150284 700167007 699773788 700199509 700312576 700667038 701455917 701960144 701704178
808.2 701704178 702900925 704243546 704041824 703061447 702498932 703330002 704125290 704628296 705454788
816.9 705454788 706982574 707006302 705905380 706089935 706093674 706088028 705780182 705192337 704727173 704797592
826.5 704797592 706101303 706641769 705772552 704311066 703381424 701843414 698909531 697235794 696433640
835.2 696433640 694757233 693401108 692961731 692030106 690866241 689928665 687638016 685606079 685178909
843.9 685178909 684436874 683993301 684061203 683670883 683593292 684499817 685543747 685936279 685871582 685727692
853.5 685727692 687002106 688953552 690293579 692332764 694038162 694825668 695906601 697021179 697911072
862.2 697911072 698891907 700242081 700852814 701203537 702393188 703516541 703966293 704005585 704835739
870.9 704835739 705467529 705581589 706021194 706356277 706997681 707331696 707047348 706978226 707492828 707302780
880.5 707302780 706290817 704932556 702708054 700725098 699660950 699278336 698102188 697990723 699329224
889.2 699329224 699563446 700177231 699695435 697898941 697436295 697827759 697754517 696890488 696787033 698098145
898.8 698098145 699742584 700393066 700324707 699989243 699378357 698486862 697007980 696020355 695527191 695451660
908.5 695451660 695163422 694709854 694580841 693366089 690969009 688396606 687374039 686416626 684276810
917.2 684276810 682540665 681311722 680858078 680635757 679881134 678829651 678037949 677084045 675217972
925.8 675217972 673339539 671966324 670725098 670342941 671300888 671791840 671965027 672563477 672677765
934.5 672677765 672470779 672610168 673411713 674159393 675560379 678176804 680525284 682023697 683474426
943.2 683474426 685362854 686106262 686115265 686494598 687388611 689108200 690225067 690769882 690906067 691469193
952.8 691469193 692139969 691745834 691415634 690340118 688566132 686928787 686351700 686328354 685479584
961.5 685479584 684535446 683563004 682351379 680960236 679746399 677919312 676194763 675190430 674122620
970.2 674122620 673853073 673715515 673651428 673062210 671913223 671305847 670479050 669647369 668403931 667496948
979.8 667496948 667095032 666129379 665462799 665490417 665496368 664010162 662365494 661337891 659106903 656914825
989.5 656914825 655602417 654457779 653947983 653451614 652069473 649959030 647621689 645920563 645543671
998.2 645543671 645844116 645150223 643783646 642922363 643012314 643022537 641823044 640632629 639368668
1006.8 639368668 638108673 637292252 636213226 635051842 634167023 633650436 632720337 632018585 631465721
1015.5 631465721 630469437 629470901 627981758 626475754 624465828 622714043 621632881 620358162 619605904
1024.2 619605904 618597336 617756920 617409859 616991158 616393509 614416504 612028885 611076126 610558510
1032.9 610558510 609781799 609295883 609595146 610723457 610615158 609554749 609340210 609593124 608721085
1041.6 608721085 607334671 607570267 608117599 608611412 608476410 608118668 608907051 608977890 608682823 608626862
1051.2 608626862 608570137 608263702 608224144 608484344 608325233 608818855 608910637 608335648 608248634 608509102
1060.9 608509102 607952766 606759033 606123505 606242447 606937370 606672096 606898422 607203598 606697235
1069.5 606697235 606775436 605944672 605112877 604992065 605192642 605146370 605179138 605892258 605841713 605657158
1079.2 605657158 606165810 606934204 606192894 605116234 605325928 605734558 605731544 605658913 606734161 606854477
1088.8 606854477 606709213 607317848 607426262 607037926 605813332 605028191 603930244 603469467 603076019
1097.5 603076019 602257729 602882805 601903915 600407944 599774628 599266205 598695946 597261658 596274796
1106.2 596274796 595864296 595421371 595335503 595660172 594685440 593405380 592782135 592487068 592273102 591568146
1115.8 591568146 591981621 592016220 591891975 592002983 592224846 593458786 593842278 593650475 592927933 592470436
1125.5 592470436 592293243 592053909 591704865 591761742 593296738 593506241 593751907 594522781 594629250 594400063
1135.1 594400063 594466782 595485611 594994659 594803314 595416679 596022873 596443748 595672264 594992294 593700829
1144.8 593700829 592426720 591673813 591586723 591606293 591429672 591566963 591264534 591355171 590849495 590869293
1154.4 590869293 590976143 590716476 591509132 591703186 592393761 593221321 594054565 595599289 597369118
1163.1 597369118 598685493 599451332 601092453 602897835 604542160 606020546 607761726 609747276
1170.8 609747276 611951141 614711952 616927376 618910789 620912514 622698135 624104347 625717316
1178.5 625717316 627371941 628777695 630860825 632742462 634326859 635558624 636118774 637125702
1186.2 637125702 638182068 638303452 638393860 639154510 639877663 640582581 641446609 642374573 643213120 644048767
1195.9 644048767 644941635 645324783 645782852 646183548 646219788 646330338 646444016 646901398 647269669 647562332
1205.5 647562332 647904358 647632675 647297821 647471466 647706604 647583466 647346420 647066727 647065430 647436447
1215.1 647436447 647451172 646961060 646654205 646775360 646245956 645607834 645383377 644948730 644960937 645062637
1224.8 645062637 645070724 645139008 644697495 643992996 643725739 643780975 643774109 643953934 643801193 643321152 643406219
1235.4 643406219 643958664 644119034 643986893 643926697 643779449 643965683 644119644 644235764 644340134 644222565
1245 644222565 644364853 644478531 644408798 644122696 643937149 643870392 643955231 643988342 643744583 644134903 644299393
1255.7 644299393 644180374 644380417 644423904 644168625 643629456 643539429 643674011 644012909 644446564 644777756
1265.3 644777756 645434189 646147156 646485519 646451187 646685562 646904526 647061462 647677536 648522797 648937378
1274.9 648937378 649213257 650212860 650826950 651048965 651322327 651625748 652340393 652937241 653414383 653935318
1284.6 653935318 654946671 656102982 657012711 658099976 658777008 658824997 658998795 659835358 660602722
1293.3 660602722 661282883 662391052 663547134 665038605 666355286 666595764 666588287 667122040 667722168
1301.9 667722168 668205185 668982086 669470139 669571152 670103378 670869751 671684113 672369080 672944946 673361740
1311.6 673361740 673258820 673462219 673780594 673780441 674095001 674875488 675603943 675862427 676060867 676492691
1321.2 676492691 677227554 677839890 678032837 678250732 678763962 679250183 679645233 680596924 680751190 679681015
1330.9 679681015 679439621 680092468 680369339 681060791 682332001 681937332 680951309 680959015 681217651 681277313
1340.5 681277313 681171417 681344376 680920029 680620956 680609970 680471649 680963287 681339645 681448975 681174774
1350.2 681174774 680772934 680533295 680284576 680061646 679639893 679043503 678782349 679229584 679279022 679191895
1359.8 679191895 679215622 679018784 679119034 678106995 677350082 676827469 676319580 676111755 675297012 674799881
1369.4 674799881 675022659 675139084 674834366 674370728 673642349 672544708 671821213 671823349 672007828 671613541
1379.1 671613541 671385880 671693039 672023621 671797485 671438370 671458817 672104797 673332443 673298950 673943024
1388.7 673943024 675508728 676523209 677392578 677701569 677895279 677055130 675527878 675875092 676222534
1397.4 676222534 676398315 675057144 674310913 674736176 674868011 674873962 675221481 674753189 673140945 672595215
1407.1 672595215 671941452 671401215 671122818 670815659 670777588 670565948 670863266 670805740 670724258 670880356
1416.7 670880356 670178986 669812241 667216797 667216644 668605042 669284286 669641037 668845367 668690338 669113617
1426.3 669113617 668768387 668589249 668817673 667931213 667581558 668698425 669126129 668941803 669659576
1435 669659576 670424576 668157959 668099060 669659805 670182419 670478897 670731888 670797806 671319122 671458282
1444.7 671458282 671552811 672139664 672600784 671538010 671480179 672538071 672861710 672811432 673348160 674609451
1454.3 674609451 676039124 676896896 674030533 672025146 674431610 675887527 677757797 678740005 679021225
1463 679021225 680959167 681818390 681062393 681957855 683031387 683752289 684582520 685959244 686864777
1471.7 686864777 686961060 688351135 690916061 693321838 694073868 694685135 696243057 697159958 698192673
1480.3 698192673 698630447 698577042 699939194 701199417 701521759 702487946 703106842 701995850 702641220
1489 702641220 701680222 699814301 700331192 700804367 700975113 701045837 701353531 697854309 698418503 698821335
1498.7 698821335 696519699 696945114 696511612 695070267 693955002 694783096 696338120 691155930 685459366
1507.3 685459366 686059189 687714386 686323318 686138458 685603256 683655853 682992249 681902466 681462631
1516 681462631 679976654 677963486 679021072 681053009 678993759 675036316 675429535 674679794 675531769
1524.7 675531769 673350296 672110367 672392197 671662598 671371231 670899658 670691605 670444183 670110931
1533.4 670110931 666488876 666592331 667266235 666912460 668145218 669312210 666225433 664661713 664188080
1542.1 664188080 663727264 664715652 664710312 662634964 664392471 664918747 665088348 665198441 663660278
1550.7 663660278 664711304 665529022 666058197 664787903 666103821 669191055 671327591 669551315 665245819
1559.4 665245819 667347488 669051437 670403137 671047974 671741638 671930771 671958847 672925949 673404999
1568.1 673404999 674736862 673253555 672579041 673142853 672604141 672652359 673254852 673606491 669367676
1576.8 669367676 670785828 671891556 671591110 671414261 670447617 670336761 669430313 668351059 667443619
1585.5 667443619 666200943 665174713 664180298 663940964 662656174 661912308 660230255 658507004 657529755
1594.1 657529755 655566025 654225845 652292786 651493301 650279846 648873825 647370758 645908127
1601.9 645908127 644925919 642359390 640657730 638676491 637216492 634619102 632821503 631706924
1609.6 631706924 628829384 627940788 625925903 624596062 622960548 622179871 621875725 613844337 613360672
1618.2 613360672 612303238 611638870 609400215 608002090 606861763 603110123 602422066 600488701 600434380
1626.9 600434380 598561592 596154060 595065269 593679619 592671471 591303902 592127151 592575455 590321503
1635.6 590321503 587092896 587561607 586826859 586476822 587195091 585993271 586988373 586815948 587466965
1644.3 587466965 588925018 588371773 589989014 587849312 588907547 589550781 591819687 594649429 595390129
1653 595390129 593293686 591851196 594110985 595236092 597044868 597718048 598539772 599711342 600610695
1661.6 600610695 602348938 601691589 603553047 605139732 606830444 608596992 610117645 610302773 610036011
1670.3 610036011 613428116 614018288 615479774 618109398 619911118 619435997 620887566 623639107 625128212
1679 625128212 627310638 627616463 629508057 633840866 635557213 634098129 634578896 638053703 640677185
1687.7 640677185 642049561 643728867 645436478 647881241 649721451 651491318 654057617 657233353
1695.4 657233353 655234680 657513351 661666718 665970459 672585602 667511063 669728012 672369614
1703.1 672369614 675159302 677593918 679124832 680401764 681786041 684468613 686619263 687867126
1710.8 687867126 689292297 690927200 693295593 693963623 693302689 695756149 697994461 694489212 695727081
1719.5 695727081 697010269 696878662 696601410 695975571 695861511 696763382 697536926 697720642 698002319
1728.2 698002319 699842529 700974426 700898437 703093414 705824051 705665436 700764465 702081375 704530258
1736.9 704530258 705999527 707842865 708894653 707030487 708905945 711180725 711021271 711277924 713237305
1745.5 713237305 714786835 715584030 716438141 717329178 720661392 722687225 722059479 724495316 726486511
1754.2 726486511 728336792 730642395 730367813 730697098 732207489 733719940 736274719 736095276 735216293
1762.9 735216293 736936874 737980728 738816986 739750824 740439377 738648071 739340515 742089920 742930527
1771.6 742930527 741113052 739251785 741601868 743276749 742469482 743229675 743846588 744491577 744704819
1780.3 744704819 744434586 744718552 745663834 747034454 746499634 746315918 747392960 747794342 747520905
1788.9 747520905 747736588 747874069 748123016 747261887 746906357 749571304 750964432 750002060 749564438
1797.6 749564438 750121765 750388336 748972549 749827347 750163574 750085983 750953598 751106033 751665344 751992264
1807.3 751992264 751706009 751996536 752755585 751992798 751527176 752332382 752579651 752682266 752846832 753736572
1816.9 753736572 753775711 753532486 754025726 753714752 753695831 753290024 753959122 755562210 753617477 752686615
1826.5 752686615 754086380 755829544 756738739 753598404 753200150 754683456 754979019 755045319 755006180
1835.2 755006180 755326920 755631638 755289917 755937805 755810471 755752640 755921555 756556778 757991104 754676514
1844.9 754676514 754738846 756336365 756223984 755719604 756064224 756801071 756682663 756369858 756273956 756629562
1854.5 756629562 756680908 756387100 756784134 757008820 756927948 756815033 756858368 756747971 757122421 757483063
1864.2 757483063 757494278 757835693 757503357 757869644 757411346 756138382 756821747 757241058 757302933 757397842
1873.8 757397842 757536240 757544403 757721252 757815170 757799301 757707672 757649078 757931061 757467117 757543259 757833176
1884.4 757833176 757527161 757463837 757189331 757889175 758680496 757641373 757401199 757755661 757295761 757693024
1894.1 757693024 758287582 757176208 757021637 757216339 757386398 757730331 757748260 757691879 757402420 757541351
1903.7 757541351 757259445 756883392 757145462 757398071 757507095 757703323 757748947 757484360 757842941 757465897
1913.3 757465897 756964645 756807938 756606369 757312469 756504211 756024323 756759949 757258148 757969055 757146225
1923 757146225 755897064 756212311 756813431 756546478 756278687 756399994 756293030 756315231 756456680 756685028
1932.6 756685028 756521606 756474533 756431961 756245804 756205215 755882187 755849686 755653839 756032028 756597824
1942.3 756597824 755799255 755826035 755912781 755645981 755651932 755658340 755683212 755721512 755716476 755528030 755308990
1952.9 755308990 755439911 755593185 755310364 755268860 755216446 754909821 754827118 754762878 754600067 754411469
1962.5 754411469 754598923 754402008 753860321 754003983 753981171 753793182 754167023 754388275 754063873 754065628
1972.2 754065628 754342957 754379654 754028778 753441315 753371429 753379745 753370895 753531113 753571320 753436584 753122787
1982.8 753122787 752968292 752844620 752873840 752910919 752798004 752409134 751671295 751937332 752641754 752248764
1992.4 752248764 751953659 752086411 751939621 751768951 751574783 751576920 751412582 750890884 751179810 751509552
2002.1 751509552 751248856 751101608 751330948 751626282 751193619 750522766 750064468 749694901 749570694 749727020
2011.7 749727020 749817047 749597549 749382477 749438324 749667892 749346542 749081268 749090347 748762360 748451996
2021.3 748451996 748487015 748800201 748590775 748550949 748723679 748458252 748274078 747817993 747539825 747391510
2031 747391510 747393951 747429733 746981735 746987915 747105255 747049103 747257996 747250214 746725311 746411591 746273956
2041.6 746273956 746189880 746414642 746071930 745795517 745962296 746061020 745932236 745624390 745615005 745585480
2051.2 745585480 745614700 745331879 745091400 745277023 745273895 745170288 744743500 744580231 744577103 744426498
2060.9 744426498 744231339 744101181 744540253 744728928 744411850 744095764 744008255 743843002 743528976 743262711
2070.5 743262711 743094177 743322525 743356781 743487549 743463287 743232193 743267059 742754593 742588501 742819977
2080.2 742819977 742467728 741940079 741719055 741903152 742486038 742895050 742695389 742633591 742505951 742062378
2089.8 742062378 741555405 741481476 741963577 741938248 741483917 741303635 741654282 741840897 741788559 741876755
2099.5 741876755 741699524 741505966 741344528 741405029 741308899 741192474 741306992 741055298 741090927 741323013
2109.1 741323013 741496735 741607208 741482849 741310577 741183472 741057587 740848846 740787582 740547028 740523682
2118.7 740523682 740744476 740752029 741011353 741160583 740872421 740517273 740537949 740481720 740275116 740400467
2128.4 740400467 740630264 740580444 740485916 740891037 740862885 740734177 740705795 740318527 740558243 740658035
2138 740658035 740366364 740188980 740091705 740152130 740497131 740886993 740640259 740461655 740372086 740212250
2147.7 740212250 740040894 739755783 739886475 740099869 740170822 740029068 740032959 740271225 740421295 740614700
2157.3 740614700 740610046 740368652 740159912 740303268 740242844 740174408 740491104 740510406 740413971 740315628 740345078
2167.9 740345078 740517426 740545120 740279617 740118027 740242538 740093460 739895020 739635315 739442978 739436340
2177.6 739436340 739705963 740154266 740308685 740623093 740469894 740049362 740111771 739873962 739745178 739858093
2187.2 739858093 739669571 739903717 740447845 740561142 740672836 740726700 740662766 740475159 740273285 740345840
2196.9 740345840 740034103 739763489 739612656 739563370 740039444 740532150 740846252 740696487 740451126 740321350
2206.5 740321350 740227585 740210571 740167770 740144577 739782715 739650803 739940491 740178299 740305710 740508499
2216.1 740508499 740590439 740398712 740433655 740005341 739363632 739347153 739710007 739849243 739603806 739576645
2225.8 739576645 739432831 739369507 739496765 739607086 739611511 739228516 738965759 738901138 739104767 739246521
2235.4 739246521 739276886 739404297 739586563 739700623 739484940 739499359 739255524 738973846 738861923 738559189
2245.1 738559189 738499985 738369217 738488083 738622971 738681946 738863144 738929672 738813705 738550568 738614731
2254.7 738614731 738417816 738383942 738540726 738346252 738475952 738809586 738814545 738395462 738584824 738796158
2264.4 738796158 738384857 737958298 737758713 737976837 737741318 737619171 737887573 738206024 738700180 738996887
2274 738996887 739021835 738261337 737559052 737359238 737332230 737560349 737725983 737748871 737737961 738041611 738309937
2284.6 738309937 738262329 738064575 738199921 737985458 737192841 737245407 737285004 737114105 737147141 737540054
2294.3 737540054 737915192 737760162 737951126 737943497 738005524 737853317 737415085 737289658 736900558 736811752
2303.9 736811752 736715317 736959686 736984329 736930084 737733994 738023987 737675400 736777191 736467743 736312332
2313.5 736312332 736272125 736884842 736469803 736198807 736657944 737725220 738026276 737209702 737102737 736891251
2323.2 736891251 736421127 735628891 735528412 735621719 735235901 735338593 736137009 737577362 737672729 737172775
2332.8 737172775 736190338 735478668 736481628 737151642 737094879 736447067 736065521 736103363 736382675 736400604
2342.5 736400604 736563034 737731934 737099228 736476059 736291885 735862732 736710663 737470322 737737503
2351.2 737737503 737819443 736745758 736120071 736582718 736178207 736235046 737825775 737218170 735244751
2359.8 735244751 734669113 734691620 735233612 736366119 736894379 736514740 736864548 736865768 736948090 737986450
2369.5 737986450 737543488 736612091 736389694 736657944 737200546 737116852 737088470 737258224 737247620 737375183
2379.1 737375183 737528839 737436752 737259521 737453918 737624969 737573166 737568893 737618179 738110657 738604584
2388.8 738604584 738436813 738122482 738051529 737915421 737623215 737499008 737513504 737751846 738142242 737967224
2398.4 737967224 737649155 737688217 737450256 737405014 737595901 737320633 737125092 737110596 737157822 737113266
2408.1 737113266 737166748 737520752 737519150 737529373 737262955 736750641 736722031 736646042 736870117 737358017 737394257
2418.7 737394257 736938248 736615677 736830292 736733551 736414108 736445694 736476288 736312561 736237869 736338272
2428.3 736338272 736317520 736303329 736343536 735920792 735561523 735874252 735948563 735811386 735859528 735861740 735761108
2438.9 735761108 735582657 735849991 735781555 735279083 735201187 735007324 735058060 735386200 735188065 734780121
2448.6 734780121 734733887 734854507 734859772 734578400 734241714 734389496 734493637 734546051 734579926 734434204
2458.2 734434204 734385681 734194183 734179764 734312515 734370270 734198685 733888474 733462830 732817459 732937851
2467.8 732937851 733167038 733105316 733356781 733422546 733405991 733326645 733035889 732755508 732713318 732627106 732387619
2478.5 732387619 732266312 732053604 731908112 732177048 732537384 732508926 732564316 732402191 731723557 731526413
2488.1 731526413 731722260 731650848 730994873 730820160 731442642 731447220 731080399 731187363 731478348 731112900
2497.7 731112900 730360031 730082245 730279465 730449829 730411224 730241318 730095596 730437546 730509796 730276794
2507.4 730276794 730216522 729836655 729518890 729492645 729708023 729636307 729317245 729289169 729448547 729690399
2517 729690399 729668579 729669724 729264679 728589325 728424835 728258972 728329620 728691788 728709259 728324203 728242874
2527.6 728242874 728326950 728171616 728439255 728682404 728269119 727920456 728120041 728135681 728063431 728216019
2537.3 728216019 728046570 727962494 727898712 727477951 727338867 727444687 727032700 726822739 727121277 727372437
2546.9 727372437 727776642 727554016 727011032 726788406 726755371 726767883 726352310 726097946 725813370 725782471
2556.6 725782471 726129379 726219177 726334152 726216354 726090240 725587921 725286636 725825424 725720901 725198593
2566.2 725198593 725065231 725220947 725352173 725377960 725235138 724940720 724818497 724861374 725170364 725032120
2575.9 725032120 724269485 723910141 723891525 723619308 723387604 723614349 724011154 723929443 723267746 723193436
2585.5 723193436 723686295 723620148 722976913 722553864 722929153 723270950 723294220 723285751 722962189 722347488
2595.1 722347488 721987000 722107697 722021255 721951447 721937180 721677628 721608124 721636734 721512299 721217575
2604.8 721217575 720890579 720327148 719925766 719933167 719872894 719974594 720077209 719976654 719811096 719879608
2614.4 719879608 719852524 719250641 719035339 719162598 718666077 718093796 718120346 718360825 718624191 718615799
2624.1 718615799 718259811 717948456 717611160 717457657 717348251 717269897 717320251 717037430 716676788 716622543
2633.7 716622543 716586838 716411896 716393127 716094666 715704880 715770493 715705872 715472260 715338287 715383224
2643.4 715383224 715120697 714564209 714248657 714162445 714119568 713725357 713639984 713868713 713730011 713267212
2653 713267212 712842102 712727814 712480774 712520676 712500153 712113495 712020874 711917877 712013016 712030334 711735306
2663.6 711735306 711629257 711706848 711467590 710839539 710772171 710978394 710677338 710274124 710256958 710443802
2673.3 710443802 710611649 710570374 710080185 709714508 709412308 709077911 709300766 709461517 709103012 708829575
2682.9 708829575 708678360 708484802 708397446 708277817 708243790 708031921 707350769 706975937 707088623 707069778
2692.5 707069778 706822128 706619797 706561050 706579285 706453705 706481476 706413193 705853424 705513840 705144501
2702.2 705144501 704844818 704888840 705079193 705348740 705019836 704655609 704717636 704775009 704426346 703870239
2711.8 703870239 703658371 703629303 703678894 703374329 703217163 703013306 702617569 703036423 702980499 702494965
2721.5 702494965 702375488 702157364 701738281 701198807 701167679 701275482 701266556 701169815 700955658 701062622
2731.1 701062622 700854874 700030518 699466324 699517136 699551010 699422531 699268646 699211655 699447021 699445038
2740.8 699445038 699189453 699007645 698745041 698203964 697833328 697907639 697859268 697868042 698050232 698210297
2750.4 698210297 698218307 697633514 697015991 696891556 696745529 696384659 696108551 696098404 695804291 695327682
2760 695327682 695561905 695809097 695722885 695427322 694571609 694125824 694341965 694391785 693964615 693555984
2769.7 693555984 693481522 693311005 693220749 693155060 693007355 692960281 692879105 692493362 691961746 691768341
2779.3 691768341 691423721 691003189 690924911 690635071 689854889 689276047 689466934 689629135 689494629 689314575
2789 689314575 688872452 688441086 688392105 688296127 687736206 687440491 687522888 687455139 687084808 686583481 686233063
2799.6 686233063 685697479 685109634 684865036 684890289 684840775 684507523 683934097 683398132 683328857 683086624
2809.2 683086624 682550507 682076416 681500778 681403122 681465378 680943832 680591202 680605698 680350800 680087433
2818.9 680087433 679587097 678903809 678624039 678155975 677880630 677729263 676900024 676095276 675840912 675843048
2828.5 675843048 675337143 674733047 674540100 674170837 673789825 673070602 672171249 671895752 671576767 670941620
2838.2 670941620 670158386 668985443 667718353 666846466 666199112 665058975 663481369 662052383 660974503
2846.8 660974503 659904404 658374329 656926727 655918350 655073853 654448242 654043503 653801346 653605576
2855.5 653605576 653180542 652769165 652874451 653058624 653304214 653606339 653360214 653201675 652921524 652529526
2865.2 652529526 652486420 651725006 650955811 650696335 650055618 649661484 649547043 648948288 648544159 648349075
2874.8 648349075 647950287 648067245 647837448 647062531 646721573 646345444 645967484 645553207 645088196 644725418
2884.4 644725418 644267578 643973083 643783035 643544006 643194199 642801132 642230835 641387482 640803604 640561752
2894.1 640561752 640306549 639823914 639029465 638316765 638078079 637662048 636789284 635751915 635020676
2902.8 635020676 634839287 634347992 634085693 634282303 634083862 633633957 632938118 632394218 631755257 630671387
2912.4 630671387 629691315 628963928 628308372 627512474 626688576 625598831 624580078 623948174 623295860
2921.1 623295860 622661514 621949234 621501007 621281433 621165123 621256371 621312714 621770287 622257729 622429848
2930.7 622429848 622773895 622791214 622542305 623005829 623718491 623964462 624025726 624255600 624804955 625229340
2940.4 625229340 625480423 625942345 626444931 626904182 627387772 627404213 626945877 626736488 626402969 626257095
2950 626257095 626503181 626189194 626022758 626013908 625457420 624937096 624539528 624186897 624055824 623940506
2959.7 623940506 623911858 624134712 624421158 624390793 623844490 623792763 624542427 625204163 625644035 626165085
2969.3 626165085 626852951 627104111 627337494 628017960 628621330 628928795 628829727 629013290 629252167 629677162
2979 629677162 630784531 631490822 631634483 631455154 631476555 631806068 632109032 632642174 632867432 632988586
2988.6 632988586 633512497 633908958 634096260 634063187 633676186 633512306 633468933 633515244 634158669 634489212
2998.2 634489212 634291840 634222298 634184265 633960686 633607864 633425140 633573761 633716583 633236351 632749100
3007.9 632749100 632652397 632604523 632838287 633084030 632874603 632287331 632032547 631913643 631541557 631171341
3017.5 631171341 630638123 630163879 630073738 630164719 629780693 629405975 629241066 628548965 627853851 627321701
3027.2 627321701 626838036 626457596 626507721 626722412 626535683 626495018 625951729 624750061 624020653 623746262
3036.8 623746262 623263817 622737007 622270508 621968269 622099838 621851463 621609383 621244583 620360069 619781265
3046.5 619781265 619259148 618908081 618670883 618653564 618333359 617457924 616946793 616184731 615808411 615566406
3056.1 615566406 614450569 613835716 613571320 613000832 612511787 612226219 612043762 611782494 611647758
3064.8 611647758 611616287 610917702 609925423 609371109 609086952 608783226 608276138 608165169 607948456 607538300
3074.4 607538300 607596626 607322083 606682549 606107826 605753403 605394287 604996376 604507751 603901863 603657494
3084.1 603657494 603464546 603094025 602365303 602188339 602221756 601411743 600791664 600134964 599854469 599880180
3093.7 599880180 599353485 599013596 598694038 598005981 597492027 597363434 596895981 596425056 595818291 595026398
3103.4 595026398 594823456 594625473 594560814 594056244 593272705 593028183 592703934 592253456 591638870 591171532
3113 591171532 590869865 590504112 589696007 588994370 588951530 588493385 587806435 587401161 587200851 586373672
3122.6 586373672 585257339 584849777 584620781 584315796 583538132 583092232 582792740 582307663 582145348
3131.3 582145348 581134834 580080986 579958382 579847755 579226646 578430977 577843590 577142982 576526299
3140 576526299 576333504 576386757 575801010 574633484 573874893 573482475 572938538 572554550 572521362 571849518
3149.6 571849518 570945511 570526962 570030899 569227066 568515015 567919693 567234612 566751328 566152954 565644989
3159.3 565644989 565228920 564558372 563662262 562742157 562573967 562358322 561665878 560759544 560012436 559460793
3168.9 559460793 558681030 558534088 558230476 557305336 556496849 556152725 556108131 555670738 554681435 553201294
3178.6 553201294 552780914 553018188 552914810 552279015 550892448 550287247 549934731 549396057 549034958
3187.3 549034958 548616447 548077965 547014008 546271286 545816689 545186539 544297028 543432999 543239326
3195.9 543239326 542773743 541680183 541421661 541560287 540789909 540257645 539779816 538996124 538241425
3204.6 538241425 537417488 537251472 536928291 536606903 536364059 535642014 534903908 534135857 533566780 533139992
3214.3 533139992 532743416 531711044 531164551 531340027 530576591 529491577 528698235 528561745 528141060
3222.9 528141060 527504120 527111282 526491203 526297951 525854034 525259628 524460487 523711891 523534966 523407211
3232.6 523407211 523282204 522560158 521730614 520899734 520174065 519805412 519543152 519276390 518800888 518228836
3242.2 518228836 517501907 517717171 517546654 516534729 516400604 516194534 515691338 514863319 514410744
3250.9 514410744 514023552 513372993 512806206 511917686 512001686 512066422 511470451 510826492 510134621 509776344
3260.5 509776344 509601250 509614906 509274330 508948669 508700905 508200912 507787170 507841530 508048058 507131081
3270.2 507131081 505968361 505462990 505420151 505065880 504781799 504942017 503828049 502549782 502117462
3278.9 502117462 502160568 501971588 501338844 501056519 500249329 499635086 499627113 499410400 499301567 499029770
3288.5 499029770 498533859 498256493 498014259 497464561 497141380 496828041 495960236 495234070 494742470 493897247
3298.2 493897247 493522034 493972015 493928833 493278465 492602005 492169456 491656609 490927849 490411530 490321846
3307.8 490321846 490432739 489611244 488577576 487975616 487760811 487552032 486749573 486381721 485940094
3316.5 485940094 485594711 485417404 484859772 484388237 483828621 483434639 482780991 482326660 481866875 481215324
3326.1 481215324 480605354 479468307 478856201 478183327 477641029 477146454 476626625 476737785 476042976
3334.8 476042976 475528374 475292702 474748383 473900642 472781143 472342644 472066498 472133675 471808281 470925941
3344.4 470925941 470429649 469948730 469345818 468434105 467823830 467533188 466883621 466074181 465713425 465399628
3354.1 465399628 464513092 463629112 463016586 462861214 462646942 461799355 460865593 460586166 460567818 460288315
3363.7 460288315 460229607 459943733 459051094 457716331 457098770 457219543 456691551 456019897 455176544 454488602
3373.4 454488602 454386520 454100227 453482208 452778969 452124023 451821709 452049141 451759682 451210518 450748863
3383 450748863 450056496 449796219 449428558 448742371 448100739 447830505 447754593 447573280 447703934 447290764
3392.7 447290764 446289787 446071739 446497002 446436005 445635300 444976158 445035248 445169258 444568405 444076462
3402.3 444076462 444215202 444132690 443416824 442923279 443252792 443507462 442868996 442146301 442411880 442706413
3412 442706413 442320824 442068367 442070847 441743622 441375160 441295547 441016884 440726471 440583611 440455513
3421.6 440455513 440206909 440374107 440859985 440406685 439760284 439977226 440372353 440025139 440052490 440377960
3431.2 440377960 440107536 440195465 440364494 441003075 441156960 440637856 440463905 440291214 440901680 441143951
3440.9 441143951 441385040 441588211 441305389 441294975 441272049 442476883 442222862 441152534 441640244 441895409
3450.5 441895409 442200775 442497063 442959099 443536301 444380684 444645615 444324379 444975700 445251999 445212746
3460.2 445212746 445231972 445524483 445931549 446332474 446799583 446186218 446229858 447087440 447502861 447800064
3469.8 447800064 448239059 449039383 449277878 449226913 449370461 449518852 450100479 451037521 451717987 452222519
3479.5 452222519 452737083 453266068 453553123 453533325 454254379 454783592 455027580 455574265 455669174 455479507
3489.1 455479507 455565834 456548233 457174759 457507820 458266525 458876343 459424629 459325066 459689484 460188026
3498.7 460188026 460066795 460693932 462456207 463632050 462799225 462486572 463478165 464313660 464458427
3507.4 464458427 465578079 466633682 465789833 466264381 467300301 468313370 468963394 468810387 469112053
3516.1 469112053 469772644 470659485 471039848 471278229 471522942 472510796 474020157 474014664 473822250 474091530
3525.7 474091530 474948006 475708733 476476250 476888046 477410698 478441315 478515091 478938141 479249153 480659294
3535.4 480659294 482164536 481637955 482392693 483165359 483410072 483731956 484889565 486019211 486926918
3544.1 486926918 487964134 487655792 489290390 489475822 489089317 490080338 491349030 493594017 492815247
3552.7 492815247 492701073 493344841 493865814 495463905 495333977 496165276 497794151 498440704 498122826
3561.4 498122826 499524956 500964775 500294113 503416405 505633316 505672188 505533791 502950554 504507332
3570.1 504507332 505631638 506283073 507420807 508706093 509619751 509971848 511701279 512058678 513077965
3578.8 513077965 514673576 514949646 515609856 516448212 517706566 518105774 521102524 524841423 523758736
3587.5 523758736 523206711 521158562 522517891 524878540 527179298 528217850 527746696 530846634 529709129
3596.1 529709129 529786453 532488098 532294960 534315567 535414467 535761833 537051506 537570915 538439560
3604.8 538439560 540834389 543661880 541914444 544023628 545023003 543099937 548856163 550848618
3612.5 550848618 546913986 549967194 549656067 551248474 555108604 555032654 556141167 555817070 555419807
3621.2 555419807 558028831 560119705 561357040 562798996 564459610 565672226 571124687 576839943
3628.9 576839943 566635361 567408485 569676170 574086304 577369919 574829102 575088005 577649384
3636.6 577649384 581101456 581692886 581896439 583626137 585025444 586548538 586865425 588423500 591011925
3645.3 591011925 596527367 599249306 593562965 597897034 599357338 596411057 594241104 596653557
3653 596653557 600091782 603792763 610485725 604758720 602775040 606611519 608239899 609468651 609509468
3661.7 609509468 611167564 612196198 613025208 614075279 613571625 616524963 619596481 621162910 623129578
3670.4 623129578 615701790 615099869 621385117 630853882 636345406 619709778 617955170 623453369
3678.1 623453369 628653908 627130241 625980492 627717285 628034019 628753662 630021286 630657005 634231949
3686.8 634231949 642357712 637210388 629208908 636035156 631774902 629511757 633982811 634203415
3694.5 634203415 634197578 634486809 634509506 634529419 634067802 636162453 639838371 637437553 634207535 637425346
3704.1 637425346 638803177 638787956 639043388 640567169 645406036 640161591 642524033 650329895 638108444
3712.8 638108444 638853416 642021790 641945496 641703568 643633652 646137543 643445358 643105698 648354874
3721.5 648354874 646331711 640554276 645320358 647924423 648323059 645103683 642711945 646133270
3729.2 646133270 646613388 651093369 651846085 643463135 650515976 654648819 646219559 644708023 646590118
3737.9 646590118 645873108 646893311 650071106 645945129 646846085 658385468 658209229 637718544
3745.6 637718544 643597946 648995972 655112839 655565338 645096130 654002380 651804199 643077164
3753.3 643077164 645846710 648983078 652846527 648428116 649237518 655765686 649823685 645820465
3761 645820465 648584290 649544449 649432602 653280029 652559052 646930008 648167343 653162766 656774979
3769.7 656774979 648325043 646973648 649931335 650961456 651615906 650942154 650759888 650761642 653865509
3778.4 653865509 655514145 647490387 647794876 649959717 651297836 653726883 651165237 649857864
3786.1 649857864 650413666 650316544 651454315 651364594 650748062 650185776 650423737 650526352 651592789 655746841
3795.8 655746841 653901596 648282928 647977371 650867767 657055664 655051041 646399002 647256927 648405151
3804.4 648405151 652155533 659651566 653895187 645997391 648981552 650465927 650517197 651070786 650559769
3813.1 650559769 650642548 655852432 659187012 645794678 647565536 652025223 655216751 657692413
3820.8 657692413 644168930 645717468 649743576 650587997 652627335 653483124 649566040 648230515
3828.6 648230515 649894714 653683548 656353378 647555008 647838135 655768433 652420731 649009705
3836.3 649009705 656671982 652231903 646505661 655339584 650558167 647120590 653907547 653422165
3844 653422165 648519821 649531479 649706192 648849335 651023178 650578537 650837860 657502823 656051636
3852.7 656051636 657228165 643153458 640178833 649411545 649657364 646657562 648127747 650313416
3860.4 650313416 653724823 650259933 647942963 654358902 652215500 644773026 646448975 651304855
3868.1 651304855 659932861 655764160 642872009 644005127 650129929 656916962 647616653 645727081
3875.8 645727081 648844376 648440704 649847031 654617004 652662582 643192978 646580276 647821579
3883.5 647821579 648733978 656251373 646016541 643673782 647135849 647644501 651722946 654524002
3891.2 654524002 647590332 646283875 648108673 646611023 647343979 647959671 650027390 653528519 643924484
3899.9 643924484 646670074 650713882 645575790 648945084 647441406 645890427 645833740 645541992 647149811
3908.6 647149811 647074966 647512741 647441406 647275848 647043076 646121216 647755814 650922623 649453354
3917.3 649453354 644633026 647540665 649078293 644294586 645602570 647106400 648198624 647755127
3925 647755127 643878174 644809723 646536636 648577042 648715973 647218170 648830261 646494217 644390182
3933.7 644390182 645692749 645637512 645800018 646449356 646216278 645792618 645471725 646373215 647872696
3942.3 647872696 645132828 644008865 644824524 645293121 647417679 646232529 645697403 646085815 643731308
3951 643731308 644832840 645858994 645301743 645183563 645255051 645483093 644947586 644715500 644173584 644677658
3960.7 644677658 645768661 644899826 644148941 643699570 644145279 644840088 644461746 645070496 644954376
3969.3 644954376 643523178 643728027 644403076 644674759 644134216 643361816 643819809 643868256 643851318 644486465
3979 644486465 645167465 645221634 644369278 643812714 643731613 643527527 643225555 643692551 643870697 643614578
3988.6 643614578 643852234 643272400 643310471 644125061 643692322 642696838 642544479 643154984 644071579 644999771
3998.3 644999771 644516907 643124619
4000.2 643124619
##END=$$ End of the data block
