##TITLE=$$ Begin of the data block
##JCAMP-DX=5.00 $$ ACD/SpecManager v 10.08
##SPECTROMETER/DATA SYSTEM=Varian
##DATE=18 Dec 2012 13:33:08
##DATA TYPE=INFRARED SPECTRUM
##DATA CLASS=XYDATA
##ORIGIN=
##OWNER=
##NPOINTS=3735
##FIRSTX=399.26403809
##LASTX=4000.35498047
##MAXX=4000.35498047
##MINX=399.26403809
##MAXY=76.62544250
##MINY=44.23198700
##XFACTOR=1.0000000000
##YFACTOR=0.000000100000000
##FIRSTY=67.63185883
##DELTAX=0.96440572
##XUNITS=1/CM
##YUNITS=TRANSMITTANCE
##XYDATA=(X++(Y..Y))
399.3F76318588N373764k023468j3078155j7982941n258408M147950L734512j208878
407F50022964n363998L658371N643082p835541l219376M625321j217575o181259k280045
415.7F37851944M696808L13721p599183o102371Q357163O621322J273957j350403n504112
424.3F38558846K078056R149475M675980L062667k628173o125946m554291n412789
432.1F38803825k329368M328232J109314M73861L737946k265701m8829J21918m290008
440.7F39641190k328911L035087l33023M05045J448974p681884L53889M884491P76863
449.4F40201721R58176j724205L950004m2877o518173j643867L343009J63956q758316
458.1F29929428N812073L47862k186851M407692k247887m745865p70683Q06122J323738
$$ plain form
399.3 676318588 681692352 679668884 666590729 648607788 643349380 647497330 651231842 650022964
407 650022964 644658966 648317337 653960419 646124878 642905502 647530823 646313248 640131989 637851944
415.7 637851944 642548752 642862473 635263290 629160919 637518082 644139404 645413361 644062958 638558846
424.3 638558846 640636902 649786377 654462357 657525024 654896851 648770905 644216614 638803825
432.1 638803825 636474457 640802689 641912003 642385864 646123810 643858109 643809280 643931198 639641190
440.7 639641190 637312279 640347366 640014343 640419388 641868362 634186478 634540367 639424858 640201721
449.4 640201721 641159897 639435692 643385696 643342819 636824646 635180779 638523788 638687744 629929428
458.1 629929428 635741501 636089363 633902512 638310204 636062317 631316452 630545769 631351891 632675629
466.8F32675629j51024l632889L074684L238106m133606m303513N77050L974113L024788
475.5F34343338K267456j129417O79741M192428j486664k45628n05447j819611J292038
484.1F37588234J049957p92427j551132K159576K581406J150742m92554j373367k065545
492.8F38254890l108329n11704J332245L053017O5231J92108K064781l092537m745178
501.5F33504524k978515O69670J731910M224320P72705l563690K232513J142616j657867
510.2F36078186k816429l023567J38702J524391r14650j553573K813186K731247J998635
518.9F36976128J05514m190674k819366K88925K207603q36105k691154O58264J581611
527.5F31280746o79359j159325n43785q23173K30026L30658P93762J42403q00972k77634
$$ plain form
466.8 632675629 632524605 628891716 631966400 635204506 631070900 626767387 627344437 631318550 634343338
475.5 634343338 636610794 635481377 636161118 640353546 638866882 638621254 638115807 636296196 637588234
484.1 637588234 638638191 637845764 636294632 638454208 641035614 642186356 641693802 640320435 638254890
492.8 638254890 635146561 634634857 635967102 639020119 639085350 639277458 641342239 638249702 633504524
501.5 633504524 630526009 631195679 632927589 637151909 637924614 634360924 636593437 637736053 636078186
510.2 636078186 633261757 630238190 630376892 631901283 630986633 629433060 632246246 634977493 636976128
518.9 636976128 637081642 632890968 630071602 630360527 632568130 631732025 629040871 629699135 631280746
527.5 631280746 630601387 629442062 628898277 628075104 628305130 628635788 629429550 629571953 628770981 628493347
537.2F28493347O43959J761093K03438j48010k40212n60226j338615k164803Q82645
545.9F27532616J419792N72281L15056N69343K018242Q63152j555367k037620j428681
554.5F28268814p53250J834106K056504O32705r95025j369515n68657j202964J339264
563.2F29241982N05447m29993M74892k16866P85752q80318M24767L30505r5100M91867
572.9F30632935k659798q53424M67529R09424Q48503K2392R04580O18896l24173k075462
582.5F28491402j621590j496468K32392K371101J308479Q96798J08795J407966K80304
591.2F31979179j479911l41340p34596M4670k52647k14844N97038J423722N22957j274376
600.8F30269852j304245k283936o97632n9013o58989l6125p90749j305885j033173
$$ plain form
537.2 628493347 629137306 630898399 631101837 630953827 630713615 630153389 628814774 626649971 627532616
545.9 627532616 628952408 629524689 629839745 630409088 632427330 633290482 631735115 629697495 628268814
554.5 628268814 627515564 629349670 631406174 632038879 631043854 629674339 629105682 627902718 629241982
563.2 629241982 629747429 629317436 629792328 629575462 630361214 629480896 629905663 630236168 630141068 630632935
572.9 630632935 627973137 627119713 627587242 628496666 629345169 629367561 630272141 630891037 630566864 628491402
582.5 628491402 626869812 625373344 625605736 627976837 629285316 630182114 630290909 631698875 631979179
591.2 631979179 630499268 630157928 629423332 629468002 629215355 629000511 629597549 631021271 631544228 630269852
600.8 630269852 628965607 626681671 625984039 625925026 625266037 625229912 624439163 623133278 622100105
609.5F22100105J75019L47137p89986j858902r76562j127472j023331J351090K02102
618.2F18399200M04587M64478k04315R79576j71967j472397j825638l88259J850509
626.9F18035774K563248K341385K159462K662925K437935J961136K006912o87103l425979
635.5F30055695j021233l43666k87171J506691R27926J864700K463493J864662Q69332
644.2F37900429l75595K85949J208115J020393m43840M91524J985931J788331Q87756
652.9F44748993m32129k38876r40018n22614Q14438Q59146L71170l74755O23474R1400
662.5F45000229P62176J317597K13928J436386n28183o253967K716598K247849J348953
671.2F48261566R70459J032105j53427j94855L24783n30472q6670Q58384R01107K35062
$$ plain form
609.5 622100105 622275124 622622261 621832275 619973373 618996811 617869339 616846008 618197098 618399200
618.2 618399200 618803787 619268265 619063950 620043526 619871559 618399162 616573524 616185265 618035774
626.9 618035774 620599022 622940407 625099869 627762794 630200729 632161865 634168777 633481674 630055695
635.5 630055695 629034462 628690796 628403625 629910316 630838242 632702942 635166435 637031097 637900429
644.2 637900429 637524834 637810783 639018898 640039291 639595451 640086975 642072906 643861237 644748993
652.9 644748993 644316864 644077988 643137970 642615356 643429794 644288940 644660110 644285355 644908829 645000229
662.5 645000229 645762405 647080002 647293930 648730316 648202133 641948166 644664764 646912613 648261566
671.2 648261566 649232025 650264130 650110703 649915848 650240631 649710159 649623489 650481873 651382980 651618042
680.9F51618042K49939N34973N28183K4643j153336j156463k01874M82025K71988n60913
690.5F50637207q04138L96118P87888n07889j164475o81686J91040p21207j085129
699.2F47047729K09656N66407J118011R11942K00881j40075o75965j01318j18179l23563
708.8F48695526J045303J713639R84726P56225J249008J072617Q53272R92355L53241
717.5F57715912o72379l66668Q17947R50623J332931J695252Q94393Q70591O56891
726.2F63895493p64008j386261q54568n46494k90527L70636Q10470J166077J452103
734.9F63852921Q70513j80282q8883L22648j34583K05917J46866k5863J528930J688156
744.5F68186340J474762J788178O26449K84272O30798M37622P59659J126404J093979
$$ plain form
680.9 651618042 651867981 652402954 652931137 652955780 651802444 650645981 650444107 650926132 651198120 650637207
690.5 650637207 649833069 650229187 651017075 650509186 649344711 648663025 648854065 648132858 647047729
699.2 647047729 647257385 647823792 648941803 649853745 650054626 649914551 649238586 649137268 649019089 648695526
708.8 648695526 649740829 651454468 652439194 653195419 654444427 655517044 656370316 657362671 657715912
717.5 657715912 657043533 656676865 657494812 658445435 659778366 661473618 662368011 663238602 663895493
726.2 663895493 663131485 661745224 660890656 660344162 660053635 660424271 661234741 662400818 663852921
734.9 663852921 664723434 664543152 664454269 664776917 664642334 664848251 664995117 664969254 666498184 668186340
744.5 668186340 669661102 671449280 672075729 672360001 672990799 673428421 674188080 675314484 676408463
753.2F76408463J437683J900482J465835J077347j6861o16684M58222r0638J79902
761.9F82203751R22241L93295J045151P82318m19006q4229R41467J53046j392441j685943
771.5F82859650L0288J760636M75387M56009J664505J168061Q63723Q49304L93296
780.2F90520859Q0719J174850J208954J004028J502991Q99353Q73642P07626M69437
788.9F98442459k89230n01099J373j2512Q52661J217804J004639K30560O86264R83353
798.5G02616272l03955p858r2011l55987l67890J29852N85175M82864J112290P72781
808.2G04571533M48151j1978m61197j99738L85819P15103j16577n3635O13480R55810
817.8G06846771O21720N26657O92444L61251j58004j330109k56577K22931q72726O37588
$$ plain form
753.2 676408463 677846146 679746628 681212463 682289810 682272949 681656265 682114487 682023849 682203751
761.9 682203751 683125992 683519287 684564438 685346756 684927750 684843521 685784988 685938034 684545593 682859650
771.5 682859650 682889938 684650574 685125961 685581970 687246475 688414536 689278259 690127563 690520859
780.2 690520859 690601578 691776428 692985382 693989410 695492401 696391754 697265396 697973022 698442459
788.9 698442459 698153229 697652130 697653503 697640991 698493652 699711456 700716095 700946655 701632919 702616272
798.5 702616272 702312317 702304459 702212448 701856461 701488571 701618423 702203598 702686462 703798752 704571533
808.2 704571533 705019684 705007706 704546509 704346771 704732590 705447693 705331116 705277481 705890961 706846771
817.8 706846771 707468491 707995148 708687592 709048843 708890839 707560730 707304153 707527084 706654358 707291946
827.5G07291946Q02536j653823j617051q2168j089173k040329j852951k003402j915360
836.1F95840225p37991K05383q89740j269378j333466k340927k059021p20368j73721
844.8F86520996j176071q12302M06876K87399Q81119P01141K87857K97623l42483J311035
854.5F88363190K569122J589127J728210J352081K63749R40628J836090J529617N91202
863.1G00763016M38080M75845R7504P19986J655654J486588O85654N00335J55182J47476
872.8G07125320Q6289j48697P12585M04435M04586L12119q90503o83594j64947n16663
882.4G06640930j862945k287522j194839n72052l41873O85730Q18939j97220j50833
891.1G01538315m54865j351089j314774k78702j77078m89120Q22220J550750J518174
$$ plain form
827.5 707291946 708094482 706440659 704823608 704741440 703652267 701611938 699758987 697755585 695840225
836.1 695840225 695102234 695307617 694417877 693148499 691815033 689474106 687415085 686694717 686520996
844.8 686520996 685344925 684532623 684939499 685226898 686108017 686809158 687097015 687394638 687052155 688363190
854.5 688363190 690932312 692521439 694249649 695601730 695865479 696806107 698642197 700171814 700763016
863.1 700763016 701201096 701676941 701774445 702494431 704150085 705636673 706322327 706822662 706977844 707125320
872.8 707125320 707211609 707062912 707775497 708179932 708584518 708896637 708006134 707322540 707157593 706640930
882.4 706640930 704777985 702490463 701295624 700723572 700381699 701067429 701886368 701689148 701538315
891.1 701538315 701083450 699732361 698417587 698138885 697961807 697472687 698294907 699845657 701363831
899.8G01363831N84182n16510n21545j279755j084137m70047j156006q22143L55301
908.5F96453171l8376p34482n69992j251297k213898k090606j421433j189270j339035
917.2F85604782j648636j107483l61328n13916n06744m81568r68246k107468k298660
925.8F75610733j370773j317902j087036J30539P39136N07736J031799J306763o4011
934.5F75486984j173630k42080O54831M83246J662445K532348J677857J240616J779937
943.2F84102554J921769M85534K84043J357574J011734O98242O27060O48956M56849
951.9F91594315O69250R54819k18964j81808j87683j634446j678314j418686j833038
960.6F86065445p99255n2796r73968j346665r41925j210251k253952k178802j332321
$$ plain form
899.8 701363831 701948013 701431503 700909958 699630203 698546066 698076019 696920013 696097870 696453171
908.5 696453171 696414795 695680313 695110321 693859024 691645126 689554520 688133087 686943817 685604782
917.2 685604782 683956146 682848663 682487335 681973419 681466675 680985107 680016861 677909393 675610733
925.8 675610733 674239960 672922058 671835022 671965561 672704697 673212433 674244232 675550995 675486984
934.5 675486984 674313354 674071274 674726105 675209351 676871796 679404144 681082001 682322617 684102554
943.2 684102554 686024323 686509857 686793900 688151474 689163208 689861450 690488510 691137466 691594315
951.9 691594315 692263565 693218384 692999420 692817612 692629929 690995483 689317169 687898483 686065445
960.6 686065445 685266190 685213394 684239426 682892761 681950836 680740585 678486633 676307831 674975510
969.2F74975510o41861j84326J89743N10177o92520j318283o71005j150055j377945
977.9F69639435q11844q94852j031952m62494k47039j32752J08261q50753j599885
986.6F63716125j489944k138519j962357j317520j518249q51365m02984n67475j698532
995.3F51769180k553177j204910m08401n87235r93118j201248p72248J32599n44967
1004F43636475j291504j28784j063004j750336j246605j195793j575660j441765K57034
1012.6F34200058o70395r97963l6278k13699n55687j784744k386360k683449j477280
1021.3F23394203p96356q11462k09580p85446o75583j194229j122208n63736j414871
1030F15820732j966247j396332l94707m17557o21185l36342Q26950N27840l04756l73726
$$ plain form
969.2 674975510 674333649 674149323 674339066 674849243 674156723 672838440 672167435 671017380 669639435
977.9 669639435 668827591 667932739 666900787 666438293 666191254 666058502 666166763 665316010 663716125
986.6 663716125 662226181 660087662 658125305 656807785 655289536 654438171 654035187 653467712 651769180
995.3 651769180 649216003 648011093 647602692 647015457 646022339 644821091 644048843 644181442 643636475
1004 643636475 642344971 642216187 641153183 639402847 638156242 636960449 635384789 633943024 634200058
1012.6 634200058 633529663 632531700 632495422 632281723 631726036 629941292 627554932 624871483 623394203
1021.3 623394203 622597847 621786385 621576805 620791359 620115776 618921547 617799339 617235603 615820732
1030 615820732 613854485 612458153 612063446 611645889 611024704 610688362 611515312 612043152 611738396 611364670
1039.6F11364670j094589q72612l36075M5852K95601Q27675J10855P1831J094971k18468
1049.3F11289711m00963j33934r7198p19300j337776n0278L96004M85039j55525j84479
1058.9F09091301L75900j62048j187477p51076j43661p81785R80263N62439Q2092Q63381
1068.6F08929329k25220L76091p36084j172943k96593k54478M59824j15L35770M15611
1078.2F07831192l23982K55394O38389J29662n40352j023445q0566J103973J075935
1086.9F09066200m3869q95576M42962J98594j53885o73447j881104m10766n14336n29480
1096.5F04605293m75540q16383J89323K01950j86004p60613p26547j636849j425628
1105.2E98969002q72917j134301K3919N7868j34239j275520r46617p10449j105538
$$ plain form
1039.6 611364670 610270081 609397469 609061394 609107246 609402847 610230522 610341377 610413208 611508179 611289711
1049.3 611289711 610888748 610754814 610657616 609938316 608600540 608550262 608946266 609431305 609275780 609091301
1058.9 609091301 609467201 609305153 608117676 607366600 607222939 606441154 607421417 607983856 608065948 608929329
1068.6 608929329 608704109 609080200 608344116 607171173 606874580 606620102 607079926 607079811 607415581 607831192
1078.2 607831192 607507210 607762604 608400993 608530655 607990303 606966858 606886292 607990265 609066200
1086.9 609066200 609022331 608126755 608569717 608768311 608614426 607940979 606059875 605649109 605134773 604605293
1096.5 604605293 604129753 603313370 603502693 603704643 603518639 602758026 602031479 600394630 598969002
1105.2 598969002 598096085 596961784 596985703 597043571 596909332 595633812 594687195 593976746 592871208
1113.9E92871208k97050k67144R59244q5068m33502J93901Q74863J125450l62243M18243
1123.5E94997902n99213k28729J6022p37152J2626k98233J344528R99070N00412N52978
1133.2E96560211J78604P7095j76086M94842p50465j30730K73285J76239L63808o13556
1142.8E96453247m15459r81254l87001r65271p67861M00925L0251Q4495q11920j8616
1152.5E92621536K81258M99496j65481m81529J174926L88146M32625N63697J353302
1161.1E96667976J425896P32689J663589J534234J686248J467972J399689J446266
1168.9F08024559J911163K446938K352371K490006J577072J715355J959953J514740
1176.6F23992157J515961J808128J853981J452332K057113J966706J663932J305581
$$ plain form
1113.9 592871208 592574158 592307014 593266258 593181190 592747688 592941589 593816452 594941902 594579659 594997902
1123.5 594997902 594398689 594169960 594185982 593448830 593461456 593163223 594507751 595506821 596007233 596560211
1133.2 596560211 596738815 596815910 596639824 597134666 596384201 596253471 596526756 596702995 597066803 596453247
1142.8 596453247 596037788 595056534 594669533 593704262 592936401 593337326 593367577 593452072 592640152 592621536
1152.5 592621536 592902794 593402290 593236809 592755280 593930206 594318352 594750977 595314674 596667976
1161.1 596667976 598093872 598826561 600490150 602024384 603710632 605178604 606578293 608024559
1168.9 608024559 609935722 612382660 614735031 617225037 618802109 620517464 622477417 623992157
1176.6 623992157 625508118 627316246 629170227 630622559 632679672 634646378 636310310 637615891
1184.3F37615891M85382J004562R81293J64108L32260P65076P17926R91058R58862
1193F44016418Q86384J012725K81830M71726M24499j4648O27823L54919K975M12980
1202.6F48477631P15103N20935m0970K9373N37033J67465n48400k95105p2174k2584
1212.3F49468307M3030l9215M63867L33481m72107k82592k50779o86874l27377m28009
1221.9F47821732o29654j05744J00174M7684j37711k22320m87137l14102j57089k61612
1231.5F45654221K62832J45035k19269p1335N65796K78092j76926M13055K89155J525
1241.2F47142181l51181k14309K8534Q2168M11377R0180j02463k79541j07346q2016
1250.8F46617584J81656K04086o82525j70441Q9188l0365J51138L72086O5918l26310
$$ plain form
1184.3 637615891 638101273 639105835 640087128 640251236 640583496 641348572 642066498 643057556 644016418
1193 644016418 644902802 645915527 646197357 646669083 647093582 647078934 647706757 648061676 648064651 648477631
1202.6 648477631 649192734 649713669 649672699 649702072 650239105 650406570 649858170 649563065 649490891 649468307
1212.3 649468307 649511337 649472122 649935989 650269470 649797363 649514771 649263992 648577118 648249741 647821732
1221.9 647821732 647192078 647086334 647186508 647234192 647096481 646874161 646387024 646072922 645915833 645654221
1231.5 645654221 645917053 646062088 645842819 645771484 646337280 646615372 646438446 646851501 647140656 647142181
1241.2 647142181 646791000 646576691 646605225 646687393 647098770 647188950 647086487 646806946 646699600 646617584
1250.8 646617584 646799240 647003326 646320801 646150360 646239548 646209183 646360321 646732407 646798325 646472015
1260.5F46472015L23029K76184N78308J55716J5259O98547J86310K27585J38626K97394
1270.1F49368973K13318O5765N47867M48532N70450P52258J011353N75714K38495J97982
1279.8F53990707K53601R99375P56073K07748L80860J103820J391678J347351R29795
1288.4F61361008L35846N84793K63366K25144O84509O73599Q88825J272354J484451
1297.1F67773895J083451O17828M42123M27399L81546M92783N08194P6294N15060J057053
1306.8F73375626Q42285P85904N58014L33709K74964j61972m1199N07736L47061N07965
1316.4F77330093J111451P56149J82495L38745L79410L23791M21906N57403O55747
1325.1F82057190J77231j62506L73611O57349L85284L81699k43073j106643K83889
$$ plain form
1260.5 646472015 646795044 647071228 647649536 647805252 647820511 648519058 648705368 648932953 649071579 649368973
1270.1 649368973 649582291 649648056 650195923 650644455 651214905 651967163 652978516 653554230 653792725 653990707
1279.8 653990707 654244308 655243683 655999756 656207504 656588364 657692184 659083862 660431213 661361008
1288.4 661361008 661696854 662281647 662545013 662770157 663454666 664128265 665017090 666289444 667773895
1297.1 667773895 668857346 669475174 669917297 670344696 670726242 671219025 671727219 671803513 672318573 673375626
1306.8 673375626 674217911 675003815 675561829 675895538 676170502 676008530 675967331 676475067 676822128 677330093
1316.4 677330093 678441544 679197693 679380188 679718933 680098343 680422134 680844040 681401443 682057190
1325.1 682057190 682234421 682071915 682445526 683102875 683488159 683869858 683626785 682520142 682804031
1333.8F82804031J807251P24945k64053N6458K31399J30615l92990o1722r4833p05719
1343.4F84235382k28729Q0490J54266M38538M89654O5308l77808j78222m25873m12827
1353.1F83840179n28945p13349k20260J42364J36490l55148K78015M53415l10212j16882
1362.7F82605667r72137r40400n71899l87344j60599m14887k94265Q1558l51639n24368
1372.3F78069687J60293q74633j609955l20587J34964N8670n1270J48926m9591j35498
1382F75531006n188r6741M1962P97500J264039N8059L42102J038208P54547P31202
1391.6F80456696M55932L94440n39703j104813K82287Q0033R2087j058121r92584L44467
1401.3F78410721J19095j84479R4986q03528r83581M119n37414n83267l72773o00128
$$ plain form
1333.8 682804031 684611282 685336227 685072174 685128632 685360031 685490646 685097656 685035934 684941101 684235382
1343.4 684235382 684006653 684087143 684241409 684679947 685169601 685234909 684857101 684678879 684253006 683840179
1353.1 683840179 683311234 682597885 682377625 682519989 682656479 682301331 682579346 683032761 682722549 682605667
1362.7 682605667 681633530 680693130 680121231 679733887 679573288 679158401 678864136 678945694 678594055 678069687
1372.3 678069687 678229980 677355347 675745392 675424805 675559769 675618439 675567169 675716095 675666504 675531006
1382 675531006 675525818 675429077 675471039 676268539 677532578 677590637 677932739 678970947 679725494 680456696
1391.6 680456696 680912628 681307068 680767365 679662552 679944839 680024872 680116959 679058838 678066254 678410721
1401.3 678410721 678529816 678345337 678440323 677636795 676653214 676657333 676119919 675536652 675163879 674563751
1410.9F74563751k61688n1651l281k823M24347K55204m81568m25415k873306q6060
1420.6F71057510J156693M27933K61230k91290P2555K78015m65240q7357N06745o99768
1430.2F72217026m72489Q69065K42233j30692N18418N59387j355896m24500J333619
1438.9F73356171M52575L4867M13665K71073O85730J57471K64282Q27255J33286j221924
1448.5F75374451j71204R75494O50788L29056K94723Q79898J599961J325454j603470
1457.2F79655151k265625J754456J050949J210632J005860Q69903J854782K27356j10855
1465.9F85252609J280442J000900N40924O56357J665649J304550r45587J17035L434601
1474.6F94307480L428192P64923K23465J477661Q28552J048890Q42361m8828P02820
$$ plain form
1410.9 674563751 674302063 674250412 674247131 674244308 674668655 674923859 674442291 674016876 671143570 671057510
1420.6 671057510 672214203 672642136 672903366 672612076 672684631 672962646 672497406 672410049 672916794 672217026
1430.2 672217026 671744537 672613602 672855835 672725143 673243561 673802948 672447052 672022552 673356171
1438.9 673356171 673808746 673843613 674257278 674528351 675214081 675371552 675635834 676463089 676596375 675374451
1448.5 675374451 675203247 676178741 676829529 677158585 677453308 678333206 679933167 681258621 679655151
1457.2 679655151 677389526 679143982 680194931 681405563 682411423 683281326 685136108 685363464 685252609
1465.9 685252609 686533051 687533951 688074875 688731232 690396881 691701431 690755844 690872879 694307480
1474.6 694307480 697735672 698500595 698724060 700201721 701030273 702079163 702921524 702872696 703575516
1483.2G03575516J013794M24118J022110P92770p01675P62481p23266j815338j72730
1491.9G04177780L09220M04586L97415L00980l988800P81708N94177k136307O2638
1500.6G00903397q09708j173935r81064N00031O46972m802551k922211J41297Q69522
1509.3F92371750j595383N5847j213531k763138m37241r57794n13382j428528j851501
1518F81667099J287613K557754k207412o489106J565934P99637J216278k141037j613770
1526.6F76642990r5901p17240l10592l81623n26199m58679P6217l364486K85263K98385
1536.3F71448135k46734J245270l377228k203903J539917L94210j93710J264877J035080
1545F70905914k839355N95550M34952P45850L98025j568451R96399Q00782P61642q05435
$$ plain form
1483.2 703575516 704589310 705013428 706035538 706828308 706126633 706889114 706165848 704350510 704177780
1491.9 704177780 704487000 704891586 705289001 705589981 701601181 702382889 702977066 700840759 700903397
1500.6 700903397 700093689 698919754 697938690 698438721 699085693 694283142 691360931 691502228 692371750
1509.3 692371750 690776367 690832214 689618683 686855545 686418304 685460510 684947128 683518600 681667099
1518 681667099 682954712 685512466 683305054 676815948 678381882 679181519 680397797 678256760 676642990
1526.6 676642990 676547089 675829849 675519257 675137634 674611435 674152756 674228973 670864487 671149750 671448135
1536.3 671448135 671201401 672446671 669069443 666865540 668405457 668799667 668605957 669870834 670905914
1545 670905914 668066559 668662109 669097061 669842911 670240936 668672485 669668884 670469666 671231308 670425873
1554.6F70425873P77283K288589J947098l121872j1543579Q759994L752136J618195
1562.3F74903717O86951Q52737K5940N3787J097107K68708R13238j815109j40076P92618
1572F77639618l47824J19934K53372K28729l726806J303787Q57696l83300j83792j102753
1581.6F74658661l73840j063462r47952j182556j253052o63376j015243k14310j457977
1590.3F66486893q79822j456833j561432j126022k453079j565018j826782q68759j627198
1599F53121948j384201j368332j973571j230317k492447j881485k278900j531906k292251
1607.6F36688538j841317j373100k870560j213379k211608j381226k092094p90482
1615.4F22914772n34q422546p30591j247254p69500k003899p78961r77402m329910
$$ plain form
1554.6 670425873 671203156 673491745 675438843 672316971 660773392 669533386 673285522 674903717
1562.3 674903717 675590668 676443405 676469345 676523132 677620239 677888947 678802185 676987076 676847000 677639618
1572 677639618 677291794 677411728 677665100 677893829 674167023 675470810 676328506 675945206 675761414 674658661
1581.6 674658661 674284821 673221359 672273407 671090851 669837799 669174423 668159180 667944870 666486893
1590.3 666486893 665607071 664150238 662588806 661462784 659009705 657444687 655617905 654749146 653121948
1599 653121948 651737747 650369415 648395844 647165527 644673080 642791595 640512695 638980789 636688538
1607.6 636688538 634847221 633474121 630603561 629390182 627178574 625797348 623705254 622914772
1615.4 622914772 622914238 614491692 613761101 612513847 611744347 609740448 608961487 607984085 603654175
1624F03654175n21965j418228k54975k988090k475930j111183j427955q40721j627884
1632.7E90987244N20515M18358k071457k966270J039924p47604j94512J153222j165581
1641.4E86973839O59866l67393R82170J599617m34265J771926k139434J227150P65953
1650.1E91039429K278976J327400o102943N157623J507302K324523Q58346J767692
1657.8F00158348M74587J105613J214257N47218J854553o45256K367249J950149J487656
1666.5F10514374J579704J777458Q65402l52821L581543P01790R42116K139854K089653
1675.1F23839073M66385J797562K751884R99489J999168P81594J958198L587265Q32787
1683.8F39013405J48735N42335L895760K620010R16596J825256K011337K017670J459885
$$ plain form
1624 603654175 603132210 601713982 601459007 598470917 595994987 594883804 593455849 592615128 590987244
1632.7 590987244 591507759 591926117 589854660 586888390 587928314 587180710 586986198 588139420 586973839
1641.4 586973839 587633705 587266312 588248482 589848099 589413834 591185760 589046326 590273476 591039429
1650.1 591039429 593318405 594645805 588542862 593700485 595207787 597532310 598390656 600158348
1657.8 600158348 600632935 601738548 602952805 603500023 605354576 604709320 607076569 609026718 610514374
1666.5 610514374 612094078 613871536 614736938 614384117 617965660 618667450 619609566 621749420 623839073
1675.1 623839073 624305458 626103020 628854904 629854393 631853561 632635155 634593353 638180618 639013405
1683.8 639013405 639162140 639704475 643600235 646220245 647136841 648962097 650973434 652991104 654450989
1692.5F54450989K061386K691116K166596k052918L834610M415894M599228N850525
1700.2F78017426o336823L625183L072510K601166J610107J444168K673721J559907
1707.9F88267365K421417K329941J487731J107254R51920J609955Q99734P79114J962509
1716.6G01816940J413956k753067J172791J515502j93634k99606k13470l98865N89981
1725.3G02650528Q30917K56958N93033K016525Q97522n22689J939621K658691k037964
1734G09283142m002991K881012K297821J387711J948395J009369j595841J837082K283096
1742.7G17328796p1334K0752J774215J681061J292725J424026O69479K708359J694184
1751.3G28522263l68805K684936K055206J609040K168426J67160M45557J461868J485520
$$ plain form
1692.5 654450989 656512375 659203491 661370087 659317169 663151779 667567673 672166901 678017426
1700.2 678017426 671680603 675305786 678378296 680979462 682589569 684033737 686707458 688267365
1707.9 688267365 690688782 693018723 694506454 695613708 696565628 698175583 699075317 699854431 701816940
1716.6 701816940 703230896 700477829 701650620 703166122 702972488 702672882 702459412 702060547 702650528
1725.3 702650528 703481445 703738403 704331436 706347961 707245483 706722794 708662415 711321106 709283142
1734 709283142 705280151 708161163 710458984 711846695 713795090 714804459 713208618 715045700 717328796
1742.7 717328796 717257462 717278214 719052429 720733490 722026215 723450241 724119720 726828079 728522263
1751.3 728522263 728153458 730838394 732893600 734502640 736671066 736838226 737283783 738745651 740231171
1760G40231171K325363J08032p12204J440048R14994P11212R65194J018219j575622
1768.7G45426407N09872K625656R93882j281052k131729J989365J713409p37152P48443
1777.4G49857101M65851O20728N82962j98593K05612O74362J246338j22910k20031
1786G53111420R00802K36283m06876M05045M62722L72162p89337m54712K293549J052627
1795.7G57183685q99810L7078P76215l4256j234055J092530L84445p0191P51191N0354
1805.3G58037186L64151K94876k43149K61536Q72421n72815m64783L64304J76849N27039
1815G59617615J12076P18307K03247j52893N04837j47858J22300o76117Q7738J404342
1824.6G61793594j170196o52771J322403J832580P20368k867356k51541J009598J16882
$$ plain form
1760 740231171 742556534 742664566 741952362 743392410 744307404 745018616 745983810 747002029 745426407
1768.7 745426407 745936279 748561935 749555817 748274765 746143036 748132401 749845810 749108658 749857101
1777.4 749857101 750322952 750943680 751526642 751328049 751533661 752208023 753454361 753331451 753111420
1786 753111420 754012222 754248505 753841629 754246674 754709396 755081558 754292221 753837509 756131058 757183685
1795.7 757183685 756283875 756320953 757097168 757062912 755828857 756921387 757305832 757235641 757986832 758037186
1805.3 758037186 758401337 758696213 758453064 758714600 759587021 759014206 758549423 758913727 759090576 759617615
1815 759617615 759729691 760447998 760651245 760498352 761003189 760855331 760977631 760301514 760389252 761793594
1824.6 761793594 760623398 759970627 761293030 763125610 763845978 760978622 760727081 761736679 761853561
1833.3G61853561J47324p3242L98559L67127m07562M81872N7526J64108q8806N99289
1842.9G63499756J507416l111725K1057J159363J5411j10550L71704O88324p5149j76773
1852.6G63788834k07901Q2702O8817J85929K89764q7738L01972j97678k07977k97089
1862.2G63719635J93176L86429q9188N77012r5749M35028k7848j180114L95508L27835
1871.9G64641724J07345j93558M7455O9428K78778M36706J69907p8964m79279J16806
1881.5G65116348l87115k89612J33743L357L49274q5678Q00476O13632j159210j69907
1891.2G64925308J10550j48544L20282j11160q56629M40140M49142j44271J15814J47094
1900.8G65247726L01514j0681l48892n14756j39999J26267q1406J29242M65546J525
$$ plain form
1833.3 761853561 762000885 761927643 762326202 762693329 762285767 762767639 762825165 762989273 762900467 763499756
1842.9 763499756 765007172 761895447 761916504 763075867 763091278 762980728 763352432 764040756 763965607 763788834
1852.6 763788834 763580933 763663635 763732452 763918381 764208145 764120407 764422379 764224701 764016724 763719635
1862.2 763719635 763912811 764299240 764210052 764787064 764691315 765126343 765098495 763918381 764313889 764641724
1871.9 764641724 764749069 764555511 764602966 764672394 764951172 765387878 765557785 765478821 764999542 765116348
1881.5 765116348 764729233 764439621 764573364 764576721 764925995 764840317 765640793 766254425 765095215 764925308
1891.2 764925308 765035858 764887314 765207596 765096436 764239807 764679947 765129089 764984818 765100632 765247726
1900.8 765247726 765549240 765538559 765189667 764674911 764534912 764661179 764579773 764709015 765174561 765176086
1910.4G65176086j97830M62494m15878m26560j88903k26517Q69675o60401q46023M98657
1920.1G64044800O77643N42450r83124o47278N04227K43301m09393p1869R5444j15509
1929.7G63880692J89666J51978L16315k48948l72161o1112j13907j48849k79312K12326
1939.4G63526688m7455N09033M41360j301269P8506L89710k23694j27258r1629j45035
1949G63008957j15280L8833K05841J67695k44675l07999l08456J449J39466j38398
1958.7G62447433k6016j83029k66418q9722K15607K5863o5078M09393k08893o29272
1968.3G61629868J09252L95813R6894p858j75400q3542K6932n87311m68521L7231K57645
1978.9G61231003J08566j02692L3799j17112n0964o027j95694l38669k31399l63312
$$ plain form
1910.4 765176086 764978256 765440750 765024872 764598312 764409409 764182892 765052567 764392166 763546143 764044800
1920.1 764044800 764722443 765264893 764281769 763634491 764138718 764382019 763972626 763900757 763996201 763880692
1929.7 763880692 764070358 764222336 764538651 764289703 763917542 763856430 763742523 763593674 763314362 763526688
1939.4 763526688 763479233 763988266 764429626 763128357 763206863 763596573 763372879 763245621 763153992 763008957
1949 763008957 762893677 762932510 763138351 763306046 763061371 762753372 762444916 762446365 762585831 762447433
1958.7 762447433 762421417 762238388 761971970 761882248 762097855 762123718 762058640 762468033 762259140 761629868
1968.3 761629868 761739120 762134933 762231827 762223969 762048569 761965027 761991959 761404648 760936127 760973358 761231003
1978.9 761231003 761339569 761236877 761270676 761153564 761102600 761096573 760900879 760562210 760330811 759967499
1988.6G59967499n75638K37122L66134l26919J28555L81393l84597n48859j10474k0141
1998.2G59114075n7526l76205o5232K78397N3863Q0643K5864p7362k16675j84097l13111
2008.8G58262634l73687j78605j82952J93176J68075j30615J89057P7362l53241j22910
2018.5G57548294k59552n05752m30604k17132K98767J54648M5166j11160l50876N5847
2028.1G56227646k136l02658n44663j9607K83355k89535l2501K77175J67084j01623
2037.7G55662537l53928l70407j51062k16141k70233j1902j89361O1798J1978q6518
2047.4G54086761n2719l88641N6305k594l40653l02352Q6212N00107J17111l82843
2057G53376694m89121l0288o5613j40534k59094k09656O36444L93372k46964m93621
$$ plain form
1988.6 759967499 759391861 759628983 759995117 759668198 759796753 760178146 759793549 759244690 759134216 759114075
1998.2 759114075 759056549 758680344 758615112 758893509 758947372 759028015 759053879 758976517 758759842 758575745 758262634
2008.8 758262634 757888947 757710342 757527390 757720566 757888641 757758026 757947083 758024445 757671204 757548294
2018.5 757548294 757288742 756782990 756352386 756135254 756434021 756588669 756633835 756522675 756171799 756227646
2028.1 756227646 756225510 755922852 755378189 755358582 755641937 755352402 755319901 755597076 755764160 755662537
2037.7 755662537 755308609 754938202 754787140 754570999 754300766 754288864 754099503 754161301 754173279 754086761
2047.4 754086761 754034042 753645401 753701706 753699112 753358459 753056107 753142319 753642426 753759537 753376694
2057 753376694 752887573 752857285 752791672 752651138 752392044 752182388 752818832 753212204 752965240 752471619
2066.7G52471619j60599J84250l61939m63028O409K10266q1863Q9645J57852O5003
2076.3G52117615j05820p50961m32129k59247j06430M15649J4496k96402K42920N11627
2086G51351318p3700k67486J6174P5836l29666l21808p4768j52740j7548k34451J69907
2096.6G50141068N01861L26004o4697p55387L7308K99607l94135n52444M9209M46243
2106.2G50034637j04141L98560L13110l48892k6093J06659Q545j75934l27224m23279
2115.9G49455948M5776R8725O3018N18494J14899k594j4267j81656k28500l76587r0409
2126.5G49402847K976j25656k45743j03150K42081K44141K10647Q3847k47650k83050
2136.1G49181290J85775M02298r9792o13709n75485L3646Q60290O86264j47171l99093
$$ plain form
2066.7 752471619 752311020 752495270 752133331 751670303 751676712 751886978 751805115 751894760 752052612 752117615
2076.3 752117615 752011795 751260834 750828705 750569458 750463028 750878677 750893173 750596771 750839691 751351318
2086 751351318 751277618 751010132 751026306 751102142 750772476 750450668 750375900 750223160 750205612 749971161 750141068
2096.6 750141068 750642929 750968933 750904236 750148849 750186157 750485764 750091629 749539185 749588394 750034637
2106.2 750034637 749930496 750329056 750642166 750293274 750267181 750373840 750382385 750206451 749879227 749455948
2115.9 749455948 749501724 749600449 749663467 750181961 750296860 750294266 750279999 750098343 749869843 749493256 749402847
2126.5 749402847 749405823 749280167 749034424 748931274 749173355 749417496 749628143 749711990 749464340 749181290
2136.1 749181290 749367065 749769363 749669571 749055862 748480377 748514023 749374313 750060577 749913406 749514313
2145.8G49514313r2392L56903p8964m31519Q2398J95999j43814l84064o9809J25351
2155.4G49074402J30691L49350J01624j33362M2725p8888j48850J65406M5547K0294
2165G49568939L1662j02234J51139K28347L6240l54919m8142K87247p4310k27891l23410
2175.6G49172668j74026j23215K75955M26102P2785J11541k93884k21863M3183o8131
2185.3G49221115O0654n0736k73132J64490O22940K04162K64283J65329l08915j45874
2194.9G49924316p3928l26767m78135J74027J52817j76697K92282M66690K65274p8735
2204.6G50141144q1864j91955j05820k1210j17263n2720m9972K82135R2773J42289
2214.2G50037537Q773j41143J66092k18811l1357k98386n20401m0588K19192N7678
$$ plain form
2145.8 749514313 749421921 749778824 749699860 749268341 749350739 749546738 749402924 749018860 748949051 749074402
2155.4 749074402 749205093 749554443 749656067 749522705 749565430 749486542 749337692 749503098 749548645 749568939
2165 749568939 749600601 749498367 749649506 749877853 749914093 749559174 749511032 749798279 749723969 749496078 749172668
2175.6 749172668 748998642 748875427 749151382 749577484 749650269 749761810 749467926 749246063 749289246 749221115
2185.3 749221115 749281769 749231033 748957901 749122391 749745331 749949493 750213776 750379105 750070190 749924316
2194.9 749924316 749850388 749523621 749045486 749219513 749372330 749195633 749487915 749954605 750219879 750141144
2204.6 750141144 750059280 749867325 749761505 749740295 749623032 749570312 749520340 749802475 749895248 750037537
2214.2 750037537 750046310 749905167 750071259 749852448 749821091 749522705 749002304 748961716 749180908 749238586
2223.9G49238586l28140L07083K33689p4082n2032j42060J10169j88828j24359K3957
2233.5G49003983J33590K33002J29547J14670R9640J89514j87531k85110k92358j93406
2243.2G48945541l55529n70527J89591J80435M7150L72848L01285r2010j52588L1280
2252.8G48897476J7166Q7586l85895l94669l35388j51748L88870M09698M81720k78396
2262.4G48736420k02332K21024l37601l03879k9754J31378k52610r8800J09558R689
2272.1G47983093L49427Q1481j68762k12249k08283j77765J02768K29035j7396R6665
2281.7G48058014J77078Q1787n6610K98004J96686l25165l67889j18179O1645n46799
2291.4G47458572l94821j12304K12173M68903L07083N83420j57395j81732l86429m92706
$$ plain form
2223.9 749238586 748910446 749217529 749451218 749377136 749325104 749183044 749293213 749104385 748980026 749003983
2233.5 749003983 749137573 749370575 749500122 749614792 749714432 749903946 749716415 749431305 749138947 748945541
2243.2 748945541 748590012 748019485 748209076 748389511 748436661 748809509 749110794 749018784 748866196 748897476
2252.8 748897476 748914642 749002228 748616333 748221664 747886276 747734528 748123398 748533096 749014816 748736420
2262.4 748736420 748534088 748755112 748417511 748113632 748083878 748215256 747962646 747863846 747973404 747983093
2272.1 747983093 748332520 748414001 748245239 748032990 747824707 747646942 747749710 747978745 747961349 748058014
2281.7 748058014 748235092 748316879 748260269 748558273 748754959 748429794 748061905 747943726 748005371 747458572
2291.4 747458572 747063751 746951447 747163620 747632523 747939606 748523026 748365631 748183899 747797470 747304764
2301G47304764L87649m65240k68402M12292J55411J2817K31171K71301l66058l16010
2310.7G47359695n49545J81656M79355l95889n8365r1782K03095K32315m4327p5607
2320.3G47240601m0055J96762k48489O561l71170m94995M80042L49884l40195k79312
2329.9G46499634K01721k38800r9411M45251P1030p63245k04544N54123p39212j13907
2339.6G45612640J399155P20673p47223j48392R85184p34864n04608M15955K823O21567
2349.2G47622910N81207j9608N2948o20041o37359K3346l58506p6675M91486J90811
2358.9G47250519j066513j672745R2087J197510Q77151M36554k09351j33895N19485
2367.6G47290802M98734J78298O4316k10418l04795k47802K85415O29883Q6899m7379
$$ plain form
2301 747304764 747692413 747227173 746958771 747371063 747526474 747539291 747770462 748041763 747675705 747359695
2310.7 747359695 746810150 746991806 747471161 747075272 747016907 746925125 747128220 747360535 747316208 747240601
2320.3 747240601 747200546 747397308 747148819 747155380 746784210 746289215 746769257 747119141 746778946 746499634
2329.9 746499634 746701355 746462555 746363144 746808395 746879425 746116180 745911636 746465759 745726547 745612640
2339.6 745612640 747011795 747732468 746985245 746836853 747822037 747087173 746582565 746998520 747001343 747622910
2349.2 747622910 748204117 748184509 748237457 747617416 746980057 747003403 746644897 746568222 747059708 747250519
2358.9 747250519 746184006 744511261 744603348 745800858 746678009 747114563 746905212 746771317 747290802
2367.6 747290802 747789536 747967834 748032150 747821732 747516937 747269135 747554550 748184433 748271332 748223953
2377.2G48223953M08554N01328p4082k99072J38016K42081j80512m74396j49154K08130
2386.8G48544846K79312L64456R9869j44501r003j41296k92587k68174p8582L71856
2396.5G48726196L34015j64413m60663j04599K79617K53067P0572l90625j15280J69601
2406.1G48597488n7525l8834o7673P4845m1886K51618J08337o40259o8206m2954l57361
2416.7G47717590r9792J0986J84097J03531L15323K66571l80859k87171K51160J52893
2426.4G48234329p705k9221m21219l18222n9280j69907j11389r1553j08414N7755J93481
2437G47168655P3090p0114N8288R2774l14026j55029K01797j56326j55411j29013k71835
2447.6G46342850n1804J24283R3842J4038j30921l81088j03531K30103J80053j09787
$$ plain form
2377.2 748223953 748632507 749133835 749059753 748760681 748898697 749140778 748960266 748485870 748336716 748544846
2386.8 748544846 748824158 749188614 749288483 749143982 749134979 748993683 748701096 748432922 748354340 748726196
2396.5 748726196 749060211 748895798 748435135 748330536 748610153 748863220 748933792 748543167 748427887 748597488
2406.1 748597488 748539963 748501129 748433456 748508301 748466415 748718033 748826370 748186111 748117905 748074951 747717590
2416.7 747717590 747617798 747628784 747812881 747916412 748231735 748498306 748117447 747830276 748081436 748234329
2426.4 748234329 748226624 748197403 747776184 747457962 747398682 747228775 747117386 747025833 746917419 746975174 747168655
2437 747168655 747241745 747171631 747229919 747322693 747008667 746853638 747055435 746899109 746743698 746614685 746342850
2447.6 746342850 746291046 746415329 746509171 746523209 746392288 746011200 745907669 746137772 746317825 746208038
2457.2G46208038l71399m8446P9345J09024L6164j86844j00174m88586o63224J7853
2466.9G44591751L47748o1722l01895J19553M72946K36816M0054l23638o39725k7771
2476.5G44454117P6370l17688m04510l19062R7809K70004M13208K27356j82953l50799
2486.2G43963852l53775m1809j82266l56675k4795K44446n6534k34680p8507j41067
2495.8G42738190J35269K1667l13415l38898j64032K12021L0365j12152J75018L91007
2505.5G42775040k7008r1172N7602n58853m23965k71912j85928J11847o1875R0790
2515.1G41414566R6970J22757L5705m23126m75617k32772M4326j1978k8381K53601
2524.7G40796051K5177k71759J70441P6065k90909J57928m0130n08042k8457M42428
$$ plain form
2457.2 746208038 745836639 745788193 745867538 745976562 746012726 745825882 745725708 745237122 744573898 744591751
2466.9 744591751 744939499 744877777 744575882 744695435 745168381 745405197 745445251 745121613 744481888 744454117
2476.5 744454117 744530487 744212799 743808289 743489227 743587036 743857040 744270248 744497604 744314651 743963852
2486.2 743963852 743610077 743568268 743386002 743029327 743004532 743248978 743192444 742957764 742879257 742738190
2495.8 742738190 742873459 742895126 742581711 742242813 742078781 742290802 742321167 742209015 742384033 742775040
2505.5 742775040 742748032 742656860 742714462 742155609 741731644 741459732 741273804 741385651 741323776 741414566
2515.1 741414566 741511536 741634293 741669998 741246872 740771255 740538483 740582809 740570831 740542450 740796051
2524.7 740796051 740821228 740549469 740719910 740795975 740505066 740662994 740622864 740114822 740086365 740528793
2534.4G40528793K86255j4496k22396l30506k02026j28937j12457Q3465j68380o93665
2544G39025650j63650K90374J91727L42331k18430m21905q9340j10856k04391l88489
2553.7G38253021M4708L10746J35116J52436j54038m21371j00022o6681m08248J16500
2563.3G37862167L93830j8845q8730m3411O5002J60065j24588p02286m36020L2731
2573G37099915j30311j40457j06201Q087J12534R3536j29394J3427K00806k72522k36282
2583.6G36513138j67923k46277m1275n9280m18091m61960J83563M04434L81546J71128
2593.2G36259003m78363q17490n66788j55868L5476L16163N0659l76969k46734Q087
2602.9G34027176l0365k29721r5139m11224l39890K32850Q1634j75781l27912k99453
$$ plain form
2534.4 740528793 740815048 740800552 740578156 740247650 740045624 739916687 739804230 739887695 739719315 739025650
2544 739025650 738862000 739152374 739344101 739686432 739468002 739046097 738956757 738845901 738641510 738253021
2553.7 738253021 738297729 738608475 738743591 738896027 738741989 738320618 738220596 738153915 737745667 737862167
2563.3 737862167 738255997 738237152 738148422 738105011 738170013 738330078 738205490 737503204 737067184 737099915
2573 737099915 736969604 736829147 736722946 736731033 736843567 736937103 736807709 736821136 737021942 736749420 736513138
2583.6 736513138 736345215 736098938 736057663 735998383 735580292 735118332 735301895 735706329 736087875 736259003
2593.2 736259003 735780640 734963150 734396362 734240494 734275970 734592133 734642792 734265823 734019089 734027176
2602.9 734027176 733996811 733767090 733671951 733260727 732920837 733153687 733235321 733059540 732731628 732432175
2612.5G32432175O8893M64707j55488p70034j15586K71683k45361p23038n8594M52957
2622.1G31622314o408k65045l08228l24860r9487J59531n14374q35190o256K29950
2631.8G29651947j03683j86005j57166p1029Q3389k79312k44064N2261j07041j75476
2641.4G28463821m55703k39792l27149l12423R7656l53012j84174k3956P324M0436
2651.1G26713028l77884l18832m425J92566j30082n3863k49176o56510k3346N9967
2660.7G25151443p5531j57089k79922j29624o6147L052j11389j13068k42614l55530
2670.4G23623581k62070q5068L17078J82114k15607k48337k94189n75714m86527P248
2680G21962509n8822l25852Q4457K44904k04544q5297P0420j59836k43836k76031k29035
$$ plain form
2612.5 732432175 732501068 732965775 732810287 732040253 731924667 732196350 731950989 731227951 731169357 731622314
2622.1 731622314 731615906 731350861 731042633 730717773 730618286 730777817 730263443 729428253 729421997 729651947
2631.8 729651947 729548264 729362259 729205093 729134064 729217453 728938141 728694077 728746338 728639297 728463821
2641.4 728463821 728008118 727768326 727441177 727128754 727226410 726873398 726689224 726665268 726672592 726713028
2651.1 726713028 726335144 726016312 726011887 726204453 726074371 726020508 725771332 725114822 725091476 725151443
2660.7 725151443 725075912 724918823 724638901 724509277 724443130 724446182 724334793 724221725 723979111 723623581
2670.4 723623581 723361511 723276443 723593521 723775635 723560028 723311691 723017502 722441788 721955261 721962509
2680 721962509 721903687 721577835 721662292 721907196 721702652 721617355 721687775 721527939 721284103 721008072 720779037
2690.6G20779037k58636j17798J59912J05820j11160l52555m74014j6937M40750j69601
2700.3G19984818q71201n26810p0801l65829j87912M11758K1439k46963J00479m1046
2709.9G18207932m30604l72467m26483k74658J96152m9362K670r3155l79105N8670
2719.5G16439590j16653m67606l92379j46714k8839j3275l9520k37885O4164M9285
2729.2G15110168m52423p35092k64587L09830j93863j73874J00479j39008j35574j48163
2738.8G13277893j08032k33841k20337m0131l76739p01676l30886K47116K09198M1275
2748.5G11763840k1286j70441k54593m53262j92261P6752l54004l72467j34049J2665
2758.1G09900894J04828k11334m29001j18866L23715l04642q09326m15649l53394m6997
$$ plain form
2690.6 720779037 720520401 720402603 720562515 720668335 720557175 720204620 719730606 719713669 720154419 719984818
2700.3 719984818 719113617 718586807 718516006 718150177 717962265 718374023 718395462 718148499 718248978 718207932
2709.9 718207932 717777328 717404861 716978378 716703720 716899872 716850510 716853180 716760025 716380920 716439590
2719.5 716439590 716322937 715855331 715462952 715316238 715287399 715274124 715234604 714996719 715060883 715110168
2729.2 715110168 714657745 713922653 713658066 713967896 713774033 713600159 713700638 713561630 713426056 713277893
2738.8 713277893 713169861 712936020 712715683 712675552 712298813 711597137 711266251 711513367 711722565 711763840
2748.5 711763840 711742554 711572113 711317520 710864258 710671997 710748749 710394745 710022278 709888229 709900894
2758.1 709900894 710005722 709794388 709365387 709246521 709570236 709265594 708456268 708040619 707687225 707640228
2767.8G07640228j7013K5863L8224m94843k40021q6212j31302n7602j68457k21176
2777.4G06287689m24194o05240m88968M32053M49981o50100o19278k15988k47574l06855
2787G03611526k03399k37885n33065m25568l9749k17057l79562K6093k15683n87387
2796.7G00798264j85700Q2474m02146p45925k28730j1062j52359k19117l18527n28259
2806.3F98088913o49185l5553j4572n29328k32391l60947o65970j74636j54496l19442
2816F94952393l39737p18918n01023l73916n50003k33307k27432n93109n28489k0599
2825.6F90865860j45798n77621n20249n02166n30777j84174j01471o07300m09622m29993
2835.3F86856689q55636m37927m83017r82132j127472j083222j113586j047821r66721
$$ plain form
2767.8 707640228 707623215 707649078 707687302 707192459 706952438 706866226 706734924 706677322 706508865 706287689
2777.4 706287689 705863495 705258255 704769287 705201340 705651321 705001221 704381943 704165955 703918381 703611526
2787 703611526 703408127 703170242 702637177 702211609 702171860 701954803 701575241 701601334 701385651 700798264
2796.7 700798264 700612564 700695038 700292892 699546967 699318237 699307175 699154816 698935699 698617172 698088913
2806.3 698088913 697439728 697404175 697389603 696860275 696627884 696266937 695600967 695426331 695271835 694952393
2816 694952393 694612656 693893738 693392715 693018799 692468796 692235489 692008057 691414948 690886459 690865860
2825.6 690865860 690720062 690142441 689622192 689120026 688589249 688405075 688303604 687696304 687286682 686856689
2835.3 686856689 686001053 685563126 685080109 684097977 682970505 681887283 680773697 679725876 678759155
2843.9F78759155j227722j509704j315308p98493j322250j598892j116409r59778m05197
2852.6F68505402l62320n66330n47943j37177P07703N05523k17361p04041n69610J72348
2862.3F66786194N57937J08414k30789p11212j284638m55474l34931n82886l65677
2870.9F63486938n73120j52282k65885n75561l86200j52512J9837r385j47247o35681
2880.6F60608902n06592l44238k65808l26081m53414J94168k89154o97098k28958n36270
2890.2F57155457r60465q68912m78210k81983j34353m78211p42950l85819n48782r38797
2899.9F51336975r38415m60816k02026p09915q53653j61972k56958m61884L0289k38419
2909.5F47083206k53906n12848j249924j282577j014481n30929p42340r30329p91817
$$ plain form
2843.9 678759155 677531433 676021729 674706421 673907928 672585678 670986786 669870377 668910599 668505402
2852.6 668505402 668143082 667576752 667028809 666891632 667599335 668104858 667887497 667183456 666613846 666786194
2862.3 666786194 667344131 667452545 667221756 666510544 665225906 664770432 664435501 663852615 663486938
2870.9 663486938 662913818 662761536 662495651 661920090 661533890 661381378 661401215 661391830 661244583 660608902
2880.6 660608902 660102310 659758072 659492264 659166183 658712769 658906937 658617783 657920685 657691727 657155457
2890.2 657155457 656194992 655326080 654847870 654565887 654431534 653953323 653210373 652824554 652275772 651336975
2899.9 651336975 650398560 649937744 649735718 649025803 648172150 648010178 647753220 647291336 647321625 647083206
2909.5 647083206 646829300 646316452 645066528 643783951 642769470 642238541 641496201 640565872 639774055
2918.2F39774055p58285q13599j006508m68902l70979l08075n1155j46370K7504j45150
2927.8F35732536L1128M10614N80368L67012k63252k670L84140L09067P01675P69691
2937.5F39020309K15455L48472M51622K34909L21732K99835K21024N9356K43759L54615
2947.1F41771088k3499j42670n3253k11639l72696j62659k74200k64435m41742q21915
2956.8F39002380q2779M20495J47171l94440m33426p6447j62468M7074K84233P50542
2966.4F39502335Q30078L61023O53228M68293n9128K86713O87484N84412K04925Q5221
2976.1F43604584O55060Q35113K65656L39813P46689N15747j40763l17688K07138O06003
2985.7F47317352O38428L12958K8381L05023O09207L58277j78452l47519j17874j50604
$$ plain form
2918.2 639774055 639015770 638202171 637195663 636726761 636355782 636047707 635996552 635850182 635877686 635732536
2927.8 635732536 635763664 636174278 636754646 637121658 636858406 636855736 637239876 637548943 638250618 639020309
2937.5 639020309 639235764 639584236 640035858 640270767 640592499 640892334 641113358 641172714 641416473 641771088
2947.1 641771088 641747589 641604919 641551666 641340027 640967331 640804672 640530472 640266037 639824295 639002380
2956.8 639002380 638919601 639340096 639487267 639092827 638659401 638582954 638420486 638467560 638751793 639502335
2966.4 639502335 640332413 640693436 641346664 641814957 641755829 642042542 642730026 643314438 643519363 643604584
2976.1 643604584 644259644 645094757 645360413 645700226 646446915 646962662 646821899 646504211 646711349 647317352
2985.7 647317352 647955780 648268738 648297119 648602142 649211349 649569626 649391174 649043655 648925781 648775177
2995.3F48775177n6229L83530O2408j45874K48642J66932q698k96783l89023o790J07879
3006F48841171O2790k19421l29743k11029o6986N74112N2948j155090o49033K50321
3015.6F47150040K37426l41034m87518k23465l66668o26221n11322n9204j14518l48968
3025.2F44308548m11911m40369m52881j011123q51517n0812K16141J59760m01993q29468
3034.9F40234375k76031J70135m18663p64160p92504p22579l59993m18053q4572P3929
3044.5F36641884p05414j145019o20728j77536j28670j95579j038666o32820L12309
3053.2F32309761j86005l43856l90664n13763n72205q19206p72171l93410k80609l42521
3062.9F27695351j44501m72298m73480l38554o50177n41840k91672k83470n04036j88103
$$ plain form
2995.3 648775177 648718948 649102478 649164886 649019012 649267654 649434586 649425888 649129105 648740082 648733292 648841171
3006 648841171 648903961 648684540 648354797 648143768 648076782 648650894 648703842 647548752 646899719 647150040
3015.6 647150040 647387466 647046432 646558914 646335449 645968781 645342560 644831238 644772034 644657516 644308548
3025.2 644308548 643896637 643456268 643003387 641992264 641140747 641089935 641306076 641465836 641063843 640234375
3034.9 640234375 639958344 640128479 639709816 638945656 638153152 637430573 637070580 636652527 636567955 636641884
3044.5 636641884 635936470 634791451 634170723 633993187 633864517 633668938 632630272 631997452 632309761
3053.2 632309761 632123756 631779900 631389236 630875473 630303268 629484062 628711891 628318481 628037872 627695351
3062.9 627695351 627550850 627078552 626605072 626266518 625616341 625074501 624782829 624499359 623995323 623807220
3072.5F23807220k77519l03001J16043k78397n76973p29637k87018k67791n78118k30942
3082.1F20393867m36897m05731n19943l33748J39007r6092n88760j060562p58896n75447
3091.8F15756798j88751n5008m58985j04637m63753p35740l96843o20957p14950k77672
3101.4F11739502j91650o95687o13022k58789j48697j54457o07605p98797l74337l68270
3111.1F07528191m86603k47040k22359j86157m36630q11577n36003j39465o76613j132584
3120.7F02653160n54848o07452o62956k07443k09008n69725o33850j46255l58162n10521
3130.4E98192940o60935r79500o50444l03802k22588j028289q45490K53944k81715
3139E93474121j049576m95910J15776o56472j087570o00204n55916p90100m76685k53334
$$ plain form
3072.5 623807220 623529701 623226700 623342743 623064346 622487373 621757736 621470718 621202927 620624809 620393867
3082.1 620393867 619956970 619551239 619031296 618697548 618836555 618740463 618151703 617091141 616332245 615756798
3091.8 615756798 615568047 615513039 615054054 614949417 614485664 613749924 613353081 612732124 612017174 611739502
3101.4 611739502 611547852 610852165 610239143 609980354 609831657 609677200 609069595 608270798 607896461 607528191
3111.1 607528191 607041588 606794548 606572189 606386032 605949402 605137825 604601822 604462357 603785744 602653160
3120.7 602653160 602098312 601490860 600827904 600620461 600411453 599841728 599207878 599061623 598703461 598192940
3130.4 598192940 597532005 596552505 595902061 595598259 595375671 594347382 593501892 593755836 593474121
3139 593474121 592424545 591928635 592044411 591387939 590300369 589700165 589144249 588354149 587877464 587624130
3148.7E87624130o89316o26258p11975m05198j40991p52945q15353q37517m60167l95737
3158.3E81788673q36334r59701p35779o8779m60243r84955q22106n38749l01285n19409
3168E75561333q67234o63032k97356q30345q21152l99131m02718m11644n44815m97322
3177.6E69826584p06825o27366n57708n55001p70263j180458o32096n37033k27546
3186.3E64032288J19171n88684q92640q14971p80602p07130p07093p90481m19998k98767
3195.9E58151093m68369o73561o73294j46065p61757q92982n62516j026268r43374
3204.6E52002907l32947J47743m98543n57479m00658j158676j218643o75698J57013
3213.3E47465019K3384n13916q49342r00116k66953o57691j147881o20651m44489o76307
$$ plain form
3148.7 587624130 586934814 586308556 585596581 585191383 585050392 584297447 583482094 582644577 582184410 581788673
3158.3 581788673 580952339 579992638 579256859 579188080 578727837 577742882 576920776 576382027 576080742 575561333
3168 575561333 574694099 574031067 573733711 572903366 572082214 571683083 571280365 570868721 570323906 569826584
3177.6 569826584 569119759 568492393 567934685 567379684 566609421 565428963 564796867 564259834 564032288
3186.3 564032288 564151459 563562775 562670135 561855164 561074562 560367432 559660339 558869858 558449860 558151093
3195.9 558151093 557682724 557009163 556335869 556189804 555428047 554535065 553972549 552946281 552002907
3204.6 552002907 551669960 551817703 551319160 550761681 550361023 549202347 547983704 547308006 547465019
3213.3 547465019 547488403 546974487 546125145 545225029 544958076 544300385 543152504 542531853 542087364 541411057
3222.9E41411057l68844k56652k34070q8387n45845p83767q40188l01551m9286o87104
3232.6E37255363r65652q97865o04439m88892k03170o32096j225281o57539k42081
3241.3E31338348k06070r3803M7188o39954p14645n9548k96402o90956p15904j45874
3250.9E27822380o08902p56912j2818n06629n49965l14255p00073o39687k0599k51847
3260.5E23460693m52041j52512p13348n97077j01242J7014j32141l50762l35235q82340
3270.2E19761009j311035n37872M49829m40674q37936j10550m39949o37741q24700
3278.9E15070381n83076k84767k96708l45878p09572n16586o16532m14772m7073l17001
3288.5E10938416m03405k76298J144l38363o32935m47769l30734k15378j036644j488304
$$ plain form
3222.9 541411057 541042213 540785561 540551491 540463104 539917259 539133492 538293304 537991753 537942467 537255363
3232.6 537255363 536289711 535391846 534787407 534298515 534095345 533463249 532237968 531580429 531338348
3241.3 531338348 531132278 531038475 531085663 530445709 529731064 529671516 529375114 528684158 527968254 527822380
3250.9 527822380 527213478 526456566 526443748 525937119 525387154 525072899 524372826 523733139 523712540 523460693
3260.5 523460693 523008652 522856140 522142792 521545715 521444473 521461487 521329346 520978584 520643349 519761009
3270.2 519761009 518449974 517912102 518361931 517921257 517083321 516972771 516532822 515895081 515070381
3278.9 515070381 514487305 514202538 513905830 513559952 512850380 512333794 511717262 511302490 511255417 510938416
3288.5 510938416 510535011 510258713 510259857 509921494 509288559 508840790 508510056 508294678 507258034 505769730
3298.2E05769730m87748l63159k20642J71547o18248n85632l55988j90315k01111q90808
3307.8E02027626m91638m68598q23936q31909l63388L4523r29489j199379m31862k5902
3317.4D96496048o89812o09741k21710o18744j78986m83703j087342j231727q38242
3326.1D90536041l00941o20423l99093n41001r08927o91453k01492l21503n91735q4305
3335.8D85875168q10394j191750k79045l03764r49326n97153j94473r10263j197510
3344.4D79441490j179199q17795k47574j47552o25115q19854l48664r21783r88503
3353.1D73345451m75158l89824m39186r29146n97382p9345m97780j109696r39827q14018
3362.8D67074089n88036n11398q63991l63617n65338k73170j71471j220398q23402
$$ plain form
3298.2 505769730 505281982 504918823 504698181 504869728 504251480 503665848 503309860 503119545 502918434 502027626
3307.8 502027626 501535988 501067390 500243454 499411545 499048157 499082680 498153191 496953812 496521950 496496048
3317.4 496496048 495806236 495196495 494974785 494356041 494177055 493693352 492606010 491374283 490536041
3326.1 490536041 490235100 489614677 489215584 488674583 487765656 487074203 486872711 486551208 485959473 485875168
3335.8 485875168 485064774 483873024 483593979 483290215 482340889 481743736 481549263 480639000 479441490
3344.4 479441490 478262291 477444496 477196922 477049370 476424255 475604401 475255737 474333954 473345451
3353.1 473345451 472870293 472480469 472041283 471112137 470514755 470435410 469937630 468827934 467888107 467074089
3362.8 467074089 466486053 465974655 465110664 464747047 464181709 463908539 463737068 462516670 461693268
3371.4D61693268l41797n84335o53572L509O142o90575r19075r47494l17002j20621
3381.1D57128448o13288j029129n10102l06968q40722n03730k26860M5623m33006o02722
3390.7D52107544o180n36537j445046j007690M70772M13437k06223n28564o78520l73154
3400.4D48209839n07622j4648L6506l51791l91426j70250j43356o38161k69089J29280
3410D45889282K12288j75438m51736j93520q0719n19142j088791l93371p7401L94249
3419.7D43515701M19083o34499n61218l94401M30908K65426k77061K99530k1858N1155
3429.3D43092766K60467n46264m87099K05307J89018N80940L50152l96004n04875k28386
3439D42516022K91252j36376K87323N63164J81008n9166O6185J638374j08261j430931
$$ plain form
3371.4 461693268 461351471 460767136 460113564 460117073 460123215 459432640 458513565 457566071 457249069 457128448
3381.1 457128448 456515160 455486031 454975929 454668961 453828239 453324509 453097649 453143272 452710266 452107544
3390.7 452107544 452101364 451564827 450119781 449112091 449582863 449996300 449790077 449261513 448582993 448209839
3400.4 448209839 447702217 447687569 447724075 447372284 446980858 446810608 446667252 446029091 445760002 445889282
3410 445889282 446101570 445926132 445474396 445280876 445200157 444681015 443592224 443198853 443121452 443515701
3419.7 443515701 443934784 443300285 442739067 442344666 442775574 443041000 442763939 443063469 443041611 443092766
3429.3 443092766 443353233 442806969 442319870 442525177 442714195 443295135 443645287 443249283 442744408 442516022
3439 442516022 442807274 442670898 442958221 443521385 443702393 443643227 443709412 445347786 445239525 443808594
3448.6D43808594J40953M93240M07562L99933N58625k9831N19104O53648M04968R35860
3458.2D48292656P1335M2610K4948L45001N66979j79062J19743P07360O93817j35193
3467.9D50550194K60010M81605K23694L68957O70395R61876J73378L49312M85420K76528
3477.5D54801369J46942N67779J042900J95084L92456j8082L33863P27463P53021J223831
3487.2D60166626k67983p7095Q03986J096306O27975n1994R10912P09343K76336j07803
3496.8D64086609K58827Q82149N92460Q38624R99221R44519J11122j4076N59120M64974
3506.5D69723549M05617J167221R97696n85862M81530J252212P79495K67563l318O60438
3516.1D75146141J380844J130867n4703J57509M21944J028061J356239l37448J27449
$$ plain form
3448.6 443808594 443949547 444442787 444850349 445250282 445808907 445779076 446298180 446951828 447356796 448292656
3458.2 448292656 448363991 448406601 448431549 448776550 449343529 449164467 449284210 449991570 450685387 450550194
3467.9 450550194 450810204 451291809 451515503 451884460 452554855 453516731 453690109 454039421 454524841 454801369
3477.5 454801369 454948311 455516090 456558990 456754074 457146530 457128448 457462311 458189774 458942795 460166626
3487.2 460166626 459898643 459821548 460625534 461721840 462349815 462297821 463208733 463918076 464194412 464086609
3496.8 464086609 464345436 465227585 465820045 466658669 467657890 468602409 468713531 468699455 469258575 469723549
3506.5 469723549 470129166 471296387 472294083 471708221 472189751 473441963 474221458 474489021 474485703 475146141
3516.1 475146141 476526985 477657852 477603149 477760658 478182602 479210663 480566902 480229454 480356903
3524.8D80356903J206513J209526N34935P75909N00069M64592R89151J56440M58451
3533.5D86652489N73005J968995J723175n92118Q23059Q60520M7149r6778J134529
3542.1D93094025J409416R38873Q87566l37677P83500j20925J073684J400681J076126
3550.8E00205269K549286m96140P42035Q93936j5678J252060J05781R92508J209069
3559.5E07438126R01908k52952J425285K373123l68881K874718J753311k89307L02315
3568.2E16157646k285156K274895K239532P74384J038894J457901O24543m0665J334000
3576.9E23575974O72988J728859J429940r003J320534J799354P56226n94216L326302
3585.5E34006958L963852j471596J85204j611176J393852K668992J979026J397591
$$ plain form
3524.8 480356903 481563416 482772942 483307877 484083786 484583855 485048447 486037598 486194038 486652489
3533.5 486652489 487225494 489194489 490917664 490325546 491148605 492009125 492056274 491959496 493094025
3542.1 493094025 494503441 495442314 496329880 495992203 496775703 496654778 497728462 499129143 500205269
3550.8 500205269 502754555 502258415 503000450 503894386 503878708 505130768 505236549 506229057 507438126
3559.5 507438126 508340034 508087082 509512367 511885490 511516609 514391327 516144638 515855331 516157646
3568.2 516157646 513872490 516147385 518386917 519161301 520200195 521658096 522282639 522241974 523575974
3576.9 523575974 524248962 525977821 527407761 527398758 528719292 530518646 531274872 530680656 534006958
3585.5 534006958 537970810 536499214 536684418 535073242 536467094 539136086 541115112 542512703
3593.2E42512703P30591L297539j211586k13547L120422M4861J536751J153335K51351
3601.9E51222420J312752N27610J095581K967224L110848j756287K218323J197052
3609.6E61895523k417068N754585K864990k633743L505935j251487J647758M602356
3617.4E73968849K6627J205978Q04749n74761J401177J943893J347923J484528J699257
3626E83308220R73129N830307P056503r695472l69148J939544M470253K811928k289391
3634.7E94035873J082993K835197K918892M16336M07677K302475K086067P85370l70941
3643.4F06499939J443825L208236P150345L352700n726853M723320J612473l481713
3651.1F18782272k642784L130265L551864K942963O194000o117058j611442M430809
$$ plain form
3593.2 542512703 543243294 546540833 545329247 545115700 548236122 548280983 549817734 550971069 551222420
3601.9 551222420 552535172 553062782 554158363 557125587 560236435 558480148 560698471 561895523
3609.6 561895523 559478455 565233040 568098030 565464287 568970222 567718735 569366493 573968849
3617.4 573968849 573995476 575201454 576006203 575431442 576832619 578776512 580124435 581608963 583308220
3626 583308220 584281349 590111656 597168159 587472687 587103539 589043083 593513336 596325264 594035873
3634.7 594035873 595118866 597954063 600872955 601289291 601696968 603999443 606085510 606870880 606499939
3643.4 606499939 607943764 611152000 618302345 621655045 615928192 620651512 622263985 618782272
3651.1 618782272 616139488 619269753 622821617 625764580 631958580 625841522 624230080 628660889
3658.8F28660889J372223J097908O00319J948089J181030P24221R81598n94902L149337
3667.5F39120712M148789Q51669Q57086o240501p67708O059647R510498O259765j6750793
3676.2F43049164k131729N701217M902802j779480j209641K159424J564255R60617
3683.9F53216629o1951p00378K625198O933670m629440n232849Q282013m152374l404007
3692.6F52876511L933792M98657R93957M49067o54984M64859k8229K489243M029694
3701.3F65052567l644562l542023K901840R72672K44674m3487J251297M679565n027923
3709.9F62844620L247299R069138j3274308m96826M296570J491775K976J758194K382049
3718.6F71321487l452148j254501N846634l31040o320267L579255J702041L54920k185593
$$ plain form
3658.8 628660889 630033112 631131020 631731339 633679428 634860458 635584679 636566277 635971375 639120712
3667.5 639120712 643269501 644121170 644978256 638737755 637970047 644029694 653540192 659799957 643049164
3676.2 643049164 640917435 646618652 651521454 649741974 648532333 650691757 652256012 653216629
3683.9 653216629 653154678 652454300 655079498 662013168 657383728 652150879 660432892 656280518 652876511
3692.6 652876511 656810303 657308960 658302917 658751984 658097000 658561859 658533630 661022873 665052567
3701.3 665052567 661408005 657865982 660767822 661740494 661985168 661941681 663192978 667872543 662844620
3709.9 662844620 666091919 675161057 661886749 661389923 665686493 667178268 667181244 668939438 671321487
3718.6 671321487 667869339 666614838 672461472 672130432 665810165 669389420 671091461 671446381 669260788
3727.3F69260788j968765K911300N02091M779587p33261r245148Q245010O789475p237473
3736F73303604k987289L56140j298142R68705L382415k730407J243591J1010971M65698
3744.7F83715286k0668258N313873M711075N819397N63507j0682678J0292511j41449
3752.4F78923264j0569687K091064L250275L389587m636688J223602P114334n536117
3760.1F75249634n120392K242584J405564P21435M315262j049728n454178J301193
3767.8F73611374M220276K481766p752915n1727K825317L53165N90896n00335r003
3776.5F75768814J30692L028335J401291p899933P02515J901626O03867K492981j883240
3785.2F76246948j014480M89044m76456Q76312j84555o87790o17675O27288M61655
$$ plain form
3727.3 669260788 667292023 670203323 670705414 675485001 674751740 665506592 673751602 680541077 673303604
3736 673303604 670316315 670672455 669374313 670343018 673725433 670995026 672238617 683249588 683715286
3744.7 683715286 663047028 668360901 673071976 678891373 679454880 668772202 679064713 678923264
3752.4 678923264 668353577 670444641 673694916 677084503 672447815 673671417 680785751 675249634
3760.1 675249634 670129242 672371826 673777390 674498825 678814087 677764359 672310181 673611374
3767.8 673611374 677831650 680313416 672560501 672508774 675334091 675687256 676278152 675777817 675768814
3776.5 675768814 675899506 678927841 680329132 672429199 673131714 675033340 675637207 678130188 676246948
3785.2 676246948 675232468 675721512 675245056 676121368 675936813 675249023 674631348 675258636 675720291
3793.8F75720291Q81729M244538k405091o077270M62188M196244Q599090j077957j1742554
3802.5F72801208j31530J255264L860321O983414n489578p877045K856903J477280
3810.2F75736237j97602P21054l01132O64902O200104L800964j4079056J134033L530350
3818.9F77209854K808609M876938j4433441q51746M253845J281434K370071O25534
3826.6F78141098l849945R3613K040863L337097K727279q741607j1673P031326l805542
3835.3F76962509k948685P639695l244782o710205P368012l940659k405472P171173
3843F79891586l04641m868470L97263K72140J26038J885376q36258L85819O109848
3851.7F83058701k313538L851852j0174102n859452Q400956J22146m092026M19846
$$ plain form
3793.8 675720291 676602020 680846558 678441467 672364197 672826385 677022629 685621719 684543762 672801208
3802.5 672801208 672669678 673924942 677785263 684768677 679279099 671402054 674258957 675736237
3810.2 675736237 675538635 676259689 675958557 676623459 682823563 686624527 672545471 673679504 677209854
3818.9 677209854 680018463 684895401 670461960 669610214 673864059 675145493 677515564 678141098
3826.6 678141098 674291153 674384766 676425629 679762726 682490005 673748398 673736725 680768051 676962509
3835.3 676962509 674013824 681653519 678408737 671698532 679066544 675125885 672720413 679891586
3843 679891586 679586945 674718475 675115738 675387878 675513916 677399292 676563034 676948853 683058701
3851.7 683058701 680745163 684597015 674422913 668563461 676964417 677086563 672994537 673414383
3859.4F73414383J669846L770217l099594j967544P722625j451797q805389J184539
3867.1F72437286M666214Q876725k811280j3299789Q40073N401916N567169q880462
3874.8F72797852j201325L380203j061630R87396N492630j981048r069062M403000
3882.6F73748016J888962Q29163P606354r815293l098831K504044k08741L960266K840119
3891.2F80254059p020111p38449K141800k018967P42798J226806J698304K815399r365082
3899.9F69736557K878952M696350n256576L145599j141968k175979J74179J39923J977463
3908.6F74174500J76086j91193r8190J15891k69623j126480R75113K722702k023011
3917.3F74455795l908996M466018J675263n266800J071014J425858J186981R5673l279953
$$ plain form
3859.4 673414383 675084229 678854446 675754852 673787308 681509933 680058136 671252747 672437286
3867.1 672437286 677103500 685980225 683168945 669869156 670709229 676111145 681678314 672797852
3874.8 672797852 671596527 674976730 673915100 674902496 680395126 678414078 669345016 673748016
3882.6 673748016 675636978 676466141 684072495 674257202 671158371 673662415 673453674 677413940 680254059
3891.2 680254059 673233948 672495499 674637299 672618332 673361130 674587936 676286240 679101639 669736557
3899.9 669736557 672615509 677311859 672055283 675200882 674058914 671882935 672057114 672197037 674174500
3908.6 674174500 674350586 674159393 674061203 674177094 673907471 672780991 673756104 676478806 674455795
3917.3 674455795 670546799 675012817 676688080 671421280 672492294 673918152 675105133 675200806 671920853
3926F71920853L433O87485J914291K07825j175385K066422k007065k078476Q42819
3934.6F72382202m38385P32117J113205l34320m75159j020203J252747L232956l507614
3943.3F72937546k488785P54013O25000K615128j464768p53174P21970k455826J510544
3952F72001648J042786o39725L88489m04053m78516l60336O31256k09656K19498J507263
3961.6F73698654j445236j513824J29852N3863K44751L52555Q38165q5983j560212
3970.3F70712585J00022J089401J98059j12228L12423N73655q04596o57273O34690
3979F72046738R9792n05371k56805J89819N5008l74451j07803K93274j91651L04108
3988.6F71552658P11289q42972p42111N3176J89591O40564J13144p79114J2588R03550
$$ plain form
3926 671920853 671924286 672611771 674526062 674733887 673558502 675624924 673617859 671539383 672382202
3934.6 672382202 671943817 672675934 673789139 673454819 672979660 671959457 673212204 676445160 672937546
3943.3 672937546 670448761 671202774 671827774 674442902 672978134 672224960 672946930 670491104 672001648
3952 672001648 673044434 672404709 672793198 672389145 671910629 671550293 672181549 671971893 672191391 673698654
3961.6 673698654 672253418 670739594 670869446 670923309 671168060 671520615 672358780 672272797 670712585
3970.3 670712585 670812607 671902008 672100067 671987839 672300262 672873917 672069321 671412048 672046738
3979 672046738 672146530 671641159 671384354 671574173 671629181 671254730 671146927 671440201 671248550 671552658
3988.6 671552658 672263947 671420975 670678864 670732040 670921631 671562195 671675339 670896225 670908813 671812363
3998.3F71812363m42658o15158
4000.2F70754547
$$ plain form
3998.3 671812363 671369705 670754547
4000.2 670754547
##END=$$ End of the data block
