##TITLE=$$ Begin of the data block
##JCAMP-DX=5.00 $$ ACD/SpecManager v 10.08
##SPECTROMETER/DATA SYSTEM=Varian
##DATE=18 Dec 2012 10:29:40
##DATA TYPE=INFRARED SPECTRUM
##DATA CLASS=XYDATA
##ORIGIN=
##OWNER=
##NPOINTS=3735
##FIRSTX=399.26403809
##LASTX=4000.35498047
##MAXX=4000.35498047
##MINX=399.26403809
##MAXY=76.52040100
##MINY=43.05131912
##XFACTOR=1.0000000000
##YFACTOR=0.000000100000000
##FIRSTY=67.66230011
##DELTAX=0.96440572
##XUNITS=1/CM
##YUNITS=TRANSMITTANCE
##XYDATA=(X++(Y..Y))
$$ plain form
399.3 676623001 689131241 686645966 682747879 684789047 685474548 680950165 674093552 678161316
407 678161316 686987534 697131729 699966049 698182068 689342041 678822250 678719635 680476532 678595810
415.7 678595810 673338089 675778122 674070663 659380493 675438766 683780594 683739166 680772629
423.4 680772629 689704361 689033813 681752701 682515793 680874252 682635498 682890320 680557709 679455338
432.1 679455338 685548782 690982208 690206833 688237152 680380859 680193863 678172073 678929443 683916397
440.7 683916397 679814224 679100647 679059753 681798401 683580780 681655579 680349731 678623352 677494583
449.4 677494583 677261276 680021896 678944702 679936981 678065186 674997864 678087845 671925812 668967514
458.1 668967514 671119080 671882553 677992249 679717560 677877731 673561020 676634903 682377548 676688461
$$ packed form
399.3F76623001J2508240k485275l898087K041168O85501m524383o856613M067764
407F78161316Q826218J0144195K834320j783981q840027j0519791j02615J756897j880722
415.7F78595810n257721K440033j707459j4690170J6058273Q341828m1428k966537
423.4F80772629Q931732o70548p281112P63092j641541J761246K54822k332611j102371
432.1F79455338O093444N433426p75375j969681p856293j86996k021790P57370M986954
440.7F83916397m102173p13577m0894K738648J782379j925201j305848j726379j128769
449.4F77494583k33307K760620j077194R92279j871795l067322L089981o162033k958298
458.1F68967514K151566P63473O109696J725311j839829m316711L073883N742645n689087
$$ plain form
466.8 676688461 670898972 667845078 662814636 669272842 674435349 663648605 666992264 670793304
474.5 670793304 672132187 672444153 670191345 674023743 675652237 677617569 678799438 678519058 678094635
483.2 678094635 673130798 669659042 671299667 677765045 678578339 676882629 676886520 677317352 679081497
491.8 679081497 676799927 674508057 673205719 674084015 674270554 673812714 674080963 671800308 673598251
500.5 673598251 675031967 675734940 679553909 678374710 673144684 669973831 670544281 670915070 670982056
509.2 670982056 669645920 668601685 671535492 673730316 672770996 670986328 671052475 670148468 667508087
517.9 667508087 666512985 667459488 667969589 665528870 664857101 666556396 667394562 666923447 664461288
526.6 664461288 663754730 665204773 667085419 667456818 665963974 663992386 661665344 660439758 661379776
$$ packed form
466.8F76688461n789489l053894n030442O458206N162507j0786744L343659L801040
474.5F70793304J338883L11966k252808L832398J628494J965332J181869k80380m24423
483.2F78094635m963837l471756J640625O465378Q13294j695710L891M30832J764145
491.8F79081497k281570k291870j302338Q78296J86539m57840K68249k280655J797943
500.5F73598251J433716P02973L818969j179199n230026l170853N70450L70789O6986
509.2F70982056j336136j044235K933807K194824r59320j784668O6147r04007k640381
517.9F67508087r95102R46503N10101k440719o71769J699295Q38166m71115k462159
526.6F64461288p06558J450043J880646L71399j492844j971588k327042j225586R40018
$$ plain form
535.2 661379776 663347321 665143509 664034424 661463470 661372986 662384720 663343277 664294434 665177383
543.9 665177383 664613266 663675461 664081497 662201385 661973724 663316040 663816910 665896683 665453644
552.6 665453644 664893112 665485382 664821243 665174408 663970337 661908798 663159637 664858322 663471527
561.3 663471527 662135620 662978439 663823090 664607697 665472260 665156784 664589691 665047607 665159302 665972672
570.9 665972672 666776505 664755402 662498932 662520065 662503738 661882782 662568512 662308655 661923676 663404617
580.6 663404617 663751602 664131851 665296707 663753815 660942688 661684494 663723068 663265152 661738663
589.3 661738663 661934052 664062881 665215302 664929962 664736710 665037918 665141144 663912964 662145004
597.9 662145004 660666580 660800705 660350113 659068909 658069992 655929871 655653687 656292038 654929886
$$ packed form
535.2F61379776J967545J796188j109085k570954r0484J011734R58557R51157Q82949
543.9F65177383n64117r37805M06036j880112k27661J342316N00870K079773m43039
552.6F65453644n60532N92270o64139L53165j204071k061539J250839J698685j386795
561.3F63471527j335907Q42819Q44651P84607Q64563l15476n67093M57916J11695Q13370
570.9F65972672Q03833k021103k256470K1133j6327o20956O85730k59857l84979J480941
580.6F63404617L46985L80249J164856j542892k811127P41806K038574m57916j526489
589.3F61738663J95389K128829J152421k85340j93252L01208J03226j228180j767960
597.9F62145004j478424J34125m50592j281204r98917k140121k76184O38351j362152
$$ plain form
606.6 654929886 653276825 651084061 647258530 643411713 639025879 632808647 627207794 621986885
614.3 621986885 614927483 607003860 601013069 598767281 597561378 594831886 595017662 596355057 596893730
623 596893730 599025040 602417984 608151855 615224762 622434807 629839745 636789551 642429123 646792145
631.7 646792145 649758606 651873016 651688843 649920120 649269638 647428284 644498215 643824234 645547028
640.4 645547028 648615799 652220459 655459824 659578018 664956589 668701401 671511917 673913574
648.1 673913574 676322098 677691040 677523499 676736984 675373154 675133133 675568161 676651382 678581161
656.8 678581161 680080261 680564804 681165543 682802277 683535233 683041611 682558823 683286667 683437424
665.4 683437424 683237839 681815186 673109360 678918839 683542480 685451431 687714539 688626709 687871475
$$ packed form
606.6F54929886j653061k192764l825531l846817m385834o217232n600853n220909
614.3F21986885p059402p923623n990791k245788j205903k729492J85776J337395N38673
623E96893730K131310L392944N733871P072907P210045P404938O949806N639572M363022
631.7F46792145K966461K114410j84173j768723o50482j841354k930069o73981J722794
640.4F45547028L068771L604660L239365M118194N378571L744812K810516K401657
648.1F73913574K408524J368942j67541p86515j363830k40021M35028J083221J929779
656.8F78581161J499100M84543O00739J636734P32956m93622m82788P27844J50757
665.4F83437424j99585j422653q705826N809479M623641J908951K263108R12170p55234
$$ plain form
674.1 687871475 687450333 687493591 688395004 689040222 687119522 685905991 686410141 687166367 689208145
682.8 689208145 690322647 689982605 689975815 690503540 689747391 688296356 687350388 685230331 683042679
691.5 683042679 681681213 680695343 679359207 678106842 677791519 677731705 677840958 677687759 678145752
700.2 678145752 678594284 677982635 677142944 676632996 677326126 677271423 676816711 677815170 678844376 679718170
709.8 679718170 680768051 682383118 684879761 687281265 688090515 687668991 687307434 687778397 689101105
718.5 689101105 689966202 689702301 689510422 691078720 692915573 693736343 694662704 694947281 694206848
727.2 694206848 693675232 693349686 692387619 691181335 690224838 689929352 690301971 690938797 691452255 691593933
736.8 691593933 692304535 693603363 693909149 693281555 694266815 695402222 694626846 693960648 694050064 695586548
$$ packed form
674.1F87871475m21142M3258R01413O45218j920700j213531N04150P56226K041778
682.8F89208145J114502l40042o790N27725p56149j451035r45968k120057k187652
691.5F83042679j361466r85870j336136j252365l15323n9814J09253j53199M57993
700.2F78145752M48532o11649q39691n09948O93130n4703m54712R98459J029206Q73794
709.8F79718170J049881J615067K496643K401504Q09250m21524l61557M70963J322708
718.5F89101105Q65097k63901j91879J568298J836853Q20770R26361K84577p40433
727.2F94206848n31616l25546r62067j206284r56497k95486L72619O36826N13458J41678
736.8F91593933P10602J298828L05786o27594R85260J135407p75376o66198Q9416J536484
$$ plain form
746.5 695586548 696986618 698364792 701378555 704400330 707025375 708258667 709308167 710219193 711277313
755.1 711277313 713613281 715181808 716013489 715616837 716415634 718342819 719748077 720880737 720714264
763.8 720714264 721037903 720163422 719409561 719860535 718999023 717748032 716611023 716183014 715316925
772.5 715316925 715163422 716590042 718361588 720794983 722450333 724298782 726729813 727651749 727203217
781.2 727203217 727149124 727794266 729226227 730756073 731337433 732004242 733159332 734741821 735241089
789.9 735241089 736297684 738038330 737578583 736539307 735971222 736088486 735449219 735117722 735556183
798.5 735556183 735861282 736420212 735956345 737100754 738070526 737724380 738220901 737826538 737608948 737729034
808.2 737729034 737891312 738802490 738940353 737789917 737946472 738540115 739494019 741663437 741399460
$$ packed form
746.5F95586548J400070J378174L013763L021775K625045J233292J049500R11026J058120
755.1G11277313K335968J568527Q31681l96652P98797J927185J405258J132660j66473
763.8G20714264L23639q74481p53861M50974q61512j250991j137009m28009q66089
772.5G15316925j53503J426620J771546K433395J655350J848449K431031R21936m48532
781.2G27203217n4093O45142J431961J529846N81360O66809J155090J582489M99268
789.9G35241089J056595J740646m59747j039276n68085J17264o39267l31497M38461
798.5G35556183L05099N58930m63867J144409R69772l46146M96521l94363k17590J20086
808.2G37729034J62278R11178J37863j150436J56555N93643R53904K169418k63977
$$ plain form
816.9 741399460 740680847 740732956 740952759 741224060 740544739 740439301 740548706 740629654 740021591 739141693
826.5 739141693 737531204 735706482 734840393 733627090 732957382 730984192 728098373 725128479 722243042
835.2 722243042 720370789 717544098 715229263 713285828 710535202 708112259 705999069 704178848
842.9 704178848 703107529 701989822 700132523 699356308 699204178 698783112 699229507 700606079 701760330
851.6 701760330 702575684 704393158 706566849 709181900 711445007 712853165 714450150 716082764 718532791
860.3 718532791 720356140 722594452 725296249 726141586 726189270 726391449 727191620 727925186 729266815
868.9 729266815 729793167 729698257 731126022 732317810 732903671 733048859 733927383 735370102 735673141
877.6 735673141 734949188 734203720 732912292 730957336 729774094 728297043 726571655 724755020 723751831
$$ packed form
816.9G41399460p18613N2109K19803K71301o79321j05438J09405Q0948o08063q79898
826.5G39141693j610489j824722q66089j213303o69708j973190k885819k969894k885437
835.2G22243042j872253k826691k314835j943435k750626k422943k113190j820221
842.9G04178848j071319j117707j857299p76215j52130m21066M46395J376572J154251
851.6G01760330Q15354J817474K173691K615051K263107J408158J596985J632614K450027
860.3G18532791J823349K238312K701797Q45337M7684K02179Q00171P33566J341629
868.9G29266815N26352r4910J427765J191788N85861J45188Q78524J442719L03039
877.6G35673141p23953p45468j291428j954956j183242j477051j725388j816635j003189
$$ plain form
886.3 723751831 722680817 720543518 719960327 719575424 718492355 717764511 718208466 718873749 718852768
895 718852768 719615707 720952988 722119827 721351089 720955658 722327347 722582092 721903381 721090317 720738297
904.6 720738297 719727402 718847046 718160553 716243820 714255524 711911087 709485016 707729416 706968536
913.3 706968536 706155548 704265671 701853104 699486847 697379227 694632416 691854935 689903107 688433151
922 688433151 686600342 684564743 683149567 681601105 680204926 679461212 679280548 679088211 678051147
930.7 678051147 677378235 677349243 677869949 678901062 679661560 681208801 683524170 686017761 689066315
939.3 689066315 692072144 694237137 695796356 698212433 701418304 703417587 704971161 706892395
947.1 706892395 708525391 710464249 712080460 713650665 714724960 714894333 715092850 715069733 715521240
$$ packed form
886.3G23751831j071014k137299n83191l84903j083069p27844M43955O65283k0981
895G18852768P62939J337281J166839p68738l95431J371689K54745o78711q13064l52020
904.6G20738297j010895q80356o86493j916733j988296k344437k426071j755600p60880
913.3G06968536q12988j889877k412567k366257k107620k746811k777481j951828j469956
922F88433151j832809k035599j415176j548462j396179p43714j80664j92337j037064
930.7F78051147o72912k8992N20706J031113P60498J547241K315369K493591L048554
939.3F89066315L005829K164993J559219K416077L205871J999283J553574J921234
947.1G06892395J632996J938858J616211J570205J074295J69373J98517k3117M51507
$$ plain form
955.7 715521240 715763245 714867249 712531967 710302505 709178696 707770233 705834579 703307114 701557465
964.4 701557465 700376968 698807220 697559280 696722107 695978088 695268860 694591522 693455734 693115158
973.1 693115158 692719269 691148224 690161133 689645233 689321594 688790512 688445892 687998581 687131195 686488953
982.7 686488953 684780350 683563766 683001556 681325836 679536209 677568054 675049438 672107162 669594040
991.4 669594040 668418808 667186203 664378738 660561142 658072510 658380356 660423050 662052765 662540131
1000.1 662540131 662828979 662385559 661417542 660651779 659235458 658047333 658394852 658314133 656739273
1008.8 656739273 656040573 655893860 654863663 653572540 652325363 651404724 650067444 647918091 645312576
1017.5 645312576 643642731 643077774 641613998 640535126 639152832 636273613 634033203 633060532 632589264
$$ packed form
955.7G15521240K42005q95996k335282k229462j123809j408463j935654k527465j749649
964.4G01557465j180497j569748j247940q37173p44019p09228o77338j135788l40576
973.1F93115158l95889j571045r87091n15900l23639n31082l44620m47311q67386o42242
982.7F86488953j708603j216584n62210j675720j789627j968155k518616k942276k513122
991.4F69594040j175232j232605k807465l817596k488632L07846K042694J629715M87366
1000.1F62540131K88848m43420r68017p65763j416321j188125L47519q0719j574860
1008.8F56739273o98700j46713j030197j291123j247177r20639j337280k149353k605515
1017.5F45312576j669845n64957j463776j078872j382294k879219k240410r72671m71268
$$ plain form
1026.1 632589264 631135025 628632812 626709976 625702324 623824615 622238617 621862411 620789757
1033.8 620789757 619347076 618168182 617688179 616680870 615800362 615625229 614577675 613865166 613549995
1042.5 613549995 613223114 613196564 613225441 612508812 612371788 612700310 612415504 612944221 613123436 613126678
1052.2 613126678 612840652 612768745 612954712 612642250 613554192 613741264 613270378 613034935 612939758 612446938
1061.8 612446938 611444817 611074295 609657288 608886147 608557968 607607193 607140579 606597137 605662422
1070.5 605662422 604297562 603990974 603551025 603617744 604376602 603787270 602756958 602381401 602493477
1079.2 602493477 601115417 600105247 599904137 599264297 598720284 598183289 597810326 596699448 596307068
1087.9 596307068 596017914 594181252 591095848 588269768 585171852 581210899 578495369 573525009
$$ packed form
1026.1F32589264j454239k502213j922836j007652j877709j585998l76206j072654
1033.8F20789757j442681j178894m80003j007309q80508j75133j047554p12509l15171
1042.5F13549995l26881k6550K8877p16629j37024L28522k84806N28717J79215L242
1052.2F13126678k86026p1907J85967l12462R11942J87072m70886k35443r5177m92820
1061.8F12446938j002121l70522j417007p71141l28179r50775m66614n43442r34715
1070.5F05662422j364860l06588m39949O6719P58858n89332j030312l75557J12076
1079.2F02493477j378060j010170k01110o39840n44013n36995l72963j110878l92380
1087.9E96307068k89154j836662l085404k826080l097916l960953k715530m970360
$$ plain form
1095.6 573525009 568603287 565218849 560433006 555306435 550333405 546786613 541551628 537221222
1103.3 537221222 533389015 528159218 523927040 518912811 514597244 509505043 505425911 501597023
1111 501597023 498071785 495409355 491615028 489708862 487789421 487743111 487832565 487767563 488309364 488541985
1120.6 488541985 490067024 490755348 492440987 493230705 494377632 495859566 496780586 498250389 499156876
1129.3 499156876 502194176 504339561 505863457 506807442 507375832 508109436 508343925 509840851 509865265
1138 509865265 510861320 511933899 512635956 513415222 513147736 513203850 511817284 511492386 511167717 510780144
1147.6 510780144 510232086 509208908 509134483 508284912 507902679 506927834 507493820 508168488 508735657 510426331
1157.3 510426331 511213951 512934990 513825531 515472412 516874809 518126869 519732704 521850548 526009064
$$ packed form
1095.6E73525009m921722l384438m785843n126571m973030l546792n234985m330406
1103.3E37221222l832207n229797m232178n014229m315567n092201m079132l828888
1111E01597023l525238k662430l794327j906166j919441m6310Q9454o5002N41801K32621
1120.6D88541985J525039O88324J685639P89718J146927J481934R21020J469803R06487
1129.3D99156876L037300K145385J523896R43985N68390P33604K34489J496926K4414
1138E09865265R96055J072579P02057P79266k67486N6114j386566l24898l24669l87573
1147.6E10780144n48058j023178p4425q49571l82233r74845N65986O74668N67169J690674
1157.3E10426331P87620J721039Q90541J646881J402397J252060J605835K117844M158516
$$ plain form
1166 526009064 528514061 531628838 534632988 538045578 541697578 544264259 547926445 551164703 554752083
1174.6 554752083 557344704 560184402 563099442 565658226 568795662 570287628 572037926 573884850
1182.4 573884850 576290321 578394508 579808006 581421776 581855125 582451210 582994766 583907700 584840050
1191 584840050 586189461 588150063 590000839 591893158 593308601 595520592 597449112 600017014 602389145
1199.7 602389145 603918228 606257858 607779350 609384918 611097107 613187447 615172920 616616096
1207.4 616616096 618439865 620139046 622224693 623671188 624899178 626205482 627290230 628214035
1215.1 628214035 628516731 628838272 628916969 629567375 630326614 630978813 631824608 632325745 632982254 633172722
1224.8 633172722 633778343 634586983 634215126 633340874 633475723 634319344 634450264 634696426 634785957 635007591
$$ packed form
1166E26009064K504997L114777L004150L412590L652000K566681L662186L238258L587380
1174.6E54752083K592621K839698K915040K558784L137436J491966J750298J846924
1182.4E73884850K405471K104187J413498J613770M33349N96085N43556R12934R32350
1191E84840050J349411J960602J850776J892319J415443K211991J928520K567902K372131
1199.7F02389145J529083K339630J521492J605568J712189K090340J985473J443176
1207.4F16616096J823769J699181K085647J446495J227990J306304J084748R23805
1215.1F28214035L02696L21541P8697O50406P59239O52199Q45795N01137O56509J90468
1224.8F33172722O05621Q08640l71857q74252J34849Q43621J30920K46162Q9531K21634
$$ plain form
1234.4 635007591 635957794 636695099 637003021 637453079 637743721 637238007 637343025 637678680 637840652 637962952
1244.1 637962952 637557411 637458878 637799072 638511620 638908768 639339523 639904251 640350723 640536041 640331345
1253.7 640331345 640600204 640151520 639605598 639746361 639900970 639831505 639767952 640478897 640827255 641555023
1263.4 641555023 642357712 642801590 643337402 643632889 644159698 644207611 644541168 645152893 645865860 646512680
1273 646512680 646755905 647638245 649040070 650898666 651987610 652801361 653730545 654372940 655328674
1281.7 655328674 656150513 657233124 658030319 659147797 660335693 660842361 662254410 664227905 665933380
1290.4 665933380 666900940 668033829 669496841 670429840 671162643 671849213 672900162 673746719 674221497
1299 674221497 674889297 675834045 677067032 678005600 678842850 679997101 681010666 681448441 681810760
$$ packed form
1234.4F35007591R50203P37305L07922M50058K90642n05714J05018L35655J61972J22300
1244.1F37962952m05541r8533L40194P12548L97148M30755N64728M46472J85318k04696
1253.7F40331345K68859m48684n45922J40763J54609o9465o3553P10945L48358P27768
1263.4F41555023Q02689M43878N35812K95487N26809M7913L33557O11725P12967O46820
1273F46512680K43225Q82340J401825J858596J088944Q13751R29184O42395R55734
1281.7F55328674Q21839J082611P97195J117478J187896N06668J412049J973495J705475
1290.4F65933380R67560J132889J463012R32999P32803O86570J050949Q46557M74778
1299F74221497O67800R44748J232987R38568Q37250J154251J013565M37775L62319
$$ plain form
1307.7 681810760 682261505 682341766 682629700 683049088 683128281 683329086 684183807 685051041 685356750 686254425
1317.4 686254425 687199783 687047501 687181625 688032532 688535538 688395309 688456955 688985291 689528580 689743805
1327 689743805 689982224 690769424 691635513 692064896 691955032 692238464 692808380 692803726 692748489 692263489
1336.7 692263489 691711426 691484070 690596695 689808578 690785446 692150955 692698517 692663345 692641678 693019028
1346.3 693019028 693160400 692801971 692207260 691500549 690914688 690224152 690224228 690317230 689716034 688985519
1355.9 688985519 689185791 689980545 690072937 690060806 689187927 688551559 688216095 686024246 686150742 686368637
1365.6 686368637 685684280 685689468 685025864 683976440 684104843 684165955 684437943 684452286 681975098 680478210
1375.2 680478210 680938034 681197052 680165176 678972244 678857498 678890991 678963013 678214798 677949371 678770142
$$ packed form
1307.7F81810760M50745Q0261K87934M19388P9193K00805Q54721Q67234L05709Q97675
1317.4F86254425R45358j52282J34124Q50907N03006j40229O1646N28336N43289K15225
1327F89743805K38419P87200Q66089M29383j09864K83432N69916m654n5237m85000
1336.7F92263489n52063k27356q87375p88117R76868J365509N47562l5172k1667L77350
1346.3F93019028J41372l58429n94711p06711n85861o90536P6R3002o01196p30515
1355.9F88985519K00272P94754R2392j2131q72879o36368l35464k191849J26496K17895
1365.6F86368637o84357N188o63604j049424J28403O1112K71988J4343k477188j496888
1375.2F80478210M59824K59018j031876j192932j14746L3493P2022p48215k65427Q20771
$$ plain form
1384.9 678770142 680516052 681618195 679649048 680788803 682623367 683367004 683803940 683915710 684532623
1393.6 684532623 683043747 681564560 682826614 683845062 683985214 681456223 681163483 682134628 681815338
1402.2 681815338 681404648 680989227 678601913 677890778 679050369 679120407 679335251 679352722 678870850 678882370
1411.9 678882370 679036255 679322128 678907394 678606949 677825165 677143860 676697235 670655823 672243271
1420.6 672243271 675795212 677472382 677558975 675914383 676995773 678441544 678014526 678231277 678299866
1429.2 678299866 676018219 675693817 677611771 678746185 679071732 680955429 682075653 676334534 677886887
1437.9 677886887 681604767 682684097 682604599 682359924 682275925 682871323 683017273 683388367 684312668 684135437
1447.6 684135437 682652435 684131470 686582260 687336273 686839981 686832352 687969818 688882141 687777786
$$ packed form
1384.9F78770142J745910J102143j969147J139755J834564P43637M36936J11770O16913
1393.6F84532623j488876j479187J262054J018448J40152k528991k92740R71145l19290
1402.2F81815338m10690m15421k387314p11135J159591P0038K14844J7471m81872J1520
1411.9F78882370J53885K85873m14734l00445p81784o81305m46625o041412J587448
1420.6F72243271L551941J677170Q6593j644592J081390J445771m27018K16751O8589
1429.2F78299866k281647l24402J917954J134414L25547J883697J120224n741119J552353
1437.9F77886887L717880J079330p9498k44675q3999N95398J45950L71094R24301j77231
1447.6F84135437j483002J479035K450790P54013m96292p629J137466R12323j104355
$$ plain form
1456.2 687777786 682183456 681136856 684545746 686645660 689900436 691772079 693017349 695071564
1464 695071564 691774063 691316681 693772049 694894943 695368347 696045990 698469620 699080582 695588379
1472.6 695588379 694973068 700115662 704948959 703757019 704162903 707086945 708579712 709368439 708714142
1481.3 708714142 708866501 710385284 711489258 712328262 713422623 712686768 712050705 714658203 712818298
1490 712818298 709826813 712279892 714111023 714350128 714828568 714627991 707844391 710096054 710368958
1498.7 710368958 707181473 709217453 709754257 709355850 709262466 710617599 712124710 702277756 691710281
1507.3 691710281 694646149 697994614 698584061 700872803 699809113 697198257 699039154 699082489 698570099
1516 698570099 695030823 689993057 694117889 698031845 694454651 686256104 686286240 689603653 692323532
$$ packed form
1456.2F87777786n594330j046600L408890K099914L254776J871643J245270K054215
1464F95071564l297501m57382K455368J122894M73404O77643K423630O10962l492203
1472.6F95588379o15311N142594M833297j191940M05884K924042J492767P88727o54297
1481.3G08714142J52359J518783J103974Q39004J094361p35855o36063K607498j839905
1490G12818298k991485K453079J831131K39105M78440k00577o783600K251663K72904
1498.7G10368958l187485K035980N36804l98407r3384J355133J507111r846954j0567475
1507.3F91710281K935868L348465N89447K288742j063690k610856J840897M3335n12390
1516F98570099l539276n037766M124832L913956l577194q198547L0136L317413K719879
$$ plain form
1524.7 692323532 688986435 688368378 689048538 687287064 687962723 689158936 688996964 688301010 685860138
1533.4 685860138 679768906 681611862 683326950 685008392 688523560 684237518 673999023 677575073
1541.1 677575073 678921204 678303604 680967865 680508194 676717224 679473343 681039047 682357635 681169586
1549.8 681169586 677793579 680186081 682661972 684954147 681205826 681483536 686684799 690570297
1557.5 690570297 689431381 674510422 674032593 681302643 685597153 687606735 688639374 687158585
1565.2 687158585 687025070 689422150 691644363 692756195 685164337 686237030 688624420 688570251 689158630
1573.9 689158630 690487518 691010895 682058258 684085236 686096802 685989914 686007690 685021820 684818802
1582.6 684818802 683363419 681827927 680672150 680009995 679196930 677358627 676699524 675091095 674257736
$$ packed form
1524.7F92323532l337097o18057O80160j761474O75659J196213j61972o95954k440872
1533.4F85860138o091232J842956J715088J681442L515168m286042j0238495L576050
1541.1F77575073J346131o17600K664261m59671l790970K756119J565704J318588j188049
1549.8F81169586l376007K392502K475891K292175l748321K77710N201263L885498
1557.5F90570297j138916j4920959m77829P270050M294510K009582J032639j480789
1565.2F87158585j33515K397080K222213J111832p591858J072693K387390n4169N88379
1573.9F89158630J328888N23377q952637K026978K011566j06888J7776r85870k03018
1582.6F84818802j455383j535492j155777o62155q13065j838303o59103j608429q33359
$$ plain form
1591.2 674257736 672890091 671771164 670602036 668347702 667515030 665517731 664241333 662634201
1599 662634201 661432419 659678955 657595978 656408081 654224167 653560257 652122269 650829315 648386230
1607.6 648386230 646955795 645417709 642487869 642367249 640567093 639227219 637301483 637697754 637498207
1616.3 637498207 626372185 628836975 629066544 628734093 627372971 627508774 625842285 618678169 619919357
1625 619919357 619916115 620558777 617412491 614958992 615383453 614213066 613790321 613066559 614562759 615683441
1634.6 615683441 607755394 604594955 605904465 606164818 606948776 607965546 607137032 607780991 606818390
1643.3 606818390 608184700 610712395 607653809 605552177 602741699 606280632 608840904 612019691
1651 612019691 616864586 616793900 599992599 603606033 609675980 612052650 613463211 614563255 615705338
$$ packed form
1591.2F74257736j367645j118927j169128k254334q32672j997299j276398j607132
1599F62634201j201782j753464k082977j187897k183914o63910j437988j292954k443085
1607.6F48386230j430435j538086k929840j20620j800156j339874j925736L96271j99547
1616.3F37498207j1126022K464790K29569l32451j361122J35803j666489p164116J241188
1625F19919357l242O42662l146286k453499M24461j170387m22745p23762J496200J120682
1634.6F15683441p928047l160439J309510K60353P83958J016770q28514O43959r62601
1643.3F06818390J366310K527695l058586k101632k810478L538933K560272L178787
1651F12019691M844895p0686j6801301L613434O069947K376670J410561J100044J142083
$$ plain form
1659.7 615705338 617078018 618773003 619104156 616735840 619919167 621791344 622955856 625389099
1667.4 625389099 626956177 624982109 625555305 629264793 629459343 632776184 636989975 635757027 633529129
1676.1 633529129 636761780 639803429 641157532 642253494 642078781 645928345 650988846 647768631
1683.8 647768631 639646187 645000458 652396240 656362762 657564774 659668732 660040741 662145462
1691.5 662145462 664687042 667142181 670641861 672685699 667141113 671554947 678341751 684644470
1699.3 684644470 683055573 674025421 682871475 688703613 691015778 691113434 692805328 693723984 695900116
1707.9 695900116 699688416 700842667 701782761 704280319 706710587 709509430 708072662 707407303 712134094
1716.6 712134094 712183838 702315292 707734528 713055573 715191574 716504745 716919174 717218246 718616028
$$ packed form
1659.7F15705338J372680J694985L31153k368316L183327J872177J164512K433243
1667.4F25389099J567078j974068N73196L709488J94550L316841M213791j232948k227898
1676.1F33529129L232651L041649J354103J095962j74713L849564N060501l220215
1683.8F47768631q122444N354271P395782L966522J202012K103958L72009K104721
1691.5F62145462K541580K455139L499680K043838n544586M413834O786804O302719
1699.3F84644470j588897r030152Q846054N832138K312165R7656J691894R18656K176132
1707.9F95900116L788300J154251R40094K497558K430268K798843j436768o65359M726791
1716.6G12134094M9744r868546N419236N321045K136001J313171M14429K99072J397782
$$ plain form
1725.3 718616028 719547424 720478821 721972275 724245911 722667770 720714111 724363327 727356033 720346680
1734 720346680 711938858 719609528 724416656 725944061 728618622 726222916 723041840 728074493 730688095
1742.7 730688095 728367920 728174362 730778580 732092896 732709656 733119583 733067245 736602478 735619583
1751.3 735619583 734010468 738714066 740915756 742685013 744748459 741848373 742449722 744427032
1759 744427032 746022186 748384476 744397202 743661423 747281189 749134598 750270157 751995163 752500839
1767.7 752500839 747837067 750056763 754458618 753050003 746795197 744995880 750363693 752753983
1775.4 752753983 751821289 753936920 754607620 755581207 755579529 752998657 753732452 755478821 756295013
1784.1 756295013 754392776 753655853 755668488 756454926 756948242 758244247 757818298 757328796 754411621
$$ packed form
1725.3G18616028R31396R31397J493454K273636j578141j953659L649216K992706p009353
1734G20346680q407822P670670M807128J527405K674561k395706l181076N032653K613602
1742.7G30688095k320175j93558K604218J314316O16760M09927n2338L535233r82895
1751.3G35619583j609115M703598K201690J769257K063446k900086O01349J977310
1759G44427032J595154K362290l987274p35779L619766J853409J135559J725006N05676
1767.7G52500839m663772K219696M401855j408615o254806j799317N367813K390290
1775.4G52753983r32694K115631O70700R73587j678k580872P33795J746369Q16192
1784.1G56295013j902237p36923K012635P86438M93316J296005m25949m89502k917175
$$ plain form
1792.8 754411621 754069366 758118286 758660049 756577759 757724304 759783020 758762054 756546555 758211517
1801.5 758211517 758035736 758299637 759866257 759799881 760306549 760517273 759911957 760845337 761564102 759261627
1811.1 759261627 758733521 759774780 760180740 760515747 760403061 761121140 761040649 760928955 761406326 761261902
1820.8 761261902 761910324 761412582 762118149 763223877 759417801 759417953 762148819 764572372 764340820
1829.4 764340820 758421249 759588165 762309875 762563019 762724533 762844315 762946701 762185745 761791000
1838.1 761791000 762715683 762626877 763181458 763382416 764654846 765173416 758887482 760993805 763627472
1846.8 763627472 762686310 761861572 762639389 763385010 763312683 763601837 763398819 763479614 763504562 763332520
1856.4 763332520 764007645 764112701 764027252 764022369 764007645 763560715 763551025 763802567 763906403 764465790 764536514
$$ packed form
1792.8G54411621l42255M048920N41763k082290J146545K058716j020966k215499J664962
1801.5G58211517j75781K63901J566620o6376N06668K10724o05316R33380P18765k302475
1811.1G59261627n28106J041259M05960L35007j12686P18079q0491j11694M77371j44424
1820.8G61261902O48422m97742P05567J105728l806076J52K730866K423553k31552
1829.4G64340820n919571J166916K721710K53144J61514J19782J02386p60956l94745
1838.1G61791000R24683q8806N54581K00958J272430N18570o285934K106323K633667
1846.8G63627472r41162q24738P77817P45621p2327K89154k03018Q0795K4948j72042
1856.4G63332520O75125J05056q5449m883j4724m46930r690K51542J03836N59387P0724
$$ plain form
1867.1 764536514 765204010 762846527 760222168 762101364 763360519 763572006 763532639 763892136 763873291
1875.7 763873291 763485947 763239594 763126984 763448181 763400345 763582687 763723450 764018555 763919525 763582840
1885.4 763582840 764052734 764052963 764897919 764252319 761351624 762524948 763798599 763665848 764217758 763515472
1895 763515472 762344513 763161850 763344116 763122559 763428955 763571854 763429565 762977753 762889709 762460403
1904.7 762460403 762158890 762631073 762845383 762780914 762909775 762474747 762337570 762986298 762567596 762648621
1914.3 762648621 762561111 762776337 764206543 761022949 759582520 761524277 762334137 762969971 761099091
1923 761099091 759634171 760864716 761750183 761759491 761632614 761657410 761521606 761335602 761153717 760898895
1932.6 760898895 760483475 760619812 760753708 760625610 760666580 760568771 760693741 760780411 761764450 761159744
$$ packed form
1867.1G64536514O67496k357483k624359J879196J259155K11487l9367L59497j8845
1875.7G63873291l87344k46353j12610L21197m7836J82342J40763K95105r9030l36685
1885.4G63582840M69894K29Q44956o45600k900695J173324J273651j32751N51910p02286
1895G63515472j170959Q17337J82266k21557L06396J42899j42289m51812q8044m29306
1904.7G62460403l01513M72183K14310o4469J28861m35028j37177O48728m18702Q1025
1914.3G62648621q7510K15226J430206l183594j440429J941757Q09860O35834j870880
1923G61099091j464920J230545Q85467R308j26877K4796j35804j86004j81885k54822
1932.6G60898895m15420J36337J33896j28098M0970r7809J24970Q6670R84039o04706
$$ plain form
1942.3 761159744 758280716 759221878 760190811 759444885 759116516 759414673 759556885 759279404 759313660 759350357
1951.9 759350357 759441986 759522629 759378052 759277115 759237061 758875656 758323975 758424377 758236465 757847443
1961.6 757847443 757998047 758161087 758288727 758619003 759064407 758291779 757400818 757787247 758036880 757783508
1971.2 757783508 757356339 757079239 757103806 757035065 756834030 757099762 757440872 757232361 757092361 757167740
1980.8 757167740 757280273 757122574 756615829 756175156 755723572 755493164 755499802 754945450 754554977 755644455
1990.5 755644455 756030884 754237289 753947678 754762421 754867401 754760666 754599152 754067688 753669815
1999.2 753669815 753823624 753437347 753103714 753665314 753853760 753634109 753481140 753468399 753438263 753319855
2008.8 753319855 752887039 752095795 752005157 751980286 751462555 751353683 751759033 751598663 750788803 750939789
$$ packed form
1942.3G61159744k879028R41162R68933p45926l28369K98157J42212k77481L4256L6697
1951.9G59350357R1629Q0643j44577j00937m0054l61405n51681J00402j87912l89022
1961.6G57847443J50604J63040J27640L30276M45404p72628q90961L86429K49633k53372
1971.2G57783508m27169k77100K4567o8741k01035K65732L41110k08511j40000P5379
1980.8G57167740J12533j57699n06745m40673m51584k30408O638n54352l90473J089478
1990.5G55644455L86429j793595k89611Q14743J04980j06735j61514n31464l97873
1999.2G53669815J53809l86277l33633N61600J88446k19651j52969j2741l0136j18408
2008.8G53319855m32816p91244r0638k4871n17731j08872M05350j60370q09860J50986
$$ plain form
2018.5 750939789 751097336 751064911 751522827 751330032 750526657 749896927 749774551 749672546 749435959 749504013
2028.1 749504013 749827118 750073929 750122910 750280991 750074844 749614487 749274368 748900604 748435822 747891617
2037.7 747891617 747521591 747380905 747715454 747677841 747576370 747886810 747824631 747957611 747722702 747303467
2047.4 747303467 747060852 746590576 746170502 745759430 745945435 746123810 745958023 745804443 745916824 746091766
2057 746091766 745775452 745833206 745662384 745050354 744447098 743983154 744261093 744193878 743491058 743167419
2066.7 743167419 743342667 743548203 743803177 743918915 743553162 743198013 742900925 742729645 742159195 741444702
2076.3 741444702 741226883 741032486 740938797 740942459 741152496 741296997 741294327 741293945 741168671 741205368 741116104
2086.9 741116104 740948257 740535126 739777145 739388199 739428711 739396210 739298401 739485245 739622116 739804306
$$ packed form
2018.5G50939789J57547l2425M57916j92795q03375o29730j22376j02005k36587O8054
2028.1G49504013L23105K46811M8981J58081k06147m60357l40119l73764m64782n44205
2037.7G47891617l70026j40686L34549l7613j01471L10440o2179J32980k34909m19235
2047.4G47303467k42615m70276m20074m11072J86005J78375j65787j53580J12381J74942
2057G46091766l16314N7754j70822o12030o03256m63944K77939o7215p02820l23639
2066.7G43167419J75248K05536K54974J15738l65753l55149k97088j71280n70450p14493
2076.3G41444702k17819j94397r3689L662K10037J44501k670l82j25274L6697q9264
2086.9G41116104j67847m13131p57981l88946M0512l2501r7809J86844J36871J82190
$$ plain form
2096.6 739804306 740093842 740073624 739939117 739864502 739773407 739556808 739250946 738900299 738777237 738954239
2106.2 738954239 739331741 739726181 739733963 739435272 739340744 739582825 739393768 739033890 738862991 738744888
2115.9 738744888 738784103 738563461 738547668 738638306 738604584 738672943 738897858 739276505 739011002 738570404
2125.5 738570404 738163605 737693710 737547073 737572021 737667694 737430725 737430649 737800751 737868576 737668839 737489700
2136.1 737489700 737406998 737204361 737074661 737021027 737139740 737223434 737177505 737103882 736902237 736894913 736924286
2146.7 736924286 737200089 737382660 737452240 737721481 737430573 736945190 736601410 736518936 736722031 736875610
2156.4 736875610 736758041 736631927 736755447 736555939 736474838 736676941 737087631 737315903 736990280 736962051
2166 736962051 736665421 736187210 736000443 735974731 736263733 736230240 736121750 736171722 736075897 735900574 735764313
$$ packed form
2096.6G39804306K89536k0218j34507p4615r1095k16599l05862l50647j23062J77002
2106.2G38954239L77502L94440P782k98691r4528K42081j89057l59878j70899j18103
2115.9G38744888L9215k20642j5793R0638l3722O8359K24915L78647k65503m40598
2125.5G38570404m06799m69895j46637K4948R5673k36969p6L70102O7825j99737j79139
2136.1G37489700q2702k02637j29700n3634J18713Q3694m5929p3623k01645p324K9373
2146.7G36924286K75803J82571O9580K69241k90908m85383l43780q2474K03095J53579
2156.4G36875610j17569j26114J23520j99508q1101K02103M10690K28272l25623k8229
2166G36962051k96630m78211j86767k5712K89002l3493j08490M9972r5825j75323j36261
$$ plain form
2176.6 735764313 735782242 735621033 735588531 735907516 735686188 735121155 734974213 735199127 735682831 735832443
2186.3 735832443 735675278 735745239 735738983 735585327 735637131 735908356 735723572 735247574 735261002 735775528
2195.9 735775528 736027832 735833206 736022339 735949097 735759354 735988922 735851212 735568466 735420609 735664825
2205.5 735664825 735574875 735089569 735368958 735540771 735486298 735758209 735735855 735627823 735628586 735395966 735238953
2216.1 735238953 735131683 735052643 735055313 735011673 735117798 735018539 735075226 735402679 735452118 735144653 734637146
2226.8 734637146 734494553 734261932 734078903 734197311 734191895 734089661 733901901 733926620 734031296 734308319
2236.4 734308319 734187241 733907700 734102554 733796539 733424683 733110504 732868729 732821426 732688217 732824936
2246 732824936 733139877 733567429 733557434 733165665 733025284 733156281 733060379 732565842 732200165 732167511 732462845
$$ packed form
2176.6G35764313J7929j61209l2502L18985k21328n65033j46942K24914M83704J49612
2186.3G35832443j57165O9961o256j53656N1804K71225j84784m75998J3428N14526
2195.9G35775528K52304j94626J89133p3242j89743K29568j37710k82746j47857K44216
2205.5G35664825q9950m85306K79389J71813n4473K71911k2354j08032P63k32620j57013
2216.1G35238953j07270p9040K670m3640J06125r9259N6687L27453M9439l07465n07507
2226.8G34637146j42593k32621j83029J18408n416j02234j87760K4719J04676K77023
2236.4G34308319j21078k79541J94854l06015l71856l14179k41775m7303j33209J36719
2246G32824936L14941M27552r995l91769j40381J30997r5902m94537l65677l2654K95334
$$ plain form
2256.7 732462845 732091599 731636581 732041779 732343140 732313766 732311707 732507172 732268906 731888733 731689758
2266.3 731689758 731545868 731484756 730969849 730723801 730913925 731246185 731675720 731972885 731863251 731778336
2275.9 731778336 731987686 731446304 731009827 730894699 730904007 730783157 730304260 730586090 730736618 730883789
2285.6 730883789 731010361 730893478 730810318 730388031 730170059 729602051 729664917 729959183 729639969 729461746
2295.2 729461746 729196854 729395599 729407272 729584961 729450073 728744888 728881378 729262619 729482956 728839798
2304.9 728839798 728092957 727567368 727598877 728065796 727779922 728004303 727521744 726984711 727378998 727421570
2314.5 727421570 727548447 727281876 726867828 726124802 725756531 725901108 725336380 724596863 724233932 724680481
2324.2 724680481 725117264 725067902 723906784 723392181 724273224 723626404 722334137 722201385 722917404
$$ packed form
2256.7G32462845l71246m55018M05198L01361k9374k059J95465k38266l80173j98975
2266.3G31689758j43890o1112n14907k46048J90124L32260M29535K97165j09634q4915
2275.9G31778336K09350n41382m36477j15128R308j20850m78897K81830J50528J47171
2285.6G30883789J26572j16883q3160m22287k17972n68008O2866K94266l19214j78223
2295.2G29461746k64892J98745J1673J77689j34888p05185J36490L81241K20337o43158
2304.9G28839798p46841n25589L1509M66919k85874K24381m82559n37033L94287M2572
2314.5G27421570J26877k66571m14048p43026l68271J44577n64728p39517l62931M46549
2324.2G24680481M36783m9362j161118n14603Q81043o46820j292267j32752P16019
$$ plain form
2332.8 722917404 723220139 723718796 724074249 723878555 724015121 723724747 723714294 723097839 722613449 723197327
2342.5 723197327 722707520 721646347 721399307 721996002 722075500 723189011 725492783 726492538 725791397
2351.2 725791397 724820404 723869324 723262787 722542191 721692276 721432343 721112213 720692978 720333023 720678787
2360.8 720678787 721338501 721297913 721425629 720389175 719976044 721216965 721961517 721664658 719967880
2369.5 719967880 719483337 720834045 722194977 722487946 722319717 723013458 723764191 724387131 724586411
2378.2 724586411 724425354 724614716 725030365 725396652 725453339 725666122 726116257 726171341 725951385 726223984
2387.8 726223984 726635437 726614151 726556854 726358948 726286926 726408768 726364136 726151886 725756531 725547638
2397.4 725547638 725525818 725578461 725586395 725494919 725493088 725332489 724951172 724925156 725145874 724955750 724609375
$$ packed form
2332.8G22917404L02735M98657L55453j95694J36566k90374j0453o16455m84390N83878
2342.5G23197327m89807j061173k47040N96695P9498J113511K303772R99755p01141
2351.2G25791397r70993r51080o06537p20596q49915k59933l20130m19235l59955L45764
2360.8G20678787O59714m0588J27716j036454m13131J240921P44552k96859j696778
2369.5G19967880m84543J350708J360932K92969j68229O93741P50733O22940J99280
2378.2G24586411j61057J89362M15649L66287N6687K12783M50135N5084k19956K72599
2387.8G26223984M11453k1286n7297j97906p2022J21842m4632k12250l95355k08893
2397.4G25547638k1820N2643P934r1476j831j60599l81317k6016K20718j90124l46375
$$ plain form
2408.1 724609375 724394455 724605408 724495316 724032440 724568634 724720993 724429855 724562607 724151611 723808594
2417.7 723808594 724047241 724101868 723449478 722918167 722945480 722917023 723012085 723187943 723264084 723202972 723039398
2428.3 723039398 722937622 722754898 722470245 722267685 721894836 721394272 721452179 721621552 721443100 721185837
2438 721185837 721143188 721546249 721907196 721788254 721198578 720888596 720854874 720372696 719958038 719737091
2447.6 719737091 719672318 719889221 719928131 719893646 719994202 719754562 719341812 719294052 719110489 718585281
2457.2 718585281 718194046 718061829 718053665 718144455 718293991 718327026 718272095 718253632 718408127 718348770 718034210
2467.8 718034210 717901764 717512894 716941833 716623306 716523590 716703033 716888199 716873398 716687927 716372757
2477.5 716372757 716191483 716023712 715984039 716288376 716027832 715188980 714639969 714549026 714644699 714566040
$$ packed form
2408.1G24609375k14920K10953j10092m62876N36194J52359k91138J32752m10996l43017
2417.7G23808594K38647N4627o52390n31311K7313k8457R5062J75858P6141o1112j63574
2428.3G23039398j01776j82724k84653k02560l72849n00564N7907J69373j78452k57263
2438G21185837m2649M03061L60947j18942n89676l09982l3722m82178m14658k20947
2447.6G19737091o4773K16903L8910l4485J00556k39640m12750m7760j83563n25208
2457.2G18585281l91235j32217q164R0790J49536L3035n4931j8463J54495n9357l14560
2467.8G18034210j32446l88870n71061l18527r9716J79443J85166j4801j85471l15170
2477.5G16372757j81274j67771l9673L04337k60544q38852n49011r0943R5673p8659
$$ plain form
2487.1 714566040 714535599 714459152 714350052 714428177 714563141 714646301 714401932 714190674 713830338 713244095
2496.8 713244095 712898102 712622375 712413406 712383270 712891693 713018188 712508698 712538986 712615814 712386856
2506.4 712386856 712009506 711828842 711813431 711540756 711324081 711405640 711666031 711510468 711560211 711593246
2516.1 711593246 710833435 710792618 711029434 710667572 710357437 709971771 709652786 709424973 709209061 709256210
2525.7 709256210 709491501 709621048 709490128 709330139 709306717 709187012 708852692 708486481 708227692 708397217
2535.4 708397217 708575439 707919388 707234116 707440567 708013000 708089905 707875824 707933350 707844391 707659378
2545 707659378 707497406 707084045 706599121 706290894 706598282 706878204 706696091 706661606 706498032 706282120
2554.6 706282120 706101837 705849991 705789795 705583572 705135880 704865723 704654541 704405289 704596329 704832001
$$ packed form
2487.1G14566040l0441p6447j09100P8125J34964Q3160k44369k11258l60336n86243
2496.8G13244095l45993k75727k08969l0136N08423J26495n09490L0288P6828k28958
2506.4G12386856l77350j80664j5411k72675k16675Q1559K60391j55563M9743L3035
2516.1G11593246p59811m0817K36816l61862l10135l85666l18985k27813k15912M7149
2525.7G09256210K35291J29547j30920j59989k3422j19705l34320l66211k58789J69525
2535.4G08397217J78222o56051o85272K06451N72433P6905k14081N7526q8959j85013
2545G07659378j61972m13361m84924l08227L07388K79922j82113l4485j63574k15912
2554.6G06282120j80283k51846o0196k06223m47692k70157k11182k49252J91040K35672
$$ plain form
2564.3 704832001 704797363 704703827 704513779 704564209 704536209 704388733 704232101 703908768 703679581 703450851
2573.9 703450851 703146591 702491837 702273026 702909012 703251724 703201904 703013535 702741241 702464371 702382965
2583.6 702382965 701966782 701318893 701412964 701332321 701152344 701411972 701344681 700879440 700504532 700508575
2593.2 700508575 700528412 700527496 700413284 700086288 699460373 698617172 698549957 698894577 698972549 698860321 698668823
2603.8 698668823 698653336 698638229 698613129 698491898 698112183 697554626 697234192 697175522 696858749 696585846
2613.5 696585846 696390686 696203384 696106033 696004028 696063461 695821686 695444489 695326385 695001755 694576874
2623.1 694576874 694257050 694106369 694057693 693848419 693492279 693326950 693540649 693354263 692878036 692961502
2632.8 692961502 693242340 693028717 692254868 691907120 691787949 691307831 691029968 690726624 690777588 690949707
$$ packed form
2564.3G04832001l4638r3536j90048N0430k8000j47476j56632l23333k29187k28730
2573.9G03450851l04260o54754k18811O35986L42712m9820j88369k72294k76870q1406
2583.6G02382965m16183o47889R4071q0643j79977K59628o7291m65241l74908M043
2593.2G00508575J9837r16j14212l26996o25915q43201o7215L44620P7972j12228j91498
2603.8F98668823j5487j5107k5100j21231l79715n57557l20434n8670l16773k72903
2613.5F96585846j95160j87302r7351j02005N9433k41775l77197j18104l24630m24881
2623.1F94576874l19824j50681m8676k09274l56140j65329K13699j86386m76227Q3466
2632.8F92961502K80838k13623p73849l47748j19171m80118k77863l03344N0964J72119
$$ plain form
2642.4 690949707 690608597 690315552 690099792 690214081 690116577 689506073 689082489 688829193 688894653 688721466
2652 688721466 688272781 688164673 687913284 687779694 688044662 688154984 687938766 687478180 687080078 686810532
2661.7 686810532 686641617 686417465 685791550 685460434 685560150 685624847 685521545 685110397 685158081 685479279
2671.3 685479279 685529709 685286713 684787750 684558792 684124146 683773575 683736801 683532257 683566437 683376236
2681 683376236 682906036 682814484 683125687 683156281 682662506 682229080 681634445 681044235 680867386 680797806
2690.6 680797806 680737228 680536041 680046005 679765472 679864883 680062256 680510178 680516891 679913406 679673996
2700.3 679673996 679586716 679169312 678690186 678273239 677986526 678115616 677819443 677232590 677390823 677302856
2709.9 677302856 676945724 677049255 677304687 676941071 675985565 675828094 675866699 675292587 674945297 674859924
$$ packed form
2642.4F90949707l41110k93045k15760J14289r7504o10504m23584k53296O5460j73187
2652F88721466m48685j08108k51389j33590K64968J10322k16218m60586l98102k69546
2661.7F86810532j68915k24152o25915l31116R9716O4697j03302m11148M7684L21198
2671.3F85479279N0430k42996m98963k28958m34646l50571l6774k04544L4180j90201
2681F83376236m70200r1552L11203L0594m93775m33426n94635n90210j76849o9580
2690.6F80797806o0578k01187m90036k80533R9411J97373M47922O713o03485k39410
2700.3F79673996q7280m17404m79126m16947k86713J29090k96173n86853J58233q7967
2709.9F77302856l57132J03531K55432l63616r55506j57471L8605n74112l47290q5373
$$ plain form
2719.5 674859924 674910507 674995651 674937363 674964828 674966507 674726715 674420013 674032669 673429794 672799759 672514572
2730.2 672514572 672275391 671852493 671831741 671818085 671701431 672166443 672680664 672479858 671686325 671077347
2739.8 671077347 670815659 670479279 670083160 669743652 669596024 669605560 669564133 669608917 669698868 669404907
2749.4 669404907 669055557 668818436 668200912 667586746 667537918 667654724 667396851 666969681 666564789 666380081
2759.1 666380081 666543427 666667938 666708527 666535263 666123505 665604019 664997787 664752045 664831467 664587250
2768.7 664587250 664183197 664076920 663755646 663275986 663040619 663106613 663502121 663529816 663022385 662366943
2778.4 662366943 661841049 661152954 660611572 660835419 660635757 660263519 660165482 659674759 659571228 659878922
2788 659878922 659745026 659027557 658364105 657993011 657583694 657259750 656875534 656626129 656818314 656729660
$$ packed form
2719.5F74859924N0583Q5144n8288K7465J679k39792l06702l87344o02875o30035k85187
2730.2F72514572k39181m22898k0752j3656j16654M65012N14221k00806p93533o08978
2739.8F71077347k61688l36380l96119l39508j47628R536m1427M4784Q9951k93961
2749.4F69404907l49350k37121o17524o14166m8828J16806k57873m27170m04892j84708
2759.1F66380081J63346J24511M0589j73264m11758n19486o06232k45742P9422k44217
2768.7F64587250m04053j06277l21274m79660k35367O5994L95508K7695n07431o55442
2778.4F62366943n25894o88095n41382K23847j99662l72238r8037m90723j03531L07694
2788F59878922j33896p17469o63452l71094m09317l23944l84216k49405J92185q8654
$$ plain form
2797.7 656729660 656191788 655849380 655509644 655234756 655024719 654344559 653853455 653572311 653009415 652463303
2807.3 652463303 652209778 652258377 651939087 651281738 650799103 650353470 649923401 649827805 649842224 649235916
2816.9 649235916 648630371 648410187 647696152 646878052 646678467 646779022 646588135 645848236 645423050 645712585
2826.6 645712585 645610886 645023422 644451675 643622360 642786636 642332230 641999969 641624298 641143875 640516205
2836.2 640516205 639919968 639218750 638387299 637726707 637192001 636176338 634580803 633569984 632988510
2844.9 632988510 631893387 630519829 629167023 628115845 627223358 626335564 625260315 624133148 623663330
2853.6 623663330 623598518 623699226 623586197 623206520 622716980 621959724 621741562 621814079 621641312 621501541
2863.2 621501541 621050568 620417747 619990082 619744987 619609833 619170303 618115387 617149162 616781807
$$ packed form
2797.7F56729660n37872l42408l39736k74888k10037o80160m91104k81144n62896n46112
2807.3F52463303k53525M8599l19290o57349m82635m45633m30069r5596J4419o06308
2816.9F49235916o05545k20184p14035q18100j99585J00555j90887p39899m25186K89535
2826.6F45712585j01699n87464n71747q29315q35724m54406l32261l75671m80423o27670
2836.2F40516205n96237p01218q31451o60592n34706j015663j595535j010819n81474
2844.9F32988510j095123j373558j352806j051178q92487q87794j075249j127167m69818
2853.6F23663330o4812J00708j13029l79677m89540p57256k18162P2517j72767j39771
2863.2F21501541m50973o32821m27665k45095j35154m39530j054916r66225l67355
$$ plain form
2871.9 616781807 616183662 615358620 614977303 614759102 614785461 615091934 615125351 614564590 613684616 613143539
2881.6 613143539 612923965 612730179 612123756 611353340 611109886 610841713 610227890 609495354 609095154 608898087
2891.2 608898087 608169365 607155380 606584625 606663971 606372185 605576706 605015602 604533615 604074287 603494339
2900.8 603494339 602733879 602417259 602668991 602237015 601592484 601391602 600833054 600533180 600026093 599358330
2910.5 599358330 599141846 598585091 597701569 596877365 596260376 595478020 595185127 594655228 593357239
2919.2 593357239 592954445 592585831 592228012 592031860 591374664 591125450 591488113 591807594 591587753 591597519
2928.8 591597519 591551704 591068916 591121178 591625710 591651611 591365547 591786156 592078209 591825218 591946144
2938.5 591946144 592524414 593075371 593500099 594006424 594070511 593899498 593771935 593481178 593393250 593384972
$$ packed form
2871.9F16781807n98145q25042l81317k18201K6359L06473L3417n60761q79974n41077
2881.6F13143539k19574j93786o06423p70416k43454k68173o13823p32536m00200j97067
2891.2F08898087p28722j013985n70755P9346k91786p95479n61104m81987m59328n79948
2900.8F03494339p60460l16620K51732m31976o44531k00882n58548k99874n07087o67763
2910.5E99358330k16484n56755q83522q24204o16989p82356k92893n29899j297989
2919.2E93357239m02794l68614l57819j96152o57196k49214L62663L19481k19841R766
2928.8E91597519m5815m82788N2262N04532K5901k86064M20609K92053k52991J20926
2938.5E91946144N78270N50957M24728N06325O4087j71013j27563k90757q7928q278
$$ plain form
2948.1 593384972 593264656 593381805 593303146 592606163 592362289 592219429 591619377 591543045 591571465 591270485
2957.7 591270485 591161804 590999832 590386620 590112953 590349083 590597000 590727119 590739098 591163177 591373024
2967.4 591373024 591434212 592150650 592638817 592669411 593210564 593807144 593650627 594150314 595116539 595343475
2977 595343475 595593071 596195869 596815567 597144814 597302437 597509956 598028412 598595085 599004288 599380379
2986.7 599380379 599352798 599286385 599440231 600028648 600505981 600512772 600560989 600485268 600614433 600665588 600765724
2997.3 600765724 600922623 600637054 600168877 599742393 599943771 600112839 599862747 599766121 600163498 600426826
3006.9 600426826 599896889 599726982 599931030 600174484 600019341 599210548 598721085 598704529 598747520 598245010
3016.6 598245010 597762337 597415352 596988831 596905174 596456604 595806122 595692940 595708199 595375557 594999428
$$ packed form
2948.1E93384972j20316J17149p8659o96983k43874j42860o00052p6332K8420l00980
2957.7E91270485j08681j61972o13212k73667K36130K47917J30119J1979M24079K09847
2967.4E91373024O1188P16438M88167L0594N41153N96580j56517M99687R66225K26936
2977E95343475K49596O02798O19698L29247J57623K07519N18456N66673M09203L76091
2986.7E99380379k7581o6413J53846N88417M77333O791M8217p5721J29165N1155J00136
2997.3F00765724J56899k85569m68177m26484K01378J69068k50092r6626L97377K63328
3006.9F00426826n29937j69907K04048K43454j55143q08793m89463j6556M2991n02510
3016.6E98245010m82673l46985m26521q3657m48570o50482j13182J5259l32642l76129
$$ plain form
3026.2 594999428 594563065 594258728 594194984 594086113 593929558 592952957 592404823 592792549 592566071 592055321
3035.9 592055321 591545181 591005135 590465202 589811935 589447670 589487038 589373970 589127617 588624268 587501068
3045.5 587501068 586972733 586898193 586332626 585791054 585673065 585758667 585514259 584510231 583574448 583707733
3055.1 583707733 583402290 582663918 582550240 582231598 581666336 581366615 581605530 581196136 580481186 579961166
3064.8 579961166 579493217 579916725 579467316 578521156 578138847 577684555 577252617 576966362 577062645 576519012
3074.4 576519012 575918236 575701065 575473404 575439415 574866486 574119377 573537369 573309555 572837906 571894379
3084.1 571894379 571614494 571579018 571154594 571042824 571428261 571004868 570090294 569395370 568787537 568445930
3093.7 568445930 568237572 567929649 566971741 566405067 566466637 566556320 566782951 566495552 565794640 564906235
$$ packed form
3026.2E94999428m36363l04337o3744j08871j56555r76601n48134L87726k26478n10750
3035.9E92055321n10140n40046n39933o53267l64265L9368j13068k46353n03349j123200
3045.5E87501068n28335p4540n65567n41572j17989Q5602k44408j004028r35783J33285
3055.1E83707733l05443p38372j13678l18642n65262k99721K38915m09394p14950n20020
3064.8E79961166m67949M23508m49409r46160l82309m54292m31938k86255R6283n43633
3074.4E76519012o00776k17171k27661l3989n72929p47109n82008k27814m71649r43527
3084.1E71894379k79885l5476m24424j11770L85437m23393r14574o94924o07833l41607
3093.7E68445930k08358l07923r57908n66674O1570Q9683K26631k87399p00912q88405
$$ plain form
3103.4 564906235 564190674 563599205 563497887 563846664 563322716 562579956 561950035 561206017 560742760 560651016
3113 560651016 560626602 560367508 559731140 559042435 558718376 557801590 557073898 557161255 556704636 555639191
3122.6 555639191 554987526 555112228 554823494 554334793 553908806 553281250 553148651 552581787 551589813 551099892
3132.3 551099892 550427704 549505386 549205780 549207916 549133987 548874893 548385086 548024445 547219124 546404877
3141.9 546404877 545968132 545457954 544778519 543774414 543135910 542932777 542729340 542296982 541962204
3150.6 541962204 541448746 540474510 539956017 539459953 538977509 538399010 537613220 537121811 536615295 536365395
3160.3 536365395 535919342 535017242 534482346 534333382 533907280 533479881 533172646 532535896 532155838 531771431
3169.9 531771431 531106911 530363770 529650154 529145699 528636818 528161049 527747574 527230606 526332207 525902023
$$ packed form
3103.4E64906235p15561n91469j01318L48777n23948p42760o29921p44018m63257r1744
3113E60651016k4414k59094o36368o88705l24059r16786p27692Q7357m56619j065445
3122.6E55639191o51665J24702k88734m88701m25987o27556j32599n66864r91974m89921
3132.3E51099892o72188r22318k99606K136p3929k59094m89807l60641q05321q14247
3141.9E46404877m36745n10178o79435j004105o38504k03133k03437m32358l34778
3150.6E41962204n13458r74236n18493m96064m82444n78499p85790m91409n06516k49900
3160.3E36365395m46053r02100n34896j48964m26102m27399l07235o36750l80058l84407
3169.9E31771431o64520p43141p13616n04455n08881m75769m13475n16968q98399m30184
$$ plain form
3179.5 525902023 525779877 525428429 525229988 524593430 523936043 523306999 522399216 521619110 521224480 520875549
3189.2 520875549 520337448 520007362 519196129 518603897 518333206 518002281 517825203 516912804 516183052 515781021
3198.8 515781021 515266914 514868202 514729576 514520645 513900146 513730965 513157654 512219124 511620636 511313133
3208.5 511313133 511243057 510371246 509363747 509212074 509333305 508729515 508033028 507587280 506974182 506781578
3218.1 506781578 506340065 505624275 505245171 504737358 504123573 504093513 503967323 503151627 502584305 502126999
3227.8 502126999 501993484 501789932 501210594 501042786 500771790 500239296 499544220 498927612 498421669 497968025
3237.4 497968025 497865372 497576027 496608658 496033325 496305351 496248932 495744019 494650078 494112625 494502487
3247 494502487 494355774 493741798 492662239 491994019 491771774 491620789 491444054 491023026 490889931 490195427
$$ packed form
3179.5E25902023j22146l51448j98441o36558o57387o29044r07783p80106l94630l48931
3189.2E20875549n38101l30086q11233n92232k70691l30925j77078r12399p29752m02031
3198.8E15781021n14107l98712j38626k08931o20499j69181n73311r38530n98488l07503
3208.5E11313133p0076q71811j007499j51673J21231o03790o96487m45748o13098j92604
3218.1E06781578m41513p15790l79104n07813o13785l0060j26190q15696n67322m57306
3227.8E02126999j33515k03552n79338j67808k70996n32494o95076o16608n05943m53644
3237.4D97968025j02653k89345r67369n75333K72026n6419n04913j093941n37453L89862
3247D94502487j46713o13976j079559o68220k22245j50985j76735m21028j33095o94504
$$ plain form
3256.7 490195427 489707718 489735794 489551697 489092216 488425407 488202438 487700424 487265167 487045441 486475677
3266.3 486475677 485775871 485495453 485521889 485080147 485045738 485032806 484532280 483479156 482855492 483416748
3276 483416748 483226662 482863770 482407074 481371078 481007881 481270256 481349792 480608444 479666634 479123764
3285.6 479123764 478953667 478893280 478679085 478167839 477970924 477876320 477382126 477355614 476730042 476127090
3295.3 476127090 476236687 475914268 475221710 474410324 474391518 474387703 474078217 473763428 473462868 473504753
3304.9 473504753 472715302 471741447 471844864 472163391 471133614 470313759 470469551 469846077 469355392
3313.6 469355392 469197083 468736916 468081131 467775841 467751694 467371407 466658554 465807877 465814018 465896034
3323.2 465896034 465725594 465292091 464725494 464535141 463664856 463231735 463182182 462783966 461935234 461218452
$$ packed form
3256.7D90195427m87709K8076j84097m59481o66809k22969n02014m35257k19726n69764
3266.3D86475677o99806k80418K6436m41742l4409j2932n00526j053124o23664N61256
3276D83416748j90086l62892m56696j035996l63197K62375P9536p41348r41810n42870
3285.6D79123764j70097o0387k14195n11246j96915r4604m94194k6512o25572o02952
3295.3D76127090J09597l22419o92558q11386j8806l815l09486l14789l00560M1885
3304.9D73504753p89451r73855J03417L18527j029777q19855J55792o23474m90685
3313.6D69355392j58309m60167o55785l05290k4147l80287p12853q50677O141Q2016
3323.2D65896034j70440m33503n66597j90353q70285m33121m9553l98216q48732p16782
$$ plain form
3332.9 461218452 461622849 461404991 460686684 459787941 458843422 458536682 458237152 457871857 457352028 456913300
3342.5 456913300 456321716 456074371 456192436 455827942 455551910 455640411 455453987 454540291 453670769 452872810
3352.2 452872810 452356339 452402153 452338104 451999626 451317062 451038742 451008263 450627975 449943352 449338455
3361.8 449338455 449096909 448931236 448471031 447265816 446650658 446927147 447046509 446535339 445681000
3370.5 445681000 445186539 444639091 444371567 444336357 444405975 444277344 443776932 443393288 442730141 442091179
3380.1 442091179 441314697 441166496 441398125 441288414 441368332 440957527 440856476 440315361 439456177 439414749
3389.8 439414749 439364929 439398079 438682938 437859573 437790718 437815590 437528801 436965179 436936111 436814804
3399.4 436814804 436608543 436284103 435600853 435197716 434867783 434721298 434590988 434395790 434583817 434577980
$$ packed form
3332.9D61218452M04397k17858p18307q98743r44519l06740k99530l65295n19829m38728
3342.5D56913300n91584k47345J18065l64494k76032Q8501j86424r13696q69522p97959
3352.2D52872810n16471M5814o4049l38478o82564k78320l0479l80288o84623o04897
3361.8D49338455k41546j65673m60205j205215o15158K76489J19362n11170q54339
3370.5D45681000m94461n47448k67524l5210O9618j28631n00412l83644o63147o38962
3380.1D42091179p76482j48201K31629j09711P9918m10805j01051n41115q59184m1428
3389.8D39414749m9820L3150p15141q23365o8855K4872k86789n63622k9068j21307
3399.4D36814804k06261l24440o83250m03137l29933j46485j30310j95198J88027n837
$$ plain form
3409.1 434577980 434179459 434082146 434123306 433805199 433527565 433517456 433052406 432513428 432617302 433078766
3418.7 433078766 433449097 432613220 431755447 432180786 432644539 432469063 431777229 431770363 432134895 432021294
3428.3 432021294 431875191 431733284 431628609 431583328 431790047 431767654 431458473 431325493 431245804 430995636
3438 430995636 431027870 431230354 431345482 431892204 431182137 430743866 431607170 432151794 432341461 430513191
3447.6 430513191 430538673 432059479 431711922 431563759 432056923 432616158 432417717 432411690 432630768 432149086
3457.3 432149086 432314301 432814178 433510513 433643150 433427277 433369827 433434067 434179497 434293022 433587570
3466.9 433587570 433202019 433780975 434442787 434895630 435140686 435065117 435775032 436173630 435917816 435936699
3476.6 435936699 435954857 436372833 437575493 438143539 437668648 437420578 437279854 437683029 437591476 437536583
$$ packed form
3409.1D34577980l98521r7313M1160l18107k77634j0109m65050n38978J03874M61464
3418.7D33078766L70331q35877q57773M25339M63753j75476o91834o866L64532j13601
3428.3D32021294j46103j41907j04675m5281K06719k2393l09181j32980p9689k50168
3438D30995636L2234K02484J15128N46722p10067m38271Q63304N44624J89667j828270
3447.6D30513191K5482J520806l47557j48163M93164N59235j98441o027K19078m81682
3457.3D32149086J65215M99877O96335J32637k15873n7450O4240P45430J13525p05452
3466.9D33587570l85551N78956O61812M52843K45056p5569P09915L98598k55814J8883
3476.6D35936699J8158M17976J202660N68046m74891k48070j40724M03175r1553n4893
$$ plain form
3486.2 437536583 438480339 438299866 438400230 439592171 440052299 439975166 440735092 441350861 441118355 441178970
3495.8 441178970 441039467 441107750 441878510 442939415 443424110 444138222 445017357 443423691 442705421
3504.5 442705421 443919525 444271011 444415970 445479240 445234985 444229279 445559616 446583939 447064972
3513.2 447064972 447459641 447611160 448128242 448072739 448136063 448270950 448176575 448698196 450436859 450987968
3522.9 450987968 449356079 449759560 451318893 452035713 451390381 451262779 452119293 452791214 452925072
3531.5 452925072 452788734 453540115 454335518 455896378 455915260 454526825 455461311 456337700 457357407
3540.2 457357407 458139572 458526344 458546486 459444466 460896225 460178299 460325890 459221268 459528198
3548.9 459528198 461302757 462644997 463780289 461821709 462050171 462581100 463362961 465111961 464845276
$$ packed form
3486.2D37536583R43756j80473J00364J191941M60128p7133P59926O15769k32506O0615
3495.8D41178970j39503O8283P70760J060905M84695P14112Q79135j593666p18270
3504.5D42705421J214104L51486J44959J063270k44255j005706J330337J024323M81033
3513.2D47064972L94669J51519N17082n5503O3324J34887r4375N21621J738663N51109
3522.9D50987968j631889M03481J559333P16820o45332j27602Q56514O71921J33858
3531.5D52925072j36338P51381P95403J560860J8882j388435R34486Q76389J019707
3540.2D57357407P82165L86772K0142Q97980J451759p17926J47591j104622L06930
3548.9D59528198J774559J342240J135292j958580K28462N30929P81861J749000k66685
$$ plain form
3557.6 464845276 465950356 467198181 467271843 467015572 469016800 470005608 469083405 472740479 472401886
3566.2 472401886 469727440 468581467 467013855 470270538 471882706 472857285 474273300 475107307 475059471
3574.9 475059471 475416985 476462669 475948181 478115082 479250374 478757706 480048065 480923347 481608772
3583.6 481608772 481840210 485490379 486536484 482171326 482468491 481014442 483845291 487167587 489316368
3592.3 489316368 489160995 487928238 490438156 488918610 490861626 493227654 491325531 493076744
3600 493076744 493539085 493874969 495179558 496079140 497568588 500289917 502915230 500129890 501825142
3608.7 501825142 500879822 499676819 506548233 505678482 501830978 505503235 505016479 509137993 513087616
3617.4 513087616 511166954 511374664 509824867 510183754 513075027 515008469 516722946 518968506 520632324
$$ packed form
3557.6D64845276J105080J247825P3662k56271K001228R88808r22203L657074l38593
3566.2D72401886k674446j145973j567612L256683J612168R74579J416015Q34007m7836
3574.9D75059471L57514J045684n14488K166901J135292m92668J290359Q75282O85425
3583.6D81608772K31438L650169J046105m365158K97165j454049K830849L322296K148781
3592.3D89316368j55373j232757K509918j519546J943016K366028j902123J751213
3600D93076744M62341L35884J304589Q99582J489448K721329K625313k785340J695252
3608.7E01825142r45320j203003O871414q69751l847504L672257m86756M121514L949623
3617.4E13087616j920662K07710j549797L58887K891273J933442J714477K245560J663818
$$ plain form
3626 520632324 522305527 528347702 526271400 512981758 518499565 524010315 528823967 528492203 525755959
3634.7 525755959 528145905 531001930 533015213 532772446 533639412 535923347 537930984 538334389 538370552
3643.4 538370552 540899277 544106216 549057465 545741272 540482063 546959343 545579681 540692825
3651.1 540692825 540315514 546617203 551407661 555038109 558972664 549139709 550814095 556542740
3658.8 556542740 557821655 558503990 558593636 560695496 561433296 562157784 563640747 564201012 568069038
3667.5 568069038 570431366 568767929 567160721 559631615 562601509 571765442 580185928 576676521
3675.2 576676521 556407394 560545197 569652405 574315453 571071129 570718956 573457985 575296364
3682.9 575296364 576965523 577395134 577333374 581366768 588017654 577182617 571031189 578573074 572496185
$$ packed form
3626E20632324J673203O042175k076302j3289642N517807N510750M813652l31764k736244
3634.7E25755959K389946K856025K013283k42767Q66966K283935K007637M03405L6163
3643.4E38370552K528725L206939M951249l316193n259209O477280j379662m886856
3651.1E40692825l77311O301689M790458L630448L934555r832955J674386N728645
3658.8E56542740J278915O82335Q9646K101860P37800P24488J482963N60265L868026
3667.5E68069038K362328j663437j607208p529106K969894R163933Q420486l509407
3675.2E76676521k0269127M137803R107208M663048l244324l52173K739029J838379
3682.9E75296364J669159M29611o1760M033394O650886j0835037o151428P541885o076889
$$ plain form
3691.6 572496185 573238602 579050751 579018517 580245972 580630569 579693375 580051270 580125885 582710533
3700.3 582710533 585249596 578918915 575968590 580933418 582820396 583062248 583742638 585840340 589246559
3709 589246559 581796455 585796509 589845505 575274849 580049782 584363976 584900856 585594749 587852173
3717.7 587852173 588984261 583944016 584673233 591553421 588328934 582305984 587171440 588196869
3725.4 588196869 586748466 583213501 583733330 588212357 588851891 594337959 591582794 583410492 593778419
3734 593778419 594245033 580469322 581627121 585262909 585055656 587931900 591375618 586556206 589995537
3742.7 589995537 602681885 592751083 574390297 584524841 590773849 596794357 592153969 580413284
3750.4 580413284 591226006 583019943 576392174 583078346 588494492 592356110 586446953 589183540
$$ packed form
3691.6E72496185P42417N812149l2234J227455L84597r37194L57895P4615K584648
3700.3E82710533K539063o330681k950325M964828J886978K41852O80390K097702L406219
3709E89246559p450104M000054M048996j4570656M774933M314194N36880O93893K257424
3717.7E87852173J132088n040245P29217O880188l224487o022950M865456J025429
3725.4E88196869j448403l534965N19829M479027O39534N486068k755165q172302J0367927
3734E93778419M66614j3775711J157799L635788k07253K876244L443718m819412L439331
3742.7E89995537J2686348r930802j8360786J0134544O249008O020508m640388j1740685
3750.4E80413284J0812722q206063o627769O686172N416146L861618n909157K736587
$$ plain form
3758.2 589183540 595273476 585502243 583333397 588602867 590680618 590676193 593600273 590184021 584958458
3766.8 584958458 588446274 594006386 594557610 583594055 584564095 588246880 588606758 589185638 589476242
3775.5 589476242 590722427 590794640 593172264 592366829 583539047 586146545 588643341 589554710 591413918
3784.2 591413918 587774048 586892548 588336220 588853912 589505386 589012833 589038773 589314919 590258675
3792.9 590258675 589868736 590304260 593624535 589411888 584813042 587417488 592254448 598174477 589381256
3801.5 589381256 578332405 582469025 586727257 592522659 597046509 584674263 579980469 585654144
3809.3 585654144 588017769 587776375 588250732 588901176 590472984 596128311 593578224 578066177 583691788
3817.9 583691788 590214539 595158234 595514297 574731026 577591095 584632759 587505188 589710846
$$ packed form
3758.2E89183540O089936r771233k168846N269470K077751m425K924080l416252n225563
3766.8E84958458L487816N560112N51224j0963555R70040L682785L59878N78880K90604
3775.5E89476242J246185P2213K377624q05435q827782K607498K496796R11369J859208
3784.2E91413918l639870q81500J443672N17692O51474m92553K5940K76146R43756
3792.9E90258675l89939M35524L320275m212647m598846K604446M836960N920029q793221
3801.5E89381256j1048851M136620M258232N795402M523850j2372246m693794N673675
3809.3E85654144K363625k41394M74357O50444J571808N655327k550087j5512047N625611
3817.9E83691788O522751M943695L56063k0783271K860069P041664K872429K205658
$$ plain form
3825.7 589710846 588624458 583559113 584486771 586621132 589756126 590987511 581766739 585413170
3833.4 585413170 592902069 586320076 585629921 594477425 586702461 580604973 586303406 579901085
3841.1 579901085 582311707 589697876 585850449 581602440 584140511 585952454 586262589 588072281
3848.8 588072281 587625389 590742416 596987877 587165871 585087967 568789673 572542992 583762436
3856.5 583762436 582537804 581015549 583812370 587091064 589583702 582900848 583202286 590910530
3864.2 590910530 583095703 576913147 582171631 588255844 595566597 586634865 575352249 579045525
3871.9 579045525 585694389 588852768 577077560 579023628 583445549 583410072 585900154 589851837
3879.7 589851837 582665787 574731979 581484528 583131256 585387993 591161270 576039162 576198921
$$ packed form
3825.7E89710846j086388n065345R27658K134361L134994J231385r220772L646431
3833.4E85413170P488899o581993o90155Q847504p774964o097488N698433o402321
3841.1E79901085K410622P386169l847427m248009K538071J811943L10135J809692
3848.8E88072281m46892L117027O245461r822006k077904j6298294L753319J1219444
3856.5E83762436j224632j522255K796821L278694K492638o682854L01438P708244
3864.2E90910530p814827o182556N258484O084213P310753q931732j1282616L693276
3871.9E79045525O648864L158379j1775208J946068M421921l5477K490082L951683
3879.7E89851837p186050p933808O752549J646728K256737N773277j5122108J59759
$$ plain form
3887.4 576198921 581200752 583427429 589318695 588907356 576631393 577753868 582305679 581042061
3895.1 581042061 582076607 582892685 585431442 587305679 576572418 581570435 583345566 576949425
3902.8 576949425 582310982 579219856 576080971 576989632 578001862 579711990 579674225 580308762 580438995
3911.5 580438995 580449791 580280457 579922905 581975708 584121017 579781494 576011124 580628662 580689507
3920.2 580689507 576266174 578945198 581216278 582113113 579252815 575684357 577634544 579226646
3927.9 579226646 580161018 578286514 577433319 579942131 577214012 575498314 577199059 577618179 578364754
3936.6 578364754 579346619 579100685 578735809 578081627 578941956 579926376 575275421 574582634 576391525
3945.2 576391525 577388725 578563576 575874405 576180687 576535339 574460754 576000481 576521263 575912247
$$ packed form
3887.4E76198921N001831K226677N891266m11339j2275963J122475M551811j263618
3895.1E81042061J034546Q16078K538757J874237j0733261M998017J775131o396141
3902.8E76949425N361557l091126l138885R08661J012230J710128l7765O34537J30233
3911.5E80438995J0796j69334l57552K052803K145309m339523l770370M617538O0845
3920.2E80689507m423333K679024K271080Q96835k860298l568458J950187J592102
3927.9E79226646R34372j874504q53195K508812k728119j715698J700745M19120P46575
3936.6E78364754R81865k45934l64876o54182Q60329R84420m650955o92787J808891
3945.2E76391525R97200J174851k689171L06282L54652k074585J539727N20782o09016
$$ plain form
3953.9 575912247 575601845 576279945 577169838 576570015 576204605 575594025 576190071 576290054 574305687 574671288
3963.6 574671288 575804100 575535088 575560455 575657806 575623856 575116615 574550705 575438957 575375938 574786072
3973.2 574786072 575049286 574907417 574682274 574288368 574685555 575137138 574801140 574230652 573859291 573679886
3982.8 573679886 573451233 574023018 574003067 573815880 573822823 573719292 574142952 573483276 572882500 573337364
3992.5 573337364 574231453 574158974 573018913 573271904 574117699 573713608 572411499 572417679
4000.2 572417679
$$ packed form
3953.9E75912247l10402O78100Q89893n99823l65410o10580N96046R9983j984367L65601
3963.6E74671288J132812k69012K5367R7351l3950n07241n65910Q88252o3019n89866
3973.2E74786072K63214j41869k25143l93906L97187M51583l35998n70488l71361j79405
3982.8E73679886k28653N71785j9951j87187O943j03531M23660o59676o00776M54864
3992.5E73337364Q94089p2479j140061K52991Q45795m04091j302109O180
4000.2E72417679
##END=$$ End of the data block
