##TITLE=$$ Begin of the data block
##JCAMP-DX=5.00 $$ ACD/SpecManager v 10.08
##SPECTROMETER/DATA SYSTEM=Varian
##DATE=18 Dec 2012 10:29:34
##DATA TYPE=INFRARED SPECTRUM
##DATA CLASS=XYDATA
##ORIGIN=
##OWNER=
##NPOINTS=3735
##FIRSTX=399.26403809
##LASTX=4000.35498047
##MAXX=4000.35498047
##MINX=399.26403809
##MAXY=76.62669373
##MINY=43.00542831
##XFACTOR=1.0000000000
##YFACTOR=0.000000100000000
##FIRSTY=68.84989929
##DELTAX=0.96440572
##XUNITS=1/CM
##YUNITS=TRANSMITTANCE
##XYDATA=(X++(Y..Y))
399.3F88498993q15964m279022m125595O115188J532746p997437k047271P065506M569854
$$ 688498993 687683029 683404007 679278412 685393600 686926346 678928909 676881638 683947144 688516998
407.9F88516998L407975j571045j909790m966355l246765O611099J706696m430237
$$ 688516998 691924973 690353928 688444138 683477783 680231018 686842117 688548813 684118576
415.7F84118576j007156O153488o138306o670685N481263k586441K036438L336410
$$ 684118576 683111420 689264908 683126602 676455917 681937180 679350739 681387177 684723587
423.4F84723587P215042Q98361o755752j759567J603240L666001p82166k055816n251465
$$ 684723587 691938629 692836990 686081238 684321671 685924911 689590912 688808746 686752930 681501465
432.1F81501465p87125K66648l131333j664276j202850M189605m158554N30014M039765
$$ 681501465 680714340 680980988 677849655 676185379 674982529 679172134 675013580 675543594 679583359
440.7F79583359n606613L841095K59323j090775N06821m409790j351471O053848O909866
$$ 679583359 673976746 677817841 678077164 676986389 677493210 673083420 671731949 677785797 684695663
449.4F84695663k376174j628647J029281Q06504n202027o219177M041824R00956p905808
$$ 684695663 682319489 680690842 681720123 682526627 677324600 671105423 675147247 676048203 668142395
458.1F68142395J152267L841401K875900L851471R45434n675582m278641j924210j258697
$$ 668142395 669294662 673136063 676011963 679863434 680808868 675133286 670854645 668930435 667671738
466.8F67671738K85644L421402q25577K498551N052185j0469742k679748M931182N583573
$$ 667671738 667957382 671378784 670553207 673051758 678103943 667634201 664954453 669885635 675469208
475.5F75469208l20053o191483O08292K665405L921890j512603r34220O65360l677674
$$ 675469208 675149155 668957672 669565964 672231369 676153259 674640656 673706436 674371796 670694122
484.1F70694122P07703K230987J534653j559219K5101P30819K146836R62600n466079
$$ 670694122 671401825 673632812 675167465 673608246 673633347 674364166 676511002 677473602 672007523
492.8F72007523j327134N27955L794021J216278k10876N87387m341965J731567K343750
$$ 672007523 670680389 671208344 675002365 676218643 676007767 676595154 672253189 673984756 676328506
501.5F76328506Q63572J962585k281723n167465m785462K848359N120163J694564l382187
$$ 676328506 677192078 679154663 676872940 671705475 666920013 669768372 674888535 676583099 673200912
510.2F73200912m278183L01743K83051o08521j609497n26581j057205j411438P11746
$$ 673200912 668922729 669224472 669507523 668899002 667289505 666762924 665705719 664294281 665006027
518.9F65006027o36902l64074m72184j431884n21088J765366J891632J497039R58100
$$ 665006027 664369125 664005051 663532867 662100983 661579895 663345261 665236893 666733932 667692032
527.5F67692032j677017j27411O36902k013703l324432l211212K39181K767334J882324
$$ 667692032 666015015 665887604 666524506 664510803 661186371 657975159 658214340 660981674 662863998
536.2F62863998L29361j530151k193146Q67768K407837K82974p41196n68314q23745
$$ 662863998 663193359 661663208 659470062 660337830 662745667 663028641 662287445 661719131 660895386
544.9F60895386j109467p4920J161880K744446O35300j914139J794891K360535K90146
$$ 660895386 659785919 659710999 660872879 663617325 664252625 662338486 664133377 666493912 666784058
553.6F66784058o04706l89328n09339j604461o3324Q14667k48871j146546n1880R76105
$$ 666784058 666179352 665790024 665280685 663676224 663612900 664427567 664178696 663032150 662980270 663956375
563.2F63956375p3242N61829J095809K96937k94190M5395l86353q30535o63910j487732
$$ 663956375 663883133 664444962 665540771 665837708 665543518 665588913 665202560 664372025 663708115 662220383
572.9F62220383j371308j17874M68521o61239p81403Q62122J680832Q21075j873398
$$ 662220383 660849075 660731201 661199722 660538483 659757080 660619202 662300034 663121109 661247711
581.5F61247711j147461O17905Q23593J196289n12390j362686p64084K05002J937713
$$ 661247711 660100250 660718155 661541748 662738037 662225647 660862961 660098877 660303879 662241592
590.2F62241592J640320L87650K65960K42234o28968j156692j99280L2044j372834
$$ 662241592 663881912 664269562 664535522 664777756 664148788 662992096 662792816 662824860 661452026
598.9F61452026k088318j269760J10016k86484j840820j388244M99649J39160k773819
$$ 661452026 659363708 658093948 658203964 657917480 656076660 654688416 655188065 655327225 652553406
607.6F52553406l556366k843857m484940o074905n124359n126953n887299o034241
$$ 652553406 648997040 646153183 641668243 635593338 630468979 625342026 619454727 613420486
615.3F13420486o894531o034851l371849j211510j193847K7618M38004Q70056K607994
$$ 613420486 606525955 600491104 597119255 595907745 594713898 594741516 595179520 596049576 598657570
624E98657570L216782N171279P259827P911034P105217O042061M575119M017334M006042
$$ 598657570 601874352 607045631 614305458 622216492 629321709 635363770 639938889 643956223 647962265
632.7F47962265K542419m56314j925964o71463j002502j146088n16434m65011K605972
$$ 647962265 650504684 650048370 648122406 647450943 646448441 645302353 644785919 644320908 646926880
641.3F46926880M307861L215103L984681N418777M606018J972427J244812L013077
$$ 646926880 651234741 654449844 658434525 663853302 668459320 670431747 671676559 674689636
649F74689636J629944L35312m97437k21405J022873p66678j01089J473923J699447
$$ 674689636 676319580 676654892 676157455 675936050 676958923 676192245 676091156 677565079 679264526
657.7F79264526O44150K90680J626816N29022L87421J58386k01111n34515o4011M76990
$$ 679264526 679908676 680199356 681826172 682355194 682742615 682901001 682699890 682165375 682101364 682578354
667.4F82578354p546539L364639M883270J544800M32663M80118J498642J133194n30243
$$ 682578354 675031815 678396454 683279724 684824524 685257187 685737305 687235947 688369141 687838898
676.1F87838898k78626J92261p43485n49545J67084N79147J007004K63977K46277K36740
$$ 687838898 687560272 687752533 687009048 686459503 686626587 687205734 688212738 688476715 688722992 688959732
685.7F88959732p42569q08182M79126n77774k714996j855545j165238r18808j370239
$$ 688959732 688217163 687408981 687888107 687310333 684595337 682739792 681574554 680655746 679285507
694.4F79285507j880493k09122J237488J09482j436997m0206L79562l60489m73099
$$ 679285507 677405014 677195892 678433380 678542862 677105865 677065659 677445221 677084732 676611633
703.1F76611633p93838J77917o9961K80685J436157Q30307O85044Q19931J291733J732177
$$ 676611633 675817795 675995712 675925751 676206436 677642593 678472900 679157944 679977875 681269608 683001785
712.7F83001785J926270J350097K45896K51160P58285Q77533M74472L70331M97360
$$ 683001785 684928055 686278152 686524048 686775208 687533493 688411026 688885498 689255829 689753189
721.4F89753189J070633J288834Q15277J137771Q00553n69229o57578M7989p53021
$$ 689753189 690823822 692112656 692927933 694065704 694866257 694297028 693639450 693687439 692934418
730.1F92934418j124878k90070j279983j537323J364517J447067l16849N75333J319275
$$ 692934418 691809540 691519470 690239487 688702164 690066681 691513748 691196899 691772232 693091507
738.7F93091507O51474j356812K52152K828293k60773j385879N38253J489716P84149
$$ 693091507 693742981 692386169 692638321 695466614 695205841 693819962 694358215 695847931 696632080
747.4F96632080P38983K695999K842408K111511J278763K076950K333297P66983J806946
$$ 696632080 697371063 700067062 702909470 705020981 706299744 708376694 710709991 711476974 713283920
756.1G13283920K452622L94439p70187J421585J225433N78156J614227M0055r8038
$$ 713283920 715736542 716130981 715360794 716782379 718007812 718585968 720200195 720240250 720142212
764.8G20142212j52969l27988K21863k67258j484299j630554n02319j349564K19650
$$ 720142212 719989243 719661255 719883118 719615860 718131561 716501007 715998688 714649124 714868774
773.5G14868774K278443J600952J394501Q05511J620331K559586J617813N45272M93088
$$ 714868774 717147217 718748169 720142670 720948181 722568512 725128098 726745911 727291183 727784271
782.1G27784271L37067Q55102J828537J040116M33578N11780J308441J239395Q51288
$$ 727784271 728121338 728976440 730804977 731845093 732278671 732790451 734098892 735338287 736189575
790.8G36189575J23444q04672L04336P64160O14777n55649j178284m25415O39496P78961
$$ 736189575 736313019 735508347 735812683 736576843 737191620 736635971 735457687 735032272 735671768 736450729
800.5G36450729k99377N03769M21219M29916K19803m75464M48990M95529M501p18002
$$ 736450729 736151352 736655121 737076340 737506256 737726059 737250595 737699585 738195114 738199615 737481613
810.1G37481613p8583J46027O98090R15527m4785J397324J183548N264k8228Q70056
$$ 737481613 737403030 737549057 738247147 739162674 739117889 740515213 741698761 741704025 741675797 742545853
819.7G42545853l25318j574020J07956l6698K80610o75888j527405j256714j675415
$$ 742545853 742220535 740646515 740754471 740717773 740998383 740322495 738795090 737538376 735862961
828.4G35862961r97696j089783p75299j783600k927627l357392l183212k047119k077484
$$ 735862961 734865265 733775482 733000183 731216583 728288956 724931564 721748352 719701233 717623749
837.1G17623749j985245k815857k894058k074890j695633j705551j919709j649475
$$ 717623749 715638504 712822647 709928589 707853699 706158066 704452515 702532806 700883331
844.8G00883331k290497n00183J698304M28619o30798M34036J883469J647567J610108
$$ 700883331 698592834 698092651 699790955 700219574 699588776 700022812 701906281 703553848 705163956
853.5G05163956J939087K248916J979904J130753J460037K378617K963867J202011
$$ 705163956 707103043 709351959 711331863 712462616 713922653 716301270 719265137 720467148
861.2G20467148R73129K389679J784668M40445J09024J082840R24530J095276N45349
$$ 720467148 721440277 723829956 725614624 726055069 726164093 727246933 728171463 729266739 729812088
869.9G29812088O70547J566468K65960K07062N52674Q37860O33773L13340L357q95081
$$ 729812088 730482635 732049103 732315063 732522125 733074799 733912659 734546432 734859772 734863129 733968048
879.5G33968048j348724j741791j453095j733398j281052j150055j139907m36859j058884
$$ 733968048 732619324 730877533 729424438 727691040 726409988 725259933 724120026 723683167 722624283
888.2G22624283j030197j246109j001740m58603k83432M07563N25436O97708M25568
$$ 722624283 721594086 720347977 719346237 718887634 718604202 719011765 719537201 720234909 720660477
896.9G20660477O65817M93088k58332L74833Q29467J42899j062622j245957q28476
$$ 720660477 721326294 721819382 721561050 721935883 722765350 722908249 721845627 720599670 719771194
905.6G19771194k13775n92194k318039k914581k028275j445388j632004j770477j828461
$$ 719771194 719557419 718965225 716647186 713732605 711704330 710258942 708626938 706856461 705028000
914.3G05028000j804352k003021j236267j400681l335266l789444k660828j231765
$$ 705028000 703223648 701220627 699984360 698583679 695248413 691458969 688798141 687566376
922F87566376j820526k201920j486511j320954m51355n02624o51016k69928r00269
$$ 687566376 685745850 683543930 682057419 680736465 680285110 679782486 679131470 678861542 677961273
930.7F77961273r55047p1183L39051O08368J827621K219849J633300K032929K723923
$$ 677961273 677006226 676935043 677274094 677882462 679710083 681929932 683563232 685596161 688320084
939.3F88320084K796630K268525K831573L150711K158890J723099J380768J515045
$$ 688320084 691116714 693385239 696216812 699367523 701526413 703249512 704630280 706145325
947.1G06145325K163925K400589J647262J089020P87201N48325Q30230J98365o63224
$$ 706145325 708309250 710709839 712357101 713446121 714233322 714781647 715611877 715810242 715147018
955.7G15147018r13467q75778j305924j570816j716079j450730j257858k537384k311325
$$ 715147018 714233551 713357773 712051849 710481033 708764954 707314224 706056366 703518982 701207657
964.4G01207657r25369j228943j858139p94220o40793j265564q33054o60095K47116
$$ 701207657 700282288 699053345 697195206 696400986 695760193 694494629 693661575 693001480 693248596
973.1F93248596l24707j630554r88464k62070n39856j297150O256K87629o51703o27518
$$ 693248596 692923889 691293335 690304871 690042801 689502945 688205795 688212051 688499680 687847977 687220459
982.7F87220459j803436j661530j052704j770096k308883k036667j585159k483673
$$ 687220459 685417023 683755493 682702789 680932693 678623810 676587143 675001984 672518311
990.5F72518311k377701q10166j619491l661499l819962k221298L90091K268982K424774
$$ 672518311 670140610 669330444 667710953 664049454 660229492 658008194 658398285 660667267 663092041
999.1F63092041Q18100p86133n19714n71594j118470q36181j021500p06558m72260
$$ 663092041 663910141 663124008 662604294 662032700 660914230 660078049 659056549 658349991 657877731
1007.8F57877731q42437n53360j290665j209717o54983j446152q76312q34046j775894
$$ 657877731 657035294 656481934 655191269 653981552 653326569 651880417 651004105 650170059 648394165
1016.5F48394165k567749j907272p53861j935882j353341j031761j990089j998863
$$ 648394165 645826416 643919144 643165283 641229401 639876060 638844299 636854210 634855347
1024.2F34855347j702957p60727k184906k745018j240654q16307j156617j299781m87137
$$ 634855347 633152390 632391663 630206757 627461739 626221085 625404778 624248161 622948380 622461243
1032.9F22461243m87519j243057j792107j342353p98684p00225j030503r96360j31760
$$ 622461243 621973724 620730667 618938560 617596207 616797523 616097298 615066795 614070435 613938675
1041.6F13938675p81403n69305L12195L20091m56543p21207K83890J29089O9085L10936
$$ 613938675 613157272 612587967 612900162 613220253 612763710 612042503 612326393 612455482 612524567 612835503
1051.2F12835503N68580M4937j15013L7346m74205Q63381Q91990o18095j514740o97594
$$ 612835503 613404083 613449020 613334007 613371353 612897148 613760529 614652519 614034424 612519684 611822090
1060.9F11822090J61286p27692n37109o19355k77252l92876j278915j063995q11653
$$ 611822090 611983376 611255684 610718575 610099220 609821968 609429092 608150177 607086182 606274529
1069.5F06274529p86858j415176p81174l44963l94249n3253p9575k29454n15709m25949
$$ 606274529 605487671 604072495 603291321 602946358 602552109 602498856 602419281 602189827 601674118 601248169
1079.2F01248169n37338J04751m72297j514512j295051q34007k71645o84662k64206
$$ 601248169 600710831 600815582 600343285 598828773 597533722 596699715 596428070 595743408 595479202
1087.9E95479202m76303j323509k253418k857285k807655l456650l774261n111313
$$ 595479202 595002899 593679390 591425972 588568687 585761032 582304382 578530121 573418808
1095.6E73418808m312058m017562n036469m341736m317360l786773n155754m651909
$$ 573418808 569106750 565089188 560052719 555710983 551393623 547606850 542451096 537799187
1103.3E37799187m700394n192299l963508m730721m843330n844880m098396l674698
$$ 537799187 533098793 527906494 523942986 519212265 514368935 508524055 504425659 500750961
1111E00750961l673401k865829k756577j266861k159156j69754l61786n4322J241189
$$ 500750961 497077560 494211731 491455154 490188293 488029137 487859383 487497597 487443275 488684464
1119.7D88684464R25979J377373M09736J468773J86882Q96912J604729J414222J650582
$$ 488684464 489610443 490987816 491397552 492866325 493053207 493950119 495554848 496969070 498619652
1128.4D98619652Q69713K926063J619187J172561R11026R69467J215172K68631K95372
$$ 498619652 499489365 502415428 504034615 505207176 506118202 507087669 508302841 508571472 508866844
1137E08866844p03468J715698J217804J204300J338387m12522J3695q25882n5542j533623
$$ 508866844 508163376 509879074 511096878 512301178 513639565 513227043 513240738 512414856 512359314 510825691
1146.7E10825691o20613k32925r37767K79426r56154M52881o81114j49040K05345M33464
$$ 510825691 510205078 509972153 509034386 509313812 508357658 508810539 508129425 507980385 508185730 508619194
1156.3E08619194K163544N91430J550522N25475R24835J995201K200966K159157K304840
$$ 508619194 510782738 511374168 512924690 513450165 514375000 516370201 518571167 520730324 523035164
1165E23035164L789673J761589K645798L141326L719101L835488K526893L670159L088417
$$ 523035164 526824837 528586426 531232224 534373550 538092651 541928139 544455032 548125191 551213608
1173.7E51213608L650894K716331K434998K962685K520523K977447K331772K329903
$$ 551213608 554864502 557580833 560015831 562978516 565499039 568476486 570808258 573138161
1181.4E73138161J474609K093544K235718J658096J537323M36669R58938O05126O15005
$$ 573138161 574612770 576706314 578942032 580600128 582137451 582574120 583533058 584138184 584753189
1190.1E84753189O49605J391106J603508J200981K314567J750908K303352J956101
$$ 584753189 585402794 586793900 588397408 589598389 591912956 593663864 595967216 597923317
1197.8E97923317J722183K073479J794319K716446K270355K049103J716423J949425
$$ 597923317 599645500 601718979 603513298 606229744 608500099 610549202 612265625 614215050
1205.5F14215050J782646J194076K092324J956672J829834J440354J296692J233940
$$ 614215050 615997696 617191772 619284096 621240768 623070602 624510956 625807648 627041588
1213.2F27041588N58204M50364P23266R26705K78320L44620N75218P08923N91011K27013
$$ 627041588 627599792 628050156 628773422 629700127 629978447 630323067 630898285 631607208 632198219 632425232
1222.9F32425232P73849O12679K28157K09274M45099r0294k48909M61846L9253k05689
$$ 632425232 633199081 633811760 634039917 634249191 634694290 634603996 634355087 634816933 634856186 634650497
1232.5F34650497k37464N83534J064071N90134N43060O95382N04341m60205l20511
$$ 634650497 634413033 634996567 636060638 636650772 637193832 637889214 638393555 637933350 637612839
1241.2F37612839j52474J02806M01650j77460k41165J30348J202851P19451N6153L48587
$$ 637612839 637460365 637563171 637964821 637787361 637546196 637676544 638879395 639598846 639654999 640003586
1250.8F40003586K70538K66495J3580K39563k95563m22973R5062r0179k22931R0484
$$ 640003586 640274124 640540619 640554199 640793762 640498199 640075226 640170288 640080109 639857178 639947662
1260.5F39947662P25327L59421L56064N48248J282959R84726o8131K96936n1346M18244
$$ 639947662 640672989 641032410 641388474 641936722 643219681 644204407 644136276 644433212 644381866 644800110
1270.1F44800110M27170M84161P24106J56784J141357J666718J776199J135941Q87069
$$ 644800110 645227280 645711441 646435547 646592331 647733688 649400406 651176605 652312546 653199615
1278.8F53199615J152039Q40912Q49991L80859R27429J049118P39594R52606Q83713
$$ 653199615 654351654 655192566 656042557 656423416 657350845 658399963 659139557 660092163 660975876
1287.5F60975876J642837J808854J297149J147461J333542J183319J028595J068039
$$ 660975876 662618713 664427567 665724716 666872177 668205719 669389038 670417633 671485672
1295.2F71485672O67114M69208N18646R09195J334686J444626J004792M78820Q09021
$$ 671485672 672152786 672621994 673140640 674049835 675384521 676829147 677833939 678312759 679121780
1303.9F79121780J030579Q54263M52576K48032M71344N04226N24063K77405l586J05591
$$ 679121780 680152359 681006622 681459198 681707230 682178574 682682800 683206863 683484268 683480682 683586273
1313.5F83586273P88498J034851L23181N66330P23954L2348L83759Q79745N56870K4490
$$ 683586273 684374771 685409622 685732803 686299133 687023087 687055435 687439194 688318939 688875809 688900299
1323.2F88900299k1210L63236O50101N55267M40597L83606M19922L94593K45895N50842
$$ 688900299 688879089 689242325 689892426 690447693 690888290 691271896 691691818 692086411 692332306 692883148
1332.8F92883148R6665p4692K21176l21732p0419l72620q56781o74591K32087J249466
$$ 692883148 692979813 692905121 693126297 692804565 692734146 692361526 691504745 690830154 691062241 692311707
1342.4F92311707N09338r6207L03040L30581K2355k86332q30841r68933l42941m13132
$$ 692311707 692821045 692724838 693027878 693358459 693380814 693094482 692263641 691294708 690951767 690538635
1352.1F90538635l6697J05514n39703m62036L69491K72675q2931O43386l51028p46002
$$ 690538635 690501938 690607452 690067749 689605713 689975204 690247879 690164948 690808334 690457306 689711304
1361.7F89711304q44345k310563M25339K74582o73370k04010j026840r65805K49328
$$ 689711304 688866959 686556396 686981735 687256317 686582947 686378937 685352097 684386292 684635620
1370.4F84635620J27258J42518j99509k136612j446762L34015M55246n18723q99277
$$ 684635620 684762878 684905396 684705887 682569275 681122513 681456528 681911774 681393051 680493774
1379.1F80493774p46154m15802K17819p14340l25623N32227J490936J445312j233902
$$ 680493774 679747620 679331818 679549637 678835297 678509674 679041901 680532837 681978149 680744247
1387.8F80744247J092606J425629K64587J64566K46811Q50372j453628j762695J358184
$$ 680744247 681836853 683262482 683527069 683691635 683938446 684788818 683335190 681572495 682930679
1396.4F82930679J307526L30887k352219k65732J044846n19333n95398j06735k262268
$$ 682930679 684238205 684569092 682216873 681951141 682995987 682476654 681881256 681774521 679512253
1405.1F79512253r75266J210480J85700k29340k49100j10550J35803O3401M9286p13425
$$ 679512253 678536987 679747467 679933167 679703827 679454727 679344177 679479980 679543381 679592667 678879242
1414.8F78879242n31998n95321K11410N42450n551758M23889L209229J891174J49308
$$ 678879242 678347244 677751923 677963333 678505783 672954025 673377914 676587143 678478317 678627625
1423.4F78627625j866761O63376J215668j60065M69208J83487j577072m51126J220779
$$ 678627625 676760864 677424240 678639908 678479843 678949051 679132538 677555466 677104340 678325119
1432.1F78325119J069946L76664J889419J413879n367202P27081L145676J252365M09698
$$ 678325119 679395065 679771729 681661148 683075027 677707825 678434906 681580582 682832947 683242645
1440.8F83242645J05591l13263K79846K08283L63617J291733J08871k057800J350784
$$ 683242645 683348236 683034973 683314819 683523102 683886719 685178452 685287323 683229523 684580307
1449.5F84580307K413483K93579n51224M07791J453705J729431j01242n150299k507782
$$ 684580307 686993790 687287369 686736145 687143936 688597641 690327072 690225830 685075531 682567749
1458.2F82567749K643585K437287L057403J540833J120147K238923k792893o28509
$$ 682567749 685211334 687648621 690706024 692246857 693367004 695605927 692813034 692184525
1465.9F92184525K476806R80988J28097N86624K621918J323929k480392j000824M190292
$$ 692184525 694661331 695642319 695770416 696357040 698978958 700302887 697822495 696821671 701011963
1474.6G01011963M531784q59833M02222K445831J125641R76410m91104o2714J726685
$$ 701011963 705543747 704683914 705086136 707531967 708657608 709634018 709142914 709080200 710806885
1483.2G10806885J396866O94198J232910l57437o13937K522964j826248l057709J688919
$$ 710806885 712203751 712897949 714130859 713773422 713159485 715682449 713856201 710798492 712487411
1491.9G12487411J456605J77917O52237L10135o325150K310639k61078l148041K232742
$$ 712487411 713944016 714121933 714774170 715084305 708759155 711069794 710808716 707660675 709893417
1500.6G09893417J63651k92206M12369J964569J478577r706955q080368Q55865K435837
$$ 709893417 710057068 709764862 710177231 712141800 713620377 703913422 695833054 696688919 699124756
1509.3F99124756k136K484817p46994l120117J483231j71052n31158l900146m309006
$$ 699124756 699122620 701607437 700860443 697740326 699223557 699052505 698521347 694621201 690312195
1518F90312195M683914M300232k879868q137588k61002K823716K264480l518906J77079
$$ 690312195 694996109 699296341 696416473 688278885 688017883 690841599 693106079 689587173 689764252
1526.6F89764252J220321k060928K42386Q87985n3940m47159k566070o314011J974182
$$ 689764252 690984573 688923645 689166031 690054016 690000076 689552917 686986847 680672836 682647018
1535.3F82647018J973954J554107L367768m115296j2131958L519211K747116K00119
$$ 682647018 684620972 686175079 689542847 685427551 673295593 676814804 679561920 679762039
1543F79762039J918869j034317l308868K987900J249771J444168N7144l174820K207031
$$ 679762039 681680908 680646591 677337723 680325623 681575394 683019562 683076706 679901886 682108917
1551.7F82108917K387238J713791l799286K60391M682388K846604m741135j6309662
$$ 682108917 684496155 686209946 682410660 682671051 687353439 690200043 685458908 669149246
1559.4F69149246O116791P965469L955994J728592O89926j568375J18561K261963J828690
$$ 669149246 675266037 683231506 687187500 688916092 689606018 688037643 688156204 690418167 692246857
1568.1F92246857O89468p203827J086350K218322K76795P94372J301270J002731q675537
$$ 692246857 692936325 685732498 686818848 689037170 689313965 690108337 691409607 692412338 683736801
1576.8F83736801J349716J867295Q3084P7896j117401n44968j317978j154022j685638
$$ 683736801 685086517 686953812 687036896 687114792 685997391 685452423 684134445 682980423 681294785
1585.5F81294785j178132o89773j426773n35736j736298o98471j525345j260299j102372
$$ 681294785 680116653 679426880 678000107 677464371 675728073 675029602 673504257 672243958 671141586
1594.1F71141586k052231p00683k179947j349640j836929j309128j603622j909562
$$ 671141586 669089355 668388672 666208725 664859085 663022156 661713028 660109406 658199844
1601.9F58199844j239471k589569n44586j346360j490860k275314j218338j518478
$$ 658199844 656960373 654370804 653826218 652479858 650988998 648713684 647495346 645976868
1609.6F45976868l061524n25131k159348j092453j626014N69992k54402j1520806K600823
$$ 645976868 642915344 642390213 640230865 639138412 637512398 638082390 637827988 626307182 628908005
1618.2F28908005O2599m40254j665802k0829r84497p101821R09385J62697P71027l478470
$$ 628908005 628970604 628530350 626864548 626843719 625859222 618757401 619666786 619829483 620600510 617122040
1627.9F17122040k645455M19732j082459m41360j101838J571579J408043p724914k738381
$$ 617122040 614476585 614896317 613813858 613372498 612270660 613842239 615250282 607525368 604786987
1636.6F04786987J305428K07825R50241R25903j409378N07927o03714J506271K503166
$$ 604786987 606092415 606300240 607250481 608176384 606767006 607274933 606671219 608177490 610680656
1645.3F10680656l049583j496849k442131K850304J957931K805214M038963m216804
$$ 610680656 607631073 606134224 603692093 606542397 608500328 611305542 615344505 611127701
1653F11127701j2053986N108490N980797K096252J148682J089592J389084J767616
$$ 611127701 599073715 604182205 610163002 612259254 613407936 614497528 615886612 617654228
1660.7F17654228J982155J38817k676773L341369K128945J114693K175865J685638
$$ 617654228 619636383 619775200 617098427 620439796 622568741 623683434 625859299 627544937
1668.4F27544937k846031k20680M357109R71031L449097M010849j287957k628975L393593
$$ 627544937 624698906 624478226 628835335 629806366 633255463 637266312 635978355 633349380 636742973
1677.1F36742973L940697K036057J366119o93359L557281N138855l386764o647873
$$ 636742973 640683670 642719727 644085846 643392487 646949768 652088623 648701859 642053986
1684.8F42053986M902649P083587L423462N36194K126388O30646K278290K251587K451096
$$ 642053986 646956635 654040222 657463684 657999878 660126266 660756912 663035202 665286789 667737885
1693.5F67737885M042205L555298n663147K235871O530151O179810k016449q257752
$$ 667737885 671780090 675335388 669672241 671908112 678438263 684618073 682601624 674343872
1701.2F74343872Q975983N893249K524567P20749J579742L82767K020416M159241J671143
$$ 674343872 683319855 689213104 691737671 692458420 694038162 694420929 696441345 700600586 702271729
1709.9G02271729O01501K388382K487106K872849n20325p21741M111710O44150q993607
$$ 702271729 702873230 705261612 707748718 710621567 710101242 709379501 713491211 714135361 705141754
1718.5G05141754M508286M783477K129288J199875k19650K39639J840363J336364R83353
$$ 705141754 709650040 714433517 716562805 717762680 717543030 717782669 719623032 720959396 721942749
1727.2G21942749J051941J580810k117614j053238L974457L464050l917847j1196136
$$ 721942749 722994690 724575500 722457886 721404648 725379105 728843155 724925308 713729172
1734.9G13729172O491623N032425J325531K481002j464843k893067M220200K639541
$$ 713729172 720220795 725253220 726578751 729059753 727594910 724701843 728922043 731561584
1742.7G31561584k269744o26526K795181J832047J231689O0654l22037M019394r48944
$$ 731561584 729291840 728665314 731460495 733292542 734524231 734584885 734262848 738282242 737333298
1751.3G37333298k250824M349594K361679K096329K213821k943802N27039K259903
$$ 737333298 735082474 739432068 741793747 743890076 746103897 743160095 743687134 745947037
1759G45947037J941604K494812m235077q87756L545609J476059R73892J916656O91529
$$ 745947037 747888641 750383453 746148376 745260620 748806229 750282288 751256180 753172836 753864365
1767.7G53864365m495469J998673M120254j083755n682220j909485M910583J916275
$$ 753864365 749368896 751367569 755487823 754404068 748721848 746812363 751722946 753639221
1775.4G53639221j108780K050095J100006J396179k27356k502289R19037J542282Q36716
$$ 753639221 752530441 754580536 755680542 757076721 756849365 754347076 755266113 756808395 757645111
1784.1G57645111j548920q23135J813126N75485L70102J632232K98996m10766m017639
$$ 757645111 756096191 755273056 757086182 757661667 758031769 759664001 759962997 759552231 755534592
1792.8G55534592n69382M061050N35965j829757J160278K104797j028213k254715J747513
$$ 755534592 754965210 759026260 759562225 757732468 758892746 760997543 759969330 757714615 759462128
1801.5G59462128j27869J76773J554566J04370M20608Q4076o92749P01294P11212j801834
$$ 759462128 759334259 759511032 761065598 761169968 761590576 761674652 760981903 761683197 762394409 760592575
1811.1G60592575k98233P55081M10691O55670K9831N12771l81546l4103P54852m8904
$$ 760592575 760294342 761049423 761460114 762115784 762145615 762658386 762276840 762242737 762997589 762948685
1820.8G62948685M11911o56433Q06655J086121m071197Q2702K830963K154541n21469
$$ 762948685 763360596 762704163 763510818 764596939 760525742 760608444 763439407 765593948 765072479
1829.4G65072479n822372J773071L131104O0501m3030j25961K01797l75824q53653
$$ 765072479 759250107 761023178 764154282 764214783 764171753 764045792 764247589 763871765 763018112
1838.1G63018112N86777K518N68466L00979J166306k6093o306686K516708L155518
$$ 763018112 763604889 763607407 764175873 764476852 765643158 765617065 759310379 761827087 764982605
1846.8G64982605m94080j057968N87082Q45871k594K12784j78680Q2702j16424k72751
$$ 764982605 764488525 763430557 764017639 764863510 764860916 765073700 764895020 764977722 764861298 764588547
1856.4G64588547M72030J22223K2126r1172M6082l24707K1133K34070K01874M88510
$$ 764588547 765060577 765182800 765204926 765113754 765159836 764835129 764856262 765090332 765292206 765780716
1866.1G65780716m24042L18909j915894k154159J812362J570054M47998k58789l06
$$ 765780716 765356674 765675583 763759689 761605530 763417892 764987946 765435944 765177155 765176849
1874.8G65176849j24054J42594J16043j55487J6098n41916J65558L70025M47464j25122
$$ 765176849 765052795 765195389 765311432 765155945 765172043 764630127 764795685 765165710 765613174 765488052
1884.4G65488052o79931L26004J87530R45282n30853k939453Q25882J277389j47552
$$ 765488052 764808121 765134125 765321655 766266937 765736084 762796631 763622513 764899902 764752350
1893.1G64752350K13699o46972r78775P44781N21240J87531J04446m9286l204l15323
$$ 764752350 764966049 764319077 763340302 764085083 764606323 764793854 764898300 764849014 764845810 764530487
1902.7G64530487n875l34091k81219L56979J4496l10974J51749n04227k91443R57184
$$ 764530487 764524612 764190521 763909302 764266281 764280777 763969803 764121552 763617325 763325882 764283066
1912.4G64283066l23258L6850J18485N5618J227951k836075j493377J569290R26132
$$ 764283066 763959808 763996658 764115143 764170761 765398712 762562637 761069260 762638550 763564682
1921.1G63564682Q18710j794128j335678R60464O69861R0027n7526J23673J78299m6921
$$ 763564682 764383392 762589264 761253586 762214050 762883911 762973938 762916412 763040085 763218384 763171463
1930.7G63171463n14069l92608m31595o7139J52817J10931J61820k14768K01188L83606
$$ 763171463 762657394 762264786 761833191 761766052 761918869 762029800 762191620 761976852 762178040 762561646
1940.3G62561646J109085o93741l207703P94754R21097p08160j73264L89328J24283
$$ 762561646 763670731 762976990 759769287 760564041 761485138 760776978 760603714 760993042 761117325
1949G61117325l94898L19519K50931l46451k22396j28937Q0719j8540l37677n57556
$$ 761117325 760722427 761041946 761292877 760946426 760724030 760595093 760675812 760657272 760319595 759762039
1958.7G59762039l11737J25656K08512M1504j11847N2948O00051J66169j181412m84390
$$ 759762039 759450302 759575958 759784470 759825974 759714127 759767075 760367126 760533295 759351883 758867493
1968.3G58867493M69055R994k38571j43280k34222j24054M7912p0800N1269k7542j04141
$$ 758867493 759336548 759346542 759107971 758964691 758730469 758606415 758654327 758583527 758634796 758607254 758503113
1978.9G58503113j7472p3623K18735j31989p25861n97152l33176k5101q6517p36084
$$ 758503113 758485641 758412018 758630753 758498764 757772903 757175751 756842575 756817474 756730957 755994873
1988.6G55994873j42899J609955O04935j967697m26788P22961j64490n46341l35159
$$ 755994873 755851974 757461929 758066864 756099167 755672379 756395340 756230850 755684509 755349350
1997.2G55349350Q011j28327k64358n4703R384m1198k40326j068K16217j32218o6986
$$ 755349350 755357361 755229034 754964676 754909973 754919357 754878159 754637833 754636765 754852982 754720764 754653778
2007.8G54653778P4768l27988m57229k27738m17709l41721M58909N57556p02439j032867
$$ 754653778 754728546 754400558 753943329 753715591 753297882 752956161 753415070 753972626 753270187 752237320
2017.5G52237320K36816J79673J04522M14734n10483q64410l49503j13296J3504J44272
$$ 752237320 752474136 752653809 752758331 753173065 752662582 751798172 751448669 751335373 751348877 751493149
2027.1G51493149j4191k78549j2741L91083K13241l03497n13764m81643m48456o79855
$$ 751493149 751478958 751200409 751187668 751578751 751791992 751488495 750974731 750493088 750044632 749364777
2036.8G49364777m41895Q4381M0817J16578k36283o7062L26614J26190J91422k85645
$$ 749364777 748922882 749007263 749048080 749164658 748928375 748861313 749187927 749314117 749505539 749219894
2046.4G49219894k63748k02560l54233k79999m79583n2948l6164l4561k76794j67695
$$ 749219894 748956146 748753586 748399353 748119354 747639771 747586823 747550659 747516098 747239304 747071609
2056.1G47071609N17884r9030m0512O638m29917o43921q17489M8904P859p83997k25067
$$ 747071609 747589493 747490463 747449951 747456589 747026672 746382751 745565262 745614166 745622025 744838028 744612961
2066.7G44612961L94974p2709j60064K99377J1902j66702l47977n27496n20478m77829
$$ 744612961 745007935 744935226 744775162 745074539 745086441 744919739 744571762 744044266 743523788 743045959
2076.3G43045959m3487j39084n05218L433L65600q9416k4719J21688j96914j26343
$$ 743045959 743002472 742863388 742358170 742361603 742727203 742637787 742613068 742734756 742537842 742411499
2086G42411499j00708k27661k97928l74222m30298l23791p324L61099L60107L9139
$$ 742411499 742310791 742083130 741785202 741410980 740980682 740656891 740649567 741010666 741370773 741409912
2095.6G41409912P9041P4615l2425q7051j07727J6403r1248j50375j24817r5291j00937
$$ 741409912 741488953 741563568 741531143 741444092 741336365 741352768 741261520 741111145 740986328 740891037 740790100
2106.2G40790100r9869m9972J75628K93656j4877J17263K2736j83029r1477j85318
$$ 740790100 740690231 740640259 740815887 741109543 741094666 741211929 741234665 741051636 740960159 740774841
2115.9G40774841j16272k85492R92K35596j09482k14157j44501J43814P248j1902k0370
$$ 740774841 740658569 740373077 740374069 740609665 740500183 740286026 740141525 740285339 740292587 740280685 740260315
2126.5G40260315l55911k34833l82843m65393m4556J98441K88620L27911O7139j67999
$$ 740260315 739904404 739669571 739286728 738821335 738776779 738975220 739263840 739591751 739658890 739490891
2136.1G39490891o1722j4496j79062m47388k74200J12915L1662j9455o5460l69568
$$ 739490891 739429169 739414673 739235611 738788223 738514023 738626938 738658600 738639145 738573685 738204117
2145.8G38204117m273N01480K24228J70823Q5983l08151j33820J62125j10779k67868
$$ 738204117 738199844 738701324 738925552 739096375 739182358 738874207 738740387 738902512 738791733 738523865
2155.4G38523865j76163k39868K84195K50320k03628l052R1782M57992L4104m43802
$$ 738523865 738347702 738107834 738392029 738642349 738438721 738435669 738527451 738985443 739019547 738575745
2165G38575745j49460m81110m16870L128K35672L37525o2409l80402L2502J18026l14712
$$ 738575745 738426285 737945175 737528305 737531433 737767105 738104630 738042221 737661819 737694321 737812347 737497635
2175.6G37497635n8823J37329j8234k66495j1367L34320m38538n96390J62735M61121
$$ 737497635 737438812 737576141 737557907 737291412 737280045 737614365 737175827 736579437 736742172 737203293
2185.3G37203293K32925K7848R3536K26974K5864l60718o3247J06277k79541k69699
$$ 737203293 737436218 737464066 737557602 737784576 737810440 737449722 737386475 737492752 737213211 736943512
2194.9G36943512K07062J32293J3199L24936M654J47934K42691j93863l10669k68249
$$ 736943512 737150574 737282867 737296066 737621002 737625656 737773590 738016281 737822418 737511749 737243500
2204.6G37243500J08032k36359k80761L54080M04434J53503j98745l15628p8812K66418
$$ 737243500 737351532 737115173 736834412 737188492 737592926 737746429 737547684 737232056 737153244 737419662
2214.2G37419662j98745m90570j21613p9498o7902o3934K4032M0970L93601K21405
$$ 737419662 737220917 736730347 736608734 736529236 736461334 736397400 736421432 736462402 736856003 737077408
2223.9G37077408n3940J86615l42941m53110m40674j31988O8740j53198K61688q3236
$$ 737077408 737023468 737210083 736867142 736414032 735973358 735841370 735910110 735756912 736018600 735935364
2233.5G35935364k31095j8768q9188L7842J94779L204m93469j40076J20392j18332
$$ 735935364 735704269 735685501 735596313 735634155 735828934 735832138 735338669 735198593 735318985 735200653
2243.2G35200653l08304n8136J69602r3994J39389n8747l80783j19858J39847L8452
$$ 735200653 734892349 734834213 735003815 734909821 735049210 734990463 734609680 734489822 734629669 734668121
2252.8G34668121j90200k49787j44882K23618j81809j94244O5231l7308J52588r7046
$$ 734668121 734477921 734228134 734083252 734306870 734125061 733930817 733996048 733958740 734111328 734014282
2262.4G34014282k5711j34201q7280o333l32107m1351m0970j56555j18790J44119K95487
$$ 734014282 733988571 733854370 733767090 733760757 733428650 733387299 733346329 733189774 733070984 733215103 733510590
2273G33510590J81808j69525k97012Q8577p7362j67923m04892m1886L1128j80358L18374
$$ 733510590 733692398 733522873 733225861 733314438 733237076 733069153 732664261 732622375 732653503 732473145 732791519
2283.7G32791519k54745P1716k9678l07694L66593q4763j93558m55093l34778o638
$$ 732791519 732536774 732608490 732578812 732271118 732637711 732552948 732359390 731904297 731569519 731562881
2293.3G31562881K89536J03989o23474j84708k8305N09491k4185m87748J21155k87857
$$ 731562881 731852417 731956406 731332932 731148224 731119919 731629410 731605225 731117477 731238632 730950775
2302.9G30950775J2970j35574k64435n39551k21329J27411o92749k1438k73285J82342
$$ 730950775 730963745 730828171 730563736 730024185 729802856 729930267 729237518 729216080 728942795 729125137
2312.6G29125137M32206k75040J48010n43671k65579k70157n98678l14408k30789j96457
$$ 729125137 729557343 729282303 729430313 728886642 728621063 728350906 727752228 727437820 727207031 727010574
2322.2G27010574o01120L00293N49851m8523j217804p20139R69010j12915q20008k95181
$$ 727010574 726409454 726709747 727259598 727211075 725993271 725273132 726242142 726129227 725309219 725014038
2331.9G25014038l4332o29578K72217O47812M2724Q87833j70822q66776p83462K24228
$$ 725014038 724979706 724350128 724622345 725270157 725312881 726200714 726029892 725163116 724379654 724603882
2341.5G24603882N14145j203385n77926J56707j60827k3728K032013K566529M03061
$$ 724603882 725118027 723914642 723336716 723493423 723332596 723308868 725340881 727907410 728310471
2350.2G28310471r64432m60968m33884j014938o05088o67648j053314k33154j84250
$$ 728310471 727346039 726885071 726451187 725436249 724831161 724163513 723110199 722877045 722692795
2358.9G22692795R55658L18527r22470k77252l98178m25721J37177J362152N48401
$$ 722692795 723648453 723966980 723044510 722767258 722369080 721943359 722080536 723442688 723991089
2367.6G23991089n93796k37961J23444O42090M63638N08270P71942N88837M3259j44577
$$ 723991089 723397293 723159332 723282776 723924866 724388504 724896774 725668716 726257553 726300812 726156235
2377.2G26156235M68750K66876N3253L34854J5412K86178N25666k09275M8523O13480
$$ 726156235 726624985 726891861 726945114 727279968 727295380 727581558 728107224 727897949 727946472 728559952
2386.8G28559952R1476n3787R7046m7760j64566l44238r4071K16751m5547l66059k83203
$$ 728559952 728651428 728597641 728694687 728646927 728482361 728138123 728044052 728260803 728215256 727849197 727565994
2397.4G27565994O0578k2736j64642K64587M27399k51541p62787k84805R8571l0899
$$ 727565994 727626572 727603836 727439194 727703781 728131180 727879639 727116852 726832047 726930618 726899719
2407.1G26899719q3465l4638J10550j72577k21252J72806k30332l79867p7L2044L6621
$$ 726899719 726816254 726781616 726892166 726719589 726498337 726671143 726440811 726060944 726060867 726092911 726129532
2417.7G26129532k24991k34451P6370j82037m01917l67203k01263J58768K67868K01950
$$ 726129532 725904541 725670090 725746460 725564423 725162506 724795303 724594040 724752808 725020676 725222626
2427.3G25222626K8763p4921j47171m23660m34342j13449K8381l33938k75498K48185
$$ 725222626 725251389 725176468 725029297 724605637 724171295 724057846 724086227 723752289 723476791 723724976
2437G23724976R9258p2861L0976l7842l30506m54406N2795K29340l30506o40106j87149
$$ 723724976 723824234 723751373 723782349 723744507 723414001 722959595 723012390 723241730 722911224 722271118 722083969
2447.6G22083969J78986j69525l76053j56861N1041J77612J7319l12500k76794k50473
$$ 722083969 722262955 722093430 721717377 721560516 721611557 721789169 721806488 721493988 721217194 720966721
2457.2G20966721m08097j53579K54974K03781m5853k3651k98385l89557J55411J09329
$$ 720966721 720558624 720405045 720660019 720863800 720817947 720794296 720495911 720106354 720261765 720371094
2466.9G20371094q011p1793m61349k04010r8114l77197j83640j39999K1743O4927m28772
$$ 720371094 720363083 720291290 719829941 719625931 719527817 719150620 718966980 718826981 718848724 718913651 718484879
2477.5G18484879j43433R3689j21307N3100p5455n48629p17545j01700J0224j99433
$$ 718484879 718341446 718435135 718313828 718366928 718291473 717742844 717025299 716923599 716933823 716734390
2487.1G16734390K15531K1286j2436O2179P1183Q3313m43879m93469n77164m08401
$$ 716734390 716949921 716971207 716958771 717020950 717092133 717175446 716731567 716238098 715660934 715252533
2496.8G15252533j98364k25678J78147Q544K55204M64401j87225n26200o26068k54593
$$ 715252533 715054169 714828491 715006638 715015182 715270386 715734787 715547562 715021362 714395294 714140701
2506.4G14140701O8894j11923l52936k21482m2038j75094J15280J60217N9891N4779
$$ 714140701 714209595 714097672 713744736 713523254 713481216 713306122 713421402 713581619 713641510 713696289
2516.1G13696289l06778P019J7014o19431n10406l05786k54670k18582L3188M82788
$$ 713696289 713389511 713396530 713413544 712794113 712283707 711977921 711723251 711504669 711537857 712020645
2525.7G12020645M9057k57034Q3008o1722l13187l42102j9913L4790m61273j71814
$$ 712020645 712069702 711812668 711895676 711833954 711520767 711178665 711158752 711193542 710732269 710560455
2535.4G10560455M9057m48837l41873J72195L72391J41754j30691k43149k78015m7379
$$ 710560455 710609512 710160675 709818802 709990997 710363388 710505142 710374451 710131302 709853287 709805908
2545G09805908p4463k50854l53165m63638j01624P3548j7624Q0490n9357k07443q7662
$$ 709805908 709731445 709480591 709127426 708663788 708562164 708635712 708618088 708698578 708639221 708431778 708344116
2555.6G08344116q2779k90222l21960j78757L2120k02179n98068k10419K46582L45840
$$ 708344116 708261337 707971115 707649155 707470398 707502518 707300339 706702271 706491852 706738434 707084274
2565.2G07084274j11236m37012P2174K89078p4158n15976k66189j42975k73896o103
$$ 707084274 706973038 706536026 706608200 706897278 706823120 706307144 706040955 705897980 705624084 705617981
2574.9G05617981k97699o7902K40250j09482j34048j97144p4844r4528k92588m47540
$$ 705617981 705320282 705252380 705492630 705383148 705249100 705051956 704977112 704882584 704589996 704142456
2584.5G04142456m95071j66703n4245l662K5482P8965p706j71814m1885l15094n07279
$$ 704142456 703647385 703480682 703426437 703422775 703448257 703527222 703519516 703347702 703305817 702990723 702483444
2595.1G02483444k48718j93481n49164n90821M5166K26059j91345m16946K5863Q3466
$$ 702483444 702234726 702041245 701492081 700901260 700946426 701172485 700981140 700564194 700590057 700673523
2604.8G00673523m94690m7379L00751j38321k31628j12534k6474l33099n00412l67050
$$ 700673523 700178833 700131454 700432205 700293884 700062256 699949722 699923248 699590149 699089737 698722687
2614.4F98722687k77252R0332q4000l79028k20414k62680r7198J9073k42920k65731
$$ 698722687 698445435 698535767 698451767 698072739 697852325 697589645 697492447 697511520 697268600 697002869
2624.1F97002869j52817m26483m08860J2436j18103k12326j46866j23367m577J3580
$$ 697002869 696850052 696423569 696014709 696027145 695909042 695696716 695549850 695426483 695421906 695435486
2633.7F95435486j87912o62842j83868R8495n37338m26712l86582j06811J48315j73492
$$ 695435486 695247574 694584732 694400864 694499359 693962021 693535309 693148727 693041916 693190231 693016739
2643.4F93016739l9902k15607k03704j21918l00064R613k70538n57023m85763n65491
$$ 693016739 692976837 692761230 692557526 692435608 692135544 692145157 691874619 691317596 690831833 690266342
2653F90266342j32751l0289j80359R7885J65634p1029l37525j98593l3035j64795l46680
$$ 690266342 690133591 690103302 689922943 690020828 690186462 690115433 689777908 689579315 689546280 689381485 689034805
2663.6F89034805n55572l91693l92228k42385M02679K36740j46866J03531K32926k49100
$$ 689034805 688479233 688087540 687695312 687452927 687855606 688092346 687945480 688049011 688281937 688032837
2673.3F88032837o48270o38962o92596m02679R6969L30124O1646m94767m10843q6669
$$ 688032837 687384567 686745605 686053009 685650330 685747299 686077423 686139069 685644302 685233459 685146790
2682.9F85146790M3029N7831j58386m55322q03299n40467J4573m3717r8648k70233
$$ 685146790 685189819 685247650 685089264 684633942 683830643 683290176 683304749 683261032 683162384 682892151
2692.5F82892151m10156j60370o9123K31171K80380j53274l34702l00369l15170o44684
$$ 682892151 682481995 682321625 682252502 682483673 682764053 682610779 682276077 681975708 681660538 681015854
2702.2F81015854n16968k7542m9515j98593j01242l5706k60391k06833k2812K11869
$$ 681015854 680498886 680471344 680421829 680223236 680121994 680086288 679825897 679619064 679596252 679808121
2711.8F79808121P4615p46918n84335m4021j90964m85611n09110k08511k17285n0736
$$ 679808121 679882736 679135818 678551483 678507462 678316498 677830887 677321777 677113266 676895981 676845245
2721.5F76845245K58484J04599K6093j01166n30853n10483m08173m20150r9793l27911
$$ 676845245 677103729 677208328 677234421 677133255 676602402 676091919 675683746 675263596 675163803 674835892
2731.1F74835892r8801Q1558m39224J87302L04870j94244k35214n38102o64978m49905
$$ 674835892 674737091 674818649 674379425 674566727 674871597 674677353 674442139 673904037 673239059 672789154
2740.8F72789154j81885k4948J09940m31061m07562K94265j33972M1962K57339m69284
$$ 672789154 672607269 672582321 672692261 672261200 671853638 672147903 672013931 672055893 672313232 671843948
2750.4F71843948m99038l13721m99802l64074k02713l74604k54516l10364l27683n0735
$$ 671843948 671344910 671031189 670531387 670167313 669964600 669589996 669335480 669025116 668697433 668646698
2760F68646698L25394L94134m39529l78266j47247m81720l16086l37143k80838k95868
$$ 668646698 668972092 669366226 668926697 668548431 668401184 667919464 667603378 667266235 666985397 666689529
2769.7F66689529k82745k32849k19803j6556q0719n5771k43759k48489k71607q39233
$$ 666689529 666406784 666173935 665954132 665937576 665856857 665801086 665557327 665308838 665037231 664197998
2779.3F64197998p90710m18549l09753k59018q774p2174l68424j1596K85339J6251
$$ 664197998 663407288 662988739 662678986 662419968 662411194 662339020 661970596 661959000 662244339 662260590
2789F62260590n44358o51855j13220j01090n65185p42493n01251j25275k52151l14484
$$ 662260590 661716232 661064377 660951157 660850067 660284882 659542389 659041138 658915863 658663712 658349228
2798.6F58349228j82877l79867k33078l66516o76422n23224n21851k80228k42233j76163
$$ 658349228 658166351 657786484 657553406 657186890 656510468 655987244 655465393 655185165 654942932 654766769
2808.3F54766769K08435l25088r27658o39191k68020j83487k40326m43802k62146j92642
$$ 654766769 654975204 654650116 653722458 653083267 652815247 652631760 652391434 651947632 651685486 651492844
2817.9F51492844m91486l68500o50329o73981j6098k92206p05414l34396j10550k43607
$$ 651492844 651001358 650632858 649982529 649308548 649292450 649000244 648294830 647960434 647849884 647606277
2827.6F47606277l75518m44260n35889o83899o22940p13043m58679m5242o35758q23746
$$ 647606277 647230759 646786499 646250610 645566711 644943771 644230728 643772049 643726807 643091049 642267303
2837.2F42267303p30285o23322l75442q50182q31184q86345j337662j319923j287728
$$ 642267303 641537018 640913696 640538254 639688072 638856888 637970543 636632881 635312958 634025230
2845.9F34025230j131095j044198j214675j326905j106529q85773m72145n74760j081314
$$ 634025230 632894135 631849937 630635262 629308357 628201828 627316055 626843910 626269150 625187836
2854.6F25187836q3962L45612l22342k01607p8926l71666l67737n2261L2730j70784
$$ 625187836 625103874 625449486 625127144 624925537 624846611 624474945 624107208 624054947 624087677 623916893
2864.2F23916893n66673m76799k35749k25029n59501j194077o11305l07999p18803
$$ 623916893 623350220 622873421 622637672 622412643 621853142 620659065 620047760 619739761 619020958
2872.9F19020958o49147n91660j65023j58959k95601k8991j93444m56428p17507p81860
$$ 619020958 618371811 617780151 617615128 617456169 617160568 617131577 616938133 616481705 615764198 614982338
2882.5F14982338j40152J01280m85267n38407n96657q40263n64117k63367m20570q26035
$$ 614982338 614842186 614943466 614458199 613919792 613323135 612482872 611918755 611655388 611234818 610408783
2892.2F10408783m54598l33633p82700p18841n01785l23716l86085m96292n65415m45900
$$ 610408783 609954185 609620552 608837852 608119011 607617226 607293510 606907425 606411133 605845718 605399818
2901.8F05399818m29077j88217K33307o10542r56917l58353k44865m19655p03392l49236
$$ 605399818 604970741 604782524 605015831 604405289 603448372 603090019 602845154 602425499 601722107 601372871
2911.4F01372871j8806o84319r31854o38962q99696p00226m88128o49643n03617p87849
$$ 601372871 601354065 600669746 599737892 599098930 598199234 597499008 597010880 596361237 595857620 595069771
2921.1E95069771o05354p5722j84059p63169k55470N62325k64245l6315K63633m6234
$$ 595069771 594464417 594388695 594204636 593441467 593185997 593748322 593484077 593447762 593711395 593665161
2930.7E93665161N70450J99623l97072Q5259L52325j70059q431M36364M57916L46641
$$ 593665161 594235611 594435234 594038162 594123421 594475746 594305687 594297256 594733620 595191536 595538177
2940.4E95538177O0311O23245L25356l80516l2425k06261p7629K9335k20146k3766
$$ 595538177 595598488 596221733 596547089 596166573 596134148 595927887 595850258 595879593 595659447 595635681
2950E95635681l58887n15174Q9149l6850o55060l23219M69513M8752q45146m40789
$$ 595635681 595276794 594761620 594850769 594813919 594158859 593835640 594305153 594353905 593508759 593067970
2959.7E93067970j09939k47155j45950p7515K54517K77939M75197O46095J73225K68898
$$ 593067970 592958031 592710876 592564926 592487411 592741928 593019867 593495064 594141159 594314384 594583282
2969.3E94583282M89960K66152J38435J86653M72260Q50639O32324J54991J65215O58531
$$ 594583282 595073242 595339394 595477829 595664482 596136742 596987381 597619705 597774696 597939911 598598442
2979E98598442R10034M24042O7101j09978K41356P54585M83932L73612J00555o1187
$$ 598598442 599508476 599932518 599999619 599889641 600130997 600885582 601369514 601743126 601843681 601782494
2988.6F01782494L73916N24597M22402L1891k81144Q7014L95889J35117k64740m29230
$$ 601782494 602156410 602681007 603103409 603135300 602854156 602941170 603337059 603472176 603207436 602778206
2998.2F02778206K58598M89617l35122m05044m6654P2136n8060r3650j41602k69508
$$ 602778206 603036804 603526421 603191299 602786255 602739601 602811737 602753677 602660027 602518425 602248917
3007.9F02248917J01242J831k36283j49345j91879k89994m40101l51982q2016J0414
$$ 602248917 602350159 602351990 602115707 601966362 601774483 601484489 601044388 600692406 600610390 600620804
3017.5F00620804m02489l95393k52190p24640n17349Q9798Q3504m33846p72476n96199
$$ 600620804 600218315 599822922 599570732 598846092 598328743 598418541 598502045 598068199 597295723 596699524
3027.2E96699524r5711J00670r3765k22206o06842l42789J0033l91694m77333l15208
$$ 596699524 596603813 596704483 596610718 596388512 595781670 595438881 595448914 595057220 594579887 594264679
3036.8E94264679k14348l24211n90286n51873j96342k92244m84543k28081m28428p07932
$$ 594264679 594050331 593726120 593135834 592583961 592387619 592095375 591610832 591382751 590954323 590246391
3046.5E90246391l42064k66113r08241m08936J99585n05142p93877o75468j44463k3117
$$ 590246391 589904327 589638214 588729973 588321037 588520622 588015480 587221603 586546135 586401672 586378555
3056.1E86378555m62341l37791m86336o18515k19574J60713l10135p26814q33626o13098
$$ 586378555 585916214 585578423 585092087 584473572 584253998 584414711 584104576 583377762 582544136 581931038
3065.7E81931038K5253n88646p19223l42102n60684l25737M997J00861n55420n09644
$$ 581931038 581956291 581367645 580648422 580306320 579745636 579419899 579424896 579525757 578970337 578460693
3075.4E78460693O1531m37545n28908k25716m62570n13458p7820k30255r80568r78737
$$ 578460693 578522224 578084679 577555771 577330055 576867485 576354027 576276207 576045952 575065384 574086647
3085E74086647O4087K90260l57017j92185l28140r43298r83734k93580K04506j36413
$$ 574086647 574150734 574440994 574083977 573891792 573563652 572620354 571636620 571343040 571547546 571411133
3094.7E71411133q53577j137237N9013K64053o69288n51720n11017o80885n07279j83219
$$ 571411133 570557556 569420319 569479332 569743385 569074097 568522377 568011360 567330475 566823196 566639977
3104.3E66639977k11525n38826m34227J4915j89590q89054q12683m12331r536J8883
$$ 566639977 566428452 565889626 565455399 565470314 565280724 564391670 563578987 563166656 563157120 563176003
3114E63176003k80114m32396n23033m89807j126327j082535M3640Q5525p90367q66775
$$ 563176003 562895889 562463493 561940460 561450653 560324326 559241791 559285431 559370956 558580589 557713814
3123.6E57713814l29590n61981m97551o1264l82462p09648p41577n19333k43034o47927
$$ 557713814 557384224 556822243 556324692 556263428 555880966 555171318 554429741 553910408 553667374 553019447
3133.3E53019447p46498k28538m49982n74303n00946m70276l88107l86543j60599o63643
$$ 553019447 552272949 552044411 551594429 551020126 550519180 550048904 549660797 549274254 549113655 548450012
3142.9E48450012p31087m22058p07016q89053n81932q7547p20177l72810R4490o36635
$$ 548450012 547718925 547296867 546589851 545700798 545118866 545031319 544311142 543938332 544032822 543396187
3152.5E43396187o98242j137543p72591r3689n64270p29446m48303m08402n63469m96521
$$ 543396187 542697945 541560402 540787811 540694122 540129852 539400406 538952103 538543701 537980232 537483711
3162.2E37483711l62243m25225p98034k39067k03438q58345n76172r30824m76342K4300
$$ 537483711 537121468 536696243 535898209 535659142 535455704 534597359 534021187 533090363 532614021 532638321
3171.8E32638321l24936o23093j161995o38961l65982o27976o33774n33447m34113
$$ 532638321 532313385 531690292 530528297 529889336 529523354 528895378 528261604 527728157 527294044
3180.5E27294044m57916l48205j59073j95961j018028p05452r8992l98521m54064p42073
$$ 527294044 526836128 526487923 526328850 526132889 525114861 524409409 524310417 523911896 523457832 522715759
3190.1E22715759p54394n29633j16653o21491j210785m81491j69143n77546q85810
$$ 522715759 521961365 521431732 521315079 520693588 519482803 519001312 518832169 518254623 517368813
3198.8E17368813j53733j41296n43633n40237q40378n96580n43328k15912k96096m89960
$$ 517368813 517215080 517073784 516530151 515989914 515149536 514552956 514009628 513793716 513497620 513007660
3208.5E13007660n05333o76689J20659m6311q06389j015091k75726j54877p22618N4474
$$ 513007660 512502327 511825638 511946297 511899986 511093597 510078506 509802780 509647903 508925285 508979759
3218.1E08979759l43933j011925n18417n72205o57692o1264j38549q42743k66075q7395
$$ 508979759 508635826 507623901 507105484 506533279 505875587 505814323 505675774 504833031 504566956 504479561
3227.8E04479561n68085o89735n76973l95584l27797l1395o94351j010666n21164n13306
$$ 504479561 503911476 503221741 502644768 502249184 501921387 501889992 501195641 500184975 499663811 499150505
3237.4D99150505k25792j27296o05240n46112k53334l4828K06794r61799q45185J44883
$$ 499150505 498924713 498797417 498192177 497646065 497392731 497357903 497564697 496602898 495757713 495902596
3247D95902596m81987l20702n53398o66008l41187n57594l70865k99454P935k03705
$$ 495902596 495420609 495099907 494546509 493880501 493539314 492981720 492610855 492311401 492319336 492115631
3256.7D92115631n28870n19866n02663m30336l93601j88369o72531m92898O0959k51197
$$ 492115631 491586761 491066895 490564232 490133896 489740295 489551926 488879395 488386497 488447456 488196259
3266.3D88196259m66347k94724j84478m48914n25017k42729l8528r53560p18422J50909
$$ 488196259 487729912 487435188 487250710 486801796 486276779 486034050 485995522 485041962 484323540 484474449
3276D84474449n99289k63443o3820k25219Q545m70009q14019p36618m66995m86832
$$ 484474449 483875160 483611717 483547897 483322678 483331223 482861214 482047195 481310577 480843582 480356750
3285.6D80356750l3874j56593q35648l9177O70662k4605p19108m95224l44010k37617
$$ 480356750 480322876 480166283 479330635 479291458 479962120 479937515 479218407 478723183 478379173 478141556
3295.3D78141556p89490r50775r5825j91307k88811k94266j80588l39355p27577n58434
$$ 478141556 477352066 476401291 476305466 476114159 475825348 475531082 475350494 475011139 474283562 473725128
3304.9D73725128k67334M21715n4207r95750r55048p82242l72238J0796m51165n71556
$$ 473725128 473457794 473879509 473825302 472829552 471874504 471092262 470720024 470730820 470279655 469708099
3314.6D69708099R1477l56064n56564m02298l40958l52325q98476k92664O1493j07231
$$ 469708099 469799576 469443512 468886948 468484650 468143692 467791367 466892891 466600227 466661720 466554489
3324.2D66554489n72281p38258l65906p61604l05367j39274n07584q44383n79415J10398
$$ 466554489 465982208 465243950 464878044 464116440 463811073 463671799 463164215 462319832 461740417 461850815
3333.8D61850815l36418m33312o59141n63927l34396l04108j81847p24182n77354n83763
$$ 461850815 461514397 461081085 460421944 459858017 459523621 459219513 459037666 458313484 457736130 457152367
3343.5D57152367k68135m07181j316071m47120N11665K51274n91316q77915m54177
$$ 457152367 456884232 456477051 455160980 454713860 455225525 455476799 454885483 454007568 453553391
3352.2D53553391R3612r1209o80123o50024q92258l05557J55487p77588p63054k62108
$$ 453553391 453647003 453555794 452875671 452225647 451333389 451027832 451183319 450405731 449642677 449380569
3361.8D49380569n17463m04892k96440n98069m34570k2125O1912o88591n59310l15094
$$ 449380569 448863106 448458214 448161774 447563705 447129135 447107010 447168922 446480331 445921021 445605927
3371.4D45605927q31223k26975m34532o09817j38703j83067n25703q15621J24893j17645
$$ 445605927 444774704 444547729 444113197 443503380 443364677 443181610 442655907 441840286 441965179 441847534
3381.1D41847534o39076k73171j87912j10702n55496l2845J0300l31535J42173k52990
$$ 441847534 441208458 440935287 440747375 440636673 440081177 440048332 440058632 439727097 439869270 439616280
3390.7D39616280n77851r29641p21283M31709L53508m21143n41572l44734k43454k22702
$$ 439616280 439038429 438108788 437387505 437819214 438172722 437751579 437210007 436865273 436621819 436399117
3400.4D36399117j92490j95618m04930p47490p18612k47498l09563n0544K48489m4327
$$ 436399117 436206627 436011009 435606079 434858589 434139977 433892479 433582916 433532372 433780861 433736534
3410D33736534M08859R2125o14395m94118l81355l64838k56462J64795L32527K11831
$$ 433736534 434145393 434237518 433623123 433129005 432747650 432382812 432126350 432291145 432623672 432835503
3419.7D32835503j73531n98717n65109o5765k46353n03731K94685J62735J65711J69029
$$ 432835503 432661972 432063255 431498146 431432381 431186028 430682297 430976982 431139717 431305428 431474457
3429.3D31474457m99802o45523k10724L49236j25771J04332J34888L8528M83132j89400
$$ 431474457 430974655 430329132 430118408 430467644 430341873 430446205 430581093 430619621 431102753 430913353
3439D30913353k50168J97334K85340o15502m50058Q1406O35948J275292j367569o51093
$$ 430913353 430663185 430860519 431145859 430530357 430080299 430161705 430797653 432072945 430705376 430054283
3448.6D30054283Q31604O3515L68614J46675j4496m77943j13220N96161N55954K9640
$$ 430054283 430885887 430949402 431318016 431464691 431450195 430972252 430859032 431455193 432011147 432040787
3458.2D32040787j89514N78651K15263J73073k89955p3814M77142O5575J99279k50206
$$ 432040787 431851273 432429924 432645187 432818260 432528305 432454491 432931633 432997208 433196487 432946281
3467.9D32946281Q29659J126900M26712j4420n36270M40979L53928L013j16081K32887
$$ 432946281 433775940 434902840 435329552 435315132 434778862 435219841 435573769 435576782 435460701 435693588
3477.5D35693588R71108N64728j91155j06392M78172k72216K85949L41225P4577R14803
$$ 435693588 436664696 437229424 437038269 436931877 437410049 437137833 437423782 437765007 437839584 438754387
3487.2D38754387K03247p8888K79312P19528L55645K26287L67279k42424n0964l70483
$$ 438754387 438957634 438878746 439158058 439877586 440233231 440459518 440826797 440584373 440533409 440162926
3496.8D40162926K09579Q69560R93729R41658P76100N07698j110878l96003N37796
$$ 440162926 440372505 441242065 442235794 443177452 443953552 444461250 443350372 442954369 443492165
3505.5D43492165L69415M95415J014862L4485j146508J215744J067734K35748L21541
$$ 443492165 443861580 444356995 445371857 445406342 444259834 445475578 446543312 446779060 447100601
3514.2D47100601K31552N84793j39274J10512N19638O04972N42946J074410Q31337
$$ 447100601 447332153 447916946 447777672 447888184 448407822 449012794 449555740 450630150 451461487
3522.9D51461487q41332l7079K57187M64363L84484K01683L66783Q20541Q77762j19095
$$ 451461487 450620155 450583076 450840263 451304626 451689110 451890793 452257576 453078117 453955879 453836784
3532.5D53836784N72892N83419J256752K8077j274682J440506Q75359N62248O51779
$$ 453836784 454409676 454993095 456249847 456277924 455003242 456443748 457319107 457881355 458533134
3541.2D58533134N06592K30370L82347J063118l48587N08766j133308m8676J787377
$$ 458533134 459039726 459270096 459652443 460715561 460366974 460875740 459742432 459693756 461481133
3549.9D61481133J778945J819954j820297J3085O13708N08385J329689l14026J359558
$$ 461481133 463260078 465080032 463259735 463272820 463886528 464394913 465724602 465410576 466770134
3558.5D66770134J435242N42946j07995J319619J026611k98920L345261j225319j933060
$$ 466770134 468205376 468748322 468640327 469959946 470986557 470687637 474032898 472807579 470874519
3567.2D70874519N3215j748504L073463J445275P17926J205673P50122K69890K48794
$$ 470874519 470927734 469179230 472252693 473697968 474415894 475621567 476371689 476641579 476890373
3575.9D76890373J023598k17400J856346J254998l35083J182632J489182P20825m01039
$$ 476890373 477913971 477696571 479552917 480807915 480472832 481655464 483144646 483865471 483464432
3584.6D83464432L547897J371384m129067k12707j677513L010330L296547K038688
$$ 483464432 487012329 488383713 484254646 484041939 482364426 485374756 488671303 490709991
3592.3D90709991L9139n77125L273430k081566O69403K758522n92880K622032L73115
$$ 490709991 490749130 490172005 493445435 491363869 492033272 494791794 494198914 496820946 497194061
3601D97194061r25827Q28018N97496J521073L159714K705383j706085J931266k231979
$$ 497194061 496268234 497096252 497693748 499214821 502374535 505079918 503373833 505305099 503073120
3609.6E03073120j298866P606468M61235l706016L492507j187591K879944L906898
$$ 503073120 501774254 509380722 509841957 506135941 509628448 508440857 511320801 515227699
3617.4E15227699j629181l94287j139335J123962L238144K222023J619377J401787
$$ 515227699 513598518 513204231 512064896 513188858 516427002 518649025 520268402 521670189
3625.1E21670189R79080K088432O581078j965408j3645859N011024N238228N320397
$$ 521670189 522649269 524737701 531318779 529353371 515707512 520718536 525956764 531277161
3632.8E31277161P92274k468185K436180K617378J329308p0458J323280J984597J832084
$$ 531277161 532069435 529601250 532037430 534654808 535984116 535913658 537236938 539221535 541053619
3641.5E41053619J298981J26877J769295L447303M986229m832534m867211Q139229
$$ 541053619 542352600 542479477 544248772 547696075 552682304 547849770 542982559 551121788
3649.2E51121788k072105o030846O96602O509132M644127L697701L994140j0007782
$$ 551121788 549049683 543018837 543715439 550224571 554868698 558566399 562560539 552552757
3656.9E52552757J329842N670204J284447Q21533M84886J840401L71437J046600J552048
$$ 552552757 553882599 559552803 560837250 561658783 562143669 563984070 564355507 565402107 566954155
3665.6E66954155N16777L901291J418953k488518k55318n458603L196869Q582573P942086
$$ 566954155 567470932 571372223 572791176 570302658 570047340 564588737 567785606 576368179 584310265
3674.3E84310265l586274j9807968M225350Q762703M858932k919807p04918K643013
$$ 584310265 580723991 560916023 565141373 573904076 578763008 575843201 575138283 577781296
3682E77781296J755256J311951L44086k03057L235779O475258r068565o386032P547569
$$ 577781296 579536552 580848503 581192589 580989532 584225311 590700569 581632004 575245972 582793541
3690.6E82793541o019478j50871N795898K30294J537246L14789j610794N97420N94940
$$ 582793541 576774063 576623192 582419090 582649384 584186630 584501419 582890625 583488045 584082985
3699.3E84082985K326202K088929o318703k279129N387497J667518m6310J197586K960434
$$ 584082985 586409187 588498116 582179413 579900284 585287781 586955299 586908989 588106575 591067009
3708E91067009M260635q110466K315750L369446j4609604M577713M421082Q25310O37970
$$ 591067009 595327644 587217178 589532928 592902374 578292770 582870483 587291565 588116875 588754845
3716.7E88754845K074394J724777l817673O20499N810356l202286m475441M697686
$$ 588754845 590829239 592554016 588736343 589356842 595167198 591964912 587489471 592187157
3724.4E92187157J08413p00760l181381o04362M399490J119156N610924k434998q611030
$$ 592187157 592295570 591594810 588413429 587809067 592208557 593327713 598938637 596503639 587892609
3733.1E87892609R360427R14193j2824745n84031L475647J29814K724534M198875l500862
$$ 587892609 597253036 598167229 585342484 584758453 588234100 588363914 591088448 595287323 591786461
3741.8E91786461L690834J2389297j2350502j9946823J1727295P850342N458107m923859
$$ 591786461 595477295 607866592 595516090 575569267 587296562 595146904 600605011 595681152
3749.5E95681152r413147J1613732p713394q544083O079330N193749L598823n640907
$$ 595681152 586268005 597881737 590168343 581624260 587703590 592897339 596496162 590855255
3757.2E90855255K292023N774536r276199k470208N295906K038651k53792L586922
$$ 590855255 593147278 598921814 589645615 587175407 592471313 594509964 594256172 597843094
3764.9E97843094k458916n358276L365555N365600p30133j1283874J744766L349151
$$ 597843094 595384178 590025902 593391457 598757057 598026924 586743050 588487816 591836967
3772.6E91836967K03629R08051R9678J063766L26881K677956o50482q686485K732315
$$ 591836967 592040596 592948647 593048325 594112091 594438972 597116928 596466446 587779961 590512276
3781.3E90512276K969169J016045R62143m431992r48410J784096J294098J063003o58836
$$ 590512276 593481445 594497490 595459633 591027641 590079231 591863327 593157425 594220428 593561592
3790E93561592k95334k24647P86781O0120P02247L297730m798928n222625K535782
$$ 593561592 593266258 593041611 593828392 593888512 594590759 597888489 593089561 587866936 590402718
3798.7E90402718N218963P426148p182770j2576943L356705L959084N153274L838959
$$ 590402718 595621681 603047829 595865059 583288116 586644821 590603905 595757179 599596138
3806.4E99596138j1946907l875618O142769K003326m73823P58552O94199K124977N933304
$$ 599596138 587649231 583773613 589916382 591919708 591445885 592204437 592898636 595023613 600956917
3815.1F00956917l417893j6891784N841789P041130N183296K634125k1061707J054726
$$ 600956917 597539024 580647240 586489029 593530159 598713455 601347580 580285873 581340599
3822.8E81340599P227364K766227K173310n36652n009689L84674K632446M104118J381798
$$ 581340599 588567963 591334190 593507500 592970848 587961159 588345833 590978279 595082397 596464195
3831.4E96464195j0360183K992515P680054o710510p80373Q615303q142052m449157
$$ 596464195 586104012 589096527 596776581 590066071 589285698 597901001 589758949 585309792
3839.2E85309792O745529p303963J142349P806893l421707n047417K410660K118148
$$ 585309792 592055321 584751358 585893707 593700600 590278893 585231476 587642136 589760284
3846.9E89760284J008568J950455j405373L079758P923775q766861j993180j6710701
$$ 589760284 590768852 592719307 591313934 594393692 602317467 593550606 591557426 574846725
3854.6E74846725K034111J1467095j238251j636505K894058K405854J740608o627045
$$ 574846725 576880836 588347931 587109680 585473175 588367233 590773087 592513695 585886650
3862.3E85886650L93524P907524o501960o013832M553222N102081N202828j0870857
$$ 585886650 586280174 594187698 587685738 581671906 586225128 591327209 596530037 585659180
3870E85659180r069176O022758P646752L698616j1751900M75578M249497M05731K316857
$$ 585659180 576590004 582612762 590259514 593958130 582206230 582681808 586931305 587337036 589653893
3878.7E89653893L516960o996575o451530P087860J383705J251640M588890j4106178
$$ 589653893 593170853 586174278 579722748 586810608 588194313 589445953 594034843 579928665
3886.4E79928665P67479M512405J946221N189819k144203j1080780J832962L981705
$$ 579928665 580696144 585208549 587154770 592344589 590200386 579119606 580952568 584934273
3894.1E84934273p57828J662483J355591K806053J348763j1034470N380859K154885
$$ 584934273 584176445 585838928 587194519 590000572 591349335 580314865 585695724 587850609
3901.8E87850609o187096M649735l421555j416435N44128O02532K523269l27606j45836
$$ 587850609 581663513 586313248 582891693 581475258 582019386 582621918 585145187 584817581 584671745
3910.5E84671745n38177j81885q6937k17972K650032K226639m780121l862533M954452
$$ 584671745 584133568 583951683 583864746 583646774 586296806 588523445 583743324 579880791 584835243
3919.2E84835243J36338m745179K407608J913796J396980k112389l272323K163086
$$ 584835243 584971581 580226402 582634010 584547806 585944786 583832397 580560074 582723160
3926.9E82723160J315803M44680j816101k94953K203293l398361j289101J850319k68440
$$ 582723160 584038963 584483643 582667542 582372589 584575882 581177521 579888420 581738739 581470299
3935.6E81470299Q3542P14683k51541n2948k40021J229821J197090m898339p96814
$$ 581470299 581553841 582268524 582016983 581964035 581724014 582953835 584150925 579252586 578455772
3944.3E78455772K075158J288337J227036l141632J8615Q28858j384812J844674J6708
$$ 578455772 580530930 581819267 583046303 579904671 579923286 580752144 579367332 581212006 581228714
3953E81228714j036873K7542L08724j18409r51690N26542K61269N71709J45530j704330
$$ 581228714 580191841 580219383 580528107 580409698 579458008 579984550 580245819 580817528 580963058 579258728
3962.6E79258728K56805M35143m23241j35307q3542Q92525o26679j031570J332588
$$ 579258728 579515533 579950676 579527435 579392128 579308586 580201111 579574432 578542862 579875450
3971.3E79875450j69830j232872j22414L80440M99268k55814k15912p3814M806k46353
$$ 579875450 579705620 578472748 578350334 578730774 579230042 578974228 578758316 578684502 578689308 578442955
3980.9E78442955P8583M14696m22860l79448l17344O00052K89116p04537K96974l11012
$$ 578442955 578521538 578936234 578513374 578133926 577816582 578416634 578705750 578001213 578298187 577987175
3990.6E77987175j060104J14593R90982O6147p70531K70729Q50525n20439p25822Q11844
$$ 577987175 576927071 577041664 578032646 578098793 577328262 577598991 578449516 577929077 577203255 578015099
4000.2E78015099
$$ 578015099
##END=$$ End of the data block
