##TITLE=$$ Begin of the data block
##JCAMP-DX=5.00 $$ ACD/SpecManager v 10.08
##SPECTROMETER/DATA SYSTEM=Varian
##DATE=18 Dec 2012 10:29:30
##DATA TYPE=INFRARED SPECTRUM
##DATA CLASS=XYDATA
##ORIGIN=
##OWNER=
##NPOINTS=3735
##FIRSTX=399.26403809
##LASTX=4000.35498047
##MAXX=4000.35498047
##MINX=399.26403809
##MAXY=76.82341003
##MINY=42.91872406
##XFACTOR=1.0000000000
##YFACTOR=0.000000100000000
##FIRSTY=68.45654297
##DELTAX=0.96440572
##XUNITS=1/CM
##YUNITS=TRANSMITTANCE
##XYDATA=(X++(Y..Y))
$$ plain form
399.3 684565430 701722336 695141830 690761795 688841248 683055954 674429779 670849075 680258331
407 680258331 688818359 693823090 696122284 694863129 682080231 671600189 673293457 677389450
414.7 677389450 679809799 676465225 675657272 665812073 654206848 671723175 679477921 679172821
422.4 679172821 674167252 680221329 683434143 683583221 683852844 679569702 679839249 680609055 682081299
431.1 682081299 682022400 682313919 683576584 684603577 686041260 682800903 682566452 678825684 677127838
439.8 677127838 679915161 676366501 675583344 680585251 682831268 678005371 673205261 671205750 672088699
448.4 672088699 674455109 674879456 676474991 675808182 674060898 669006348 665461884 667062759 665815735
457.1 665815735 668724289 670946426 671617355 675770874 677679214 673605423 670022507 672328568 674644775
$$ packed form
399.3F84565430J7156906o580506m380035j920547n785294q626175l580704R409256
407F80258331Q560028N004731K299194j259155j2782898j0480042J693268M095993
414.7F77389450K420349l344574q07953r845199j1605225J7516327P754746l05100
422.4F79172821n005569O054077L212814J49078K69623m283142K69547P69806J472244
431.1F82081299n8899K91519J262665J026993J437683l240357k34451l740768j697846
439.8F77127838K787323l548660p83157N001907K246017m825897m800110j999511Q82949
448.4F72088699K366410M24347J595535o66809j747284n054550l544464J600875j247024
457.1F65815735K908554K222137O70929M153519J908340m073791l582916K306061K316207
$$ plain form
465.8 674644775 673029327 672794800 675410080 671592712 670601959 672167435 663275604 661409378 666437683
474.5 666437683 669629288 668802948 670048523 671361008 669722137 669797211 670478516 674007797 672218857
483.2 672218857 667748184 668465042 670862045 674834518 676054382 674599609 671434479 675248260 677749176
491.8 677749176 673143311 671789322 671072388 672184067 669212036 667544937 669557114 669595337 670976791
500.5 670976791 672361603 676647491 676635513 674066391 670713806 664770584 664847107 669275818 668614655
509.2 668614655 665631332 666581879 667067184 668252335 671350174 669829483 666770782 666082001 665585785
517.9 665585785 662582779 662316360 663383102 661550980 660337143 661137543 661851883 659828720 660174408
526.6 660174408 662273560 663898163 665414963 664304886 663285065 661097412 659190216 659418030 659367447
$$ packed form
465.8F74644775j615448k34527K615280l817368r90753J565476q891831j866226N028305
474.5F66437683L191605q26340J245575J312485j638871P5074O81305L529281j788940
483.2F72218857m470673P16858K397003L972473J219864j454773l165130L813781K500916
491.8F77749176m605865j353989p16934J111679k972031j667099K012177L8223J381454
500.5F70976791J384812M285888j1978k569122l352585n943222P6523M428711o61163
509.2F68614655k983323R50547M85305J185151L097839j520691l058701o88781m96216
517.9F65585785l003006k66419J066742j832122j213837Q00400P14340k023163L45688
526.6F60174408K099152J624603J516800j110077j019821k187653j907196K27814n0583
$$ plain form
535.2 659367447 659937592 661620026 662621002 661445770 661273575 662478714 662876968 662632446 661791382
543.9 661791382 659749832 658547211 659220428 659041138 660713348 661724930 661820755 664340210 664931183
552.6 664931183 664210510 662920380 663105240 664613876 663618927 661584396 661647110 662541885 660889359
561.3 660889359 659587479 659843063 662244263 664286957 662990952 662822647 662904053 662862320 662250595
570 662250595 662188110 663054276 661630020 661075287 660569153 659118118 658619385 659035416 660436859 661103897
579.6 661103897 660820770 660390320 660884705 660844727 658480530 656837540 658328323 659918976 659189453
588.3 659189453 658708267 660377197 662668457 663013306 662664795 662988281 662803955 662271500 661414948
597 661414948 660742111 659878082 658544998 657103424 656739502 657145691 656341629 655063248 654484329 653546906
$$ packed form
535.2F59367447N70145J682434J000976j175232j72195J205139L98254k44522q41064
543.9F61791382k041550j202621O73217j79290J672210J011582R5825K519455N90973
552.6F64931183p20673j290130J84860J508636r94949k034531O2714Q94775j652526
561.3F60889359j301880K55584K401200K042694j296005j68305Q1406m1733o11725
570F62250595o2485Q66166j424256n54733n06134j451035m98733M16031J401443O67038
579.6F61103897k83127m30450M94385l9978k364197j642990J490783J590653p29523
588.3F59189453m81186J668930K291260L44849l48511L23486j84326n32455q56552
597F61414948o72837q64029j333084j441574l63922M06189q04062j278381n78919r37423
$$ plain form
606.6 653546906 650495529 647212753 644286499 640788879 636446915 630753593 625536880 619708443
614.3 619708443 612456703 605031815 599150429 597055092 595706139 593189659 593118439 593473320 594175453
623 594175453 597104988 600816040 605990448 613277855 620711479 627054329 634142799 639818230 643897476
631.7 643897476 648117142 650059204 649075775 647796097 646568909 644842834 643449173 642808228 643908844
640.4 643908844 646660690 650604248 655736618 660859604 665005493 667235260 669325333 672144470
648.1 672144470 675362930 676196594 674484177 673523178 674519806 675823517 674676285 674187927 676514435
656.8 676514435 678762741 679032059 678984680 679879456 680575256 681462860 681760025 681675110 681210785 681950684
666.4 681950684 682263947 671899567 676379852 681167068 683168564 685081558 685411377 685137329 685716705
$$ packed form
606.6F53546906l051377l282776k926254l497620m341964n693322n216713n828437
614.3F19708443p251740p424888n881386k095337j348953k516480p1220L54881P02133
623E94175453K929535L711052N174408P287407P433624O342850P088470N675431M079246
631.7F43897476M219666J942062r83429j279678j227188j726075j393661o40945J100616
640.4F43908844K751846L943558N132370N122986M145889K229767K090073K819137
648.1F72144470L218460Q33664j712417r60999R96628J303711j147232m88358K326508
656.8F76514435K248306K69318m7379Q94776O95800Q87604K97165q4915m64325P39899
666.4F81950684L13263j0364380M480285M787216K001496J912994L29819k74048N79376
$$ plain form
675.1 685716705 686483688 686674728 686302109 685702667 685597076 685541840 686026459 687653961 688808899 689745331
684.7 689745331 689229736 687790604 687265091 687251434 686822968 684130478 680833664 679358902 679247665
693.4 679247665 678880539 678079376 677958374 678184891 677555084 676745300 677554779 678311157 677492065 675842056
703.1 675842056 675792007 677606277 677097092 675250397 675289612 677506790 678943863 678804550 680808182
711.7 680808182 683047943 684461823 685733871 685654831 685569382 685654907 686373672 688243942 689761581
720.4 689761581 690334091 690960693 692326508 693248672 693386078 693726654 693912659 693946609 692802887 691169586
730.1 691169586 691704941 691716309 690178375 688984528 688848495 689980240 691220093 691602554 691615906
738.7 691615906 692712021 693015137 693227768 694291840 693389816 692747040 693877487 695857925 697220535
$$ packed form
675.1F85716705P66983J91040l72619n99442j05591n5236M84619J627502J154938R36432
684.7F89745331n15595j439132n25513j3657m28466k692490l296814j474762j11237
693.4F79247665l67126q01163j21002K26517o29807q09784Q09479P56378q19092j650009
703.1F75842056n0049J814270n09185j846695L9215K217178J437073j39313K003632
711.7F80808182K239761J413880J272048p9040q5449Q5525P18765J870270J517639
720.4F89761581N72510O26602J365815R22164J37406L40576J86005L3950j143722j633301
730.1F91169586N35355J1368j537934j193847j36033J131745J239853L82461J3352
738.7F91615906J096115L03116K12631J064072r02024o42776J130447J980438J362610
$$ plain form
747.4 697220535 698538895 700576477 702822723 706289520 708117294 709366074 710772095 711696548 713670959
756.1 713670959 714944916 715992279 715982742 716467285 717481079 717863159 719506683 720164108 719997101
764.8 719997101 719638367 719629059 719993134 719364090 717564087 716275406 716408234 715533371 715691910 716912766
774.4 716912766 718214951 720133362 721324081 723537827 725667496 726811676 727921066 728526077 728472748
783.1 728472748 729511948 731471481 732049103 732677002 733197021 733755493 734439163 735434494 736676178
791.8 736676178 736591034 736342087 735974731 735917664 735172806 734536057 735122757 735891571 736709747 736469879
801.4 736469879 737030487 737239227 737003708 737516327 737504196 738185730 738603668 738817444 739290771 739201508
811.1 739201508 737918854 737144165 737866898 738970032 740720291 741351929 741677017 742125015 741669922
$$ packed form
747.4F97220535J318360K037582K246246L466797J827774J248780J406021R24453J974411
756.1G13670959J273957J047363r537M84543J013794L82080J643524O57425j67007
764.8G19997101l58734r308L64075o29044j800003j288681J32828q74863J58539J220856
774.4G16912766J302185J918411J190719K213746K129669J144180J109390O05011n3329
783.1G28472748J039200J959533N77622O27899N20019N58472O83670R95331J241684
791.8G36676178q5144k48947l67356n7067p44858o36749N86700P68814Q18176k39868
801.4G36469879N60608K08740k35519N12619j2131O81534M17938K13776M73327q9263
811.1G39201508j282654p74689P22733J103134J750259O31638L25088M47998m55093
$$ plain form
819.7 741669922 740953827 740764694 740710678 740161667 740752640 740216599 738609924 737238312 735773697
828.4 735773697 734681091 733485947 732666702 730097961 727047882 724347534 721583633 719923019 717625885
837.1 717625885 715085373 712057877 709277649 708000488 706631546 704428177 702259369 700761032
844.8 700761032 699197388 698504715 699130325 699330063 699042206 700223160 701089478 701044006 703792114
853.5 703792114 707192688 710049210 712196808 712975998 714338760 715222626 717154007 720198975 722116470
862.2 722116470 723286438 724454269 725691071 726659775 727312927 727210464 727940674 728990860 729887695
870.9 729887695 730889893 731624069 732523041 732815170 733986130 735306625 735560684 735285873 734810333
879.5 734810333 733430634 730936050 729409561 727823715 726335831 724704285 723440094 722962418 721710815
$$ packed form
819.7G41669922p16095j89133n4016n49011N90973n36041j606675j371612j464615
828.4G35773697j092606j195144q19245k568741l050079k700348k763901j660614k297134
837.1G17625885k540512l027496k780228j277161j368942k203369k168808j498337
844.8G00761032j563644o92673O25610J99738k87857J180954Q66318m5472K748108
853.5G03792114L400574K856522K147598P79190J362762Q83866J931381L044968J917495
862.2G22116470J169968J167831J236802R68704O53152j02463P30210J050186Q96835
870.9G29887695J002198P34176Q98972K92129J170960J320495K54059k74811m75540
879.5G34810333j379699k494584j526489j585846j487884j631546j264191m77676j251603
$$ plain form
888.2 721710815 720895233 719612198 718746262 719184494 719313431 719018478 719147034 719321518 718973312 720350800
897.9 720350800 721400070 721740036 723061829 723400345 722545624 721215744 721076508 720457611 718869934
906.5 718869934 717938995 716293564 714137115 711988907 709633942 707499542 706445694 705566101 703174362
915.2 703174362 700284271 699197693 698123627 694872055 691681290 689498062 687869644 685976181
922.9 685976181 684383316 683091507 681202087 680353088 679607849 678774719 678358765 677551041 677400436
931.6 677400436 677536926 677835846 678343124 679600449 682220612 684605713 686481705 688702164 691791611
940.3 691791611 693894577 695540695 698819809 701563797 703190231 704756622 706518478 708805313
948 708805313 710800629 711435394 712276154 713673248 714506760 714876862 714717789 714628830 713935776 712884903
$$ packed form
888.2G21710815q15582j283035q65936M38232J28937k94953J28556J74484l48206J377488
897.9G20350800J049270L39966J321793L38516q54721j329880j39236o18897j587677
906.5G18869934r30939j645431k156449k148208k354965k134400j053848q79593k391739
915.2G03174362k890091j086578j074066l251572l190765k183228j628418j893463
922.9F85976181j592865j291809j889420q48999p45239q33130m15954q07724j50605
931.6F77400436J36490K98920N07278J257325K620163K385101J875992K220459L089447
940.3F91791611K102966J646118L279114K743988J626434J566391J761856K286835
948G08805313J995316O34765Q40760J397094Q33512L70102j59073q8959o93054j050873
$$ plain form
957.7 712884903 712076492 710796738 709195862 707717896 706090851 703560181 701470261 700345383 698816376
966.3 698816376 697174072 696601562 696085205 695057068 694010620 692479782 692293549 692548218 691232376
975 691232376 690090485 689546890 688978958 688106766 688466187 688996124 687405396 685629272 684595261
983.7 684595261 684546432 684037247 681405411 678450928 676040497 673941193 672111969 670729599 669625702
992.4 669625702 667077942 663303452 659797211 657519073 658243561 660687332 662171326 662857437 663107071
1001.1 663107071 662479401 661434250 660926514 660741653 659471359 658134842 657881012 657446899 656932373
1009.7 656932373 656118240 654632263 653169937 652193756 651410828 649371567 647236481 645472641 643854294
1018.4 643854294 642804794 640920181 639933929 639337502 637214775 634883881 633244629 632203598 630318451
$$ packed form
957.7G12884903q08411j279754j600876j477966j627045k530670k089920j124878j529007
966.3F98816376j642304n72510n16357j028137j046448j530838j86233K54669j315842
975F91232376j141891n43595n67932q72192L59421N29937j590728j776124j034011
983.7F84595261m8829n09185k631836k954483k410431k099304j829224j382370j103897
992.4F69625702k547760l774490l506241k278138P24488K443771J483994O86111K49634
1001.1F63107071o27670j045151n07736j84861j270294j336517k53830m34113n14526
1009.7F56932373q14133j485977j462326r76181p82928k039261k135086j763840j618347
1018.4F43854294j049500j884613r86252n96427k122727k330894j639252j041031j885147
$$ plain form
1027.1 630318451 628534546 627739067 626811905 624747849 622715073 621682930 620080872 619151649 619104385
1035.8 619104385 618708076 617590752 616217651 615634155 615079689 614466667 613824120 613205032 613145409
1044.5 613145409 613176575 612909737 612954750 612710953 612651596 613386192 613863297 614302025 613696251 613336639
1054.1 613336639 613403664 613016167 613269386 612835312 612166252 611568222 611845131 611845741 610486832 610147629
1063.7 610147629 609833298 609301224 608330002 607214851 606294594 605748787 605740356 604898491 604247208 603702469
1073.4 603702469 604031296 604252663 603006439 601717415 601343536 601716461 600957413 600174675 599064865
1082.1 599064865 597992592 597588844 597323380 597323189 596416817 596132240 594997444 593118134 591047592
1090.7 591047592 587975540 584982567 581698227 578497810 573721695 569514999 564771347 558942566
$$ packed form
1027.1F30318451j783905p95479r27162k064056k032776j032143j602058r29223m7264
1035.8F19104385l96309j117324j373101n83496n54466o13022o42547o19088n9623
1044.5F13145409L1166k66838M5013k43797n9357P34596M77105M38728o05774l59612
1054.1F13336639O7025l87497K53219m34074o69060n98030K76909O10j358909l39203
1063.7F10147629l14331n32074r71222j115151r20257n45807q431q41865o51283n44739
1073.4F03702469L28827K21367j246224j289024l73879L72925p59048p82738j109810
1082.1E99064865j072273m03748k65464j91r06372k84577j134796j879310k070542
1090.7E91047592l072052k992973l284340l200417m776115m206696m743652n828781
$$ plain form
1098.5 558942566 555153694 550976105 547013168 541946106 537662277 533258438 527677155 523308945
1106.2 523308945 518716316 514766846 509568329 505786858 501694603 497088623 494271088 491605759
1113.9 491605759 490564766 488407745 487534866 487384071 488080978 489081230 489127922 490196075 490835876
1122.6 490835876 492596016 492681885 493426819 495249977 497112541 499084663 499438858 501882629 503965683
1131.2 503965683 506082344 506901474 507373390 509000740 508902855 508828926 508577690 510606651 511434937
1139.9 511434937 511618462 512906532 512769051 512975998 512464218 512538338 511317291 510902100 510718727
1148.6 510718727 509235535 509398918 508622055 508547020 508042297 508213081 508742104 509476738 511281242
1157.3 511281242 511862450 513563728 514435043 515986557 517571983 518786049 520903931 522898903 525923882
$$ packed form
1098.5E58942566l788872m177589l962937n067062m283829m403839n581283m368210
1106.2E23308945m592629l949470n198517l781471m092255m605980k817535k665329
1113.9D91605759j040993k157021q72879j50795O96907J000252M6692J068153O39801
1122.6D90835876J760140Q5869P44934J823158J862564J972122L54195K443771K083054
1131.2E03965683K116661Q19130M71916J627350r7885p3929k51236K028961Q28286
1139.9E11434937J83525J288070j37481K06947n11780P4120j221047m15191j83373
1148.6E10718727j483192J63383p76863p5035n04723J70784N29023P34634J804504
1157.3E11281242N81208J701278Q71315J551514J585426J214066K117882J994972L024979
$$ plain form
1166 525923882 528123970 531702347 535220909 538244591 541639557 544913597 549024773 552460327 555987968
1174.6 555987968 558081436 560437202 563179703 565394440 568504562 571013756 573206329 574959297
1182.4 574959297 577460442 579393959 580947113 582378883 582705154 583790512 584327660 585541077 586736984
1191 586736984 587626915 588768387 589845772 592061081 593786888 595987740 598224144 600615768 602749634
1199.7 602749634 604277534 606847878 608886642 610621452 612137947 614155884 616249504 618065376
1207.4 618065376 620331459 622087059 623959160 625344620 626596260 627643623 628323898 629178009 629651337
1216.1 629651337 629803276 629269981 629694977 630865288 631800461 632416306 632915459 634161568 634736595
1224.8 634736595 634994469 635169983 635188828 634877815 634323883 634536552 634712601 635224609 635395622 635510025
$$ packed form
1166E25923882K200088L578377L518562L023682L394966L274040M111176L435554L527641
1174.6E55987968K093468K355766K742501K214737L110122K509194K192573J752968
1182.4E74959297K501145J933517J553154J431770L26271J085358N37148J213417J195907
1191E86736984Q89931J141472J077385K215309J725807K200852K236404K391624K133866
1199.7F02749634J527900K570344K038764J734810J516495K017937K093620J815872
1207.4F18065376K266083J755600J872101J385460J251640J047363O80275Q54111M73328
1216.1F29651337J51939n33295M24996J170311R35173O15845M99153J246109N75027
1224.8F34736595K57874J75514J8845l11013n53932K12669J76049N12008J71013J14403
$$ plain form
1234.4 635510025 636066170 636574364 637621384 638254509 638221474 637909927 637986832 638126640 638151398 638260155
1244.1 638260155 638114014 638323936 638816452 639674416 639841576 639879265 640385284 640644226 640973434 640670929
1253.7 640670929 640766830 640936584 640578003 640520172 640626602 640894394 641058578 641457443 641583786 641831741
1263.4 641831741 642513123 643407745 644106750 644074020 644418411 644694138 644918365 645346222 645872116 646843262
1273 646843262 647769547 648522186 649730530 651494675 652583771 653608475 654652863 655678635 656675949
1281.7 656675949 657080536 657845840 658331528 658908463 659769211 660946960 663149490 665118942 666728592
1290.4 666728592 667765808 668589859 669521561 670516357 671736069 672502365 673009949 673513336 674276428
1299 674276428 675285645 676679916 678162689 678880386 679500046 680211334 681138916 682090607 682481689
$$ packed form
1234.4F35510025N56145N08194J047020O33125l3035l11547P6905J39808K4758J08757
1244.1F38260155j46141K09922M92516Q57964J67160L7689N06019K58942L29208l02505
1253.7F40670929R5901J69754l58581n7831J06430K67792J64184L98865J26343K47955
1263.4F41831741O81382Q94622O99005l2730L44391K75727K24227M27857N25894R71146
1273F46843262R26285P52639J208344J764145J089096J024704J044388J025772R97314
1281.7F56675949M04587P65304M85688N76935Q60748J177749K202530J969452J609650
1290.4F66728592J037216Q24051R31702R94796J219712P66296N07584N03387P63092
1299F74276428J009217J394271J482773P17697O19660P11288R27582R51691L91082
$$ plain form
1307.7 682481689 682717285 682891235 683231125 683383102 683300171 683701553 684611588 685755234 686492538 687151642
1317.4 687151642 687537842 687305145 687875977 688811340 689154892 689251556 689397278 689715729 690292892 690773697
1327 690773697 691111298 691833344 692556000 692696686 692941818 693738556 694110336 694049759 693996582 693373642
1336.7 693373642 692836914 692640457 692008972 691148453 691770554 693177948 693955994 693925858 693776703 693909760
1346.3 693909760 693750381 693377457 692750092 691964340 691194992 690494385 690839844 690975037 690673676 690343399
1355.9 690343399 690471115 690969086 690966797 691441345 690590897 689409943 688751907 686726074 687376022 687648849
1365.6 687648849 687103958 687200623 686180496 685197067 685411148 685458755 685816193 685838928 683501968 681798553
1375.2 681798553 681882706 682237701 681777420 680785599 680080872 679639282 679836426 679488068 679300919 679799118
$$ packed form
1307.7F82481689K35596J73950L39890J51977q2931M01382R10035J143646P37304O59104
1317.4F87151642L86200k32697N70832R35363L43552R6664J45722L18451N77163M80805
1327F90773697L37601P22046P22656J40686K45132P96738L71780o0577n3177o22940
1336.7F93373642n36728j96457o31485q60519O22101J407394P78046l0136j49155J33057
1346.3F93909760j59379l72924o27365p85752p69348p00607L45459J35193l01361l30277
1355.9F90343399J27716M97971k289M74548q50448j180954o58036k025833O49948K72827
1365.6F87648849n44891R6665j020127r83429K14081M7607L57438K2735k336960j703415
1375.2F81798553Q4153L54995m60281r91821p04727m41590J97144l48358j87149M98199
$$ plain form
1384.9 679799118 681231384 682328720 681066589 682348480 683891678 684181671 684085846 684466248 685826263
1393.6 685826263 684718475 682733307 684027557 685580750 685978394 683462906 682873993 683724670 683220825
1402.2 683220825 682492905 682295990 680283661 679633179 680676117 680188370 679697342 679883728 680149231
1410.9 680149231 680209885 680224686 680241928 679500122 679324646 678809509 678468323 678626251 673265762 674161377
1420.6 674161377 677347031 678710785 678675079 677469635 678317032 679755325 679646912 679900055 680023346
1429.2 680023346 678172913 678062820 679187012 679546204 680192337 682509842 684037781 678853607 679610596
1437.9 679610596 682858582 683840332 683772049 683818741 683725586 684153214 684524612 684921570 685676575 685372772
1447.6 685372772 684178467 685647202 687660294 688214951 688013840 688399429 689547119 690284500 689863052
$$ packed form
1384.9F79799118J432266J097336j262131J281891J543198K89993r5825L80402J360015
1393.6F85826263j107788j985168J294250J553193L97644k515488n88913Q50677n03845
1402.2F83220825p27920j96915k012329o50482J042938m87747m91028J86386K65503
1410.9F80149231O0654J4801J7242p41806j75476n15137l41186J57928n360489Q95615
1420.6F74161377L185654J363754l5706j205444Q47397J438293j08413K53143J23291
1429.2F80023346j850433j10093J124192L59192O46133K317505J527939n184174P56989
1437.9F79610596L247986R81750o8283M6692r3155M27628L71398L96958P55005l03803
1447.6F85372772j194305J468735K013092N54657k01111L85589J147690P37381m21448
$$ plain form
1456.2 689863052 686297989 683700867 686011810 688353424 691487961 693330994 694705811 697010574
1464 697010574 693820343 692946320 695460052 696137009 696303482 697539368 700229187 700808258 698020020
1472.6 698020020 697189178 701744843 706459274 705126648 705680695 708590927 709928284 710888901 710535355
1481.3 710535355 710626068 711810379 712770996 713657837 714835510 714359131 713889160 716542130 715216751
1490 715216751 712130432 714193954 716054611 715674744 715638123 716085434 709620819 711734314 712016525
1498.7 712016525 708961716 711024857 711251526 710512466 710496826 712602615 714974136 706226044 694119873
1507.3 694119873 696195374 699665833 699787979 702453003 701511078 698606644 700512772 700372849 699785309
1516 699785309 695711517 691155472 696021347 701100159 699142990 688862991 687893753 690935364 693412933
$$ packed form
1456.2F89863052l565063k597122K310943K341614L134537J843033J374817K304763
1464F97010574l190231q74023K513732O76957J66473J235886K689819N79071k788238
1472.6F98020020q30842M555665M714431j332626N54047K910232J337357R60617l53546
1481.3G10535355R0713J184311R60617Q86841J177673m76379m69971K652970j325379
1490G15216751l086319K063522J860657l79867l6621M47311o464615K113495K82211
1498.7G12016525l054809K063141K26669p39060j5640K105789K371521q748092j2106171
1507.3F94119873K075501L470459J22146K665024r41925k904434J906128j39923n87540
1516F99785309m073792m556045M865875N078812j957169j0279999r69238L041611K477569
$$ plain form
1524.7 693412933 689927673 690363693 692091980 689847107 690175934 691340179 691082077 690207443 687360077
1533.4 687360077 681413345 683306961 685197830 687088547 690774536 687590714 677761002 680319366
1541.1 680319366 681290512 680351791 682477951 681942749 678522415 681121368 682528610 684125595 683307571
1549.8 683307571 679953308 682731857 685214386 686851196 683355179 684007721 688549728 690992661
1557.5 690992661 686775360 675282974 677861176 683435059 687322922 690027008 691356506 689931946
1565.2 689931946 690174255 692231750 693563232 693800659 686734543 688086929 690334244 690455780 691124573
1573.9 691124573 692918549 694370728 684014816 685625610 687557907 687442627 687624969 686887436 686896973
1582.6 686896973 685237579 683741150 682573242 681541901 680558701 678847427 678396530 676832123 675958557
$$ packed form
1524.7F93412933l485260M36020J728287k244873L28827J164245k58102q74634k847366
1533.4F87360077n946732J893616J890869J890717L685989l183822r829712K558364
1541.1F80319366R71146r38721K126160n35202l420334K598953J407242J596985q18024
1549.8F83307571l354263K778549K482529J636810l496017O52542M542007K442933
1557.5F90992661m217301j1492386K578202N573883L887863K704086J329498j424560
1565.2F89931946K42309K057495J331482K37427p066116J352386K247315J21536O68793
1573.9F91124573J793976J452179j0355912J610794J932297j15280J82342p37533R537
1582.6F86896973j659394j496429j167908j031341r83200j711274m50897j564407q73566
$$ plain form
1591.2 675958557 674294968 673203812 672107162 669383240 668442688 666625443 665551376 663816528
1599 663816528 662477951 660764923 658563385 657338867 654959869 654245377 652890625 651567993 649009628
1607.6 649009628 647511978 645980225 642757721 642464066 640724792 639598389 637837715 638135605 637324448
1616.3 637324448 625601120 628815994 629315643 628740501 627090378 627397766 626515198 619207268 619662437
1625 619662437 619443817 620204048 617161789 614354172 614185524 613073387 613017807 612033195 613553123
1633.7 613553123 615027161 608134575 605315781 606117630 606003304 606765747 607675095 606717606 607512474
1642.4 607512474 606787262 608064651 610226021 607731743 606764488 603563919 606458778 608745842 611987953
1651 611987953 616253281 611934776 599747086 604279594 610261803 612407379 613724022 614885330
$$ packed form
1591.2F75958557j663589j091156j096650k723922r40552j817245j074067j734848
1599F63816528j338577j713028k201538j224518k378998p14492j354752j322632k558365
1607.6F49009628j497650j531753l222504k93655j739274j126403j760674K97890q11157
1616.3F37324448j1723328L214874M99649n75142j650123L07388q82568p307930M55169
1625F19662437k18620P60231l042259k807617j68648j112137n5580r84612J519928
1633.7F13553123J474038o892586k818794Q01849j14326P62443R09348r57489P94868
1642.4F07512474p25212J277389K161370k494278r67255l200569K894859K287064L242111
1651F11987953M265328m318505j2187690M532508N982209K145576J316643J161308
$$ plain form
1658.8 614885330 615896111 617300644 619383316 620260620 617861137 620899811 622888374 624005241
1666.5 624005241 626056290 627397614 625491142 625854568 629707336 630546417 633934708 637825356 636660194
1675.1 636660194 634446793 637838287 641430359 643221588 644795761 644247284 647823486 653575058
1682.9 653575058 651072922 643337021 648270721 654762344 657900238 658814316 661146088 661862564 664527969
1691.5 664527969 667225189 669245834 672570038 675612183 669930344 673137054 680069046 686839294
1699.3 686839294 685949402 675857697 684726944 690588074 693240585 694068222 695394897 695732574 697791138
1707.9 697791138 701831589 703541565 704406586 706730576 709152756 712066574 711208649 710569839 715435257
1716.6 715435257 716150131 705495377 710357971 715293503 717442322 719075470 719161072 719458694 721198349
$$ packed form
1658.8F14885330J010781J404533K082672Q77304k399483L038674J988563J116867
1666.5F24005241K051049J341324j906472L63426L852768Q39081L388291L890648j165162
1675.1F36660194k213401L391494L592072J791229J574173n48477L576202N751572
1682.9F53575058k502136p735901M933700O491623L137894R14078K331772P16476K665405
1691.5F64527969K697220K020645L324204L042145n681839L206710O931992O770248
1699.3F86839294q89892j0091705Q869247N861130K652511Q27637J326675L37677K058564
1707.9F97791138M040451J709976Q65021K323990K422180K913818q57925o38810M865418
1716.6G15435257P14874j0654754M862594M935532K148819J633148Q5602K97622J739655
$$ plain form
1725.3 721198349 722280273 723410110 724697952 726385803 724220886 722903366 727094269 730228729
1733 730228729 723795547 713970032 721858749 727139435 728617859 731289368 729155350 725964737 730503006
1741.7 730503006 732588501 729863892 729997711 733516464 735168228 735635681 736149139 736046371 739533310
1750.4 739533310 738052979 736379852 741530304 743999176 745912476 748063507 744782410 745003204
1758.1 745003204 747128601 749136658 751901550 747903976 746970444 750580978 752044144 752923965 754706116
1766.8 754706116 755141068 750646744 752901230 757292557 756556931 750646896 748110428 753232498 755548935
1775.4 755548935 754383316 756254196 757011032 758222504 758292770 756059265 756967621 758540497 759313889
1784.1 759313889 757141876 756035004 758012848 758768692 759436569 761036606 760997162 760785446 757479782
$$ packed form
1725.3G21198349J081924J129837J287842J687851k164917j317520M190903L134460
1733G30228729o433182r825515P888717N280686J478424K671509k134018l190613M538269
1741.7G30503006K085495k724609J33819L518753J651764M67453N13458j02768L486939
1750.4G39533310j480331j673127N150452K468872J913300K151031l281097K20794
1758.1G45003204K125397K008057K764892l997574r33532L610534J463166Q79821J782151
1766.8G54706116M34952m494324K254486M391327p35626n910035k536468N122070K316437
1775.4G55548935j165619J870880P56836J211472P0266k233505R08356J572876P73392
1784.1G59313889k172013j106872J977844P55844O67877J600037l9444k11716l305664
$$ plain form
1792.8 757479782 756764145 760823593 761682587 759850769 760898590 762690887 761564636 759806213 761484375
1801.5 761484375 761003342 761238022 762918243 762777100 762911758 763043365 762731171 763739243 764160461
1810.2 764160461 761772614 761547165 762623520 763114471 763694534 763611221 764081573 763902893 764031754
1818.8 764031754 764681168 764584961 765147934 764386215 764989090 766298981 762647476 762475128 765102005
1827.5 765102005 767445831 766985626 761639175 763576355 766069717 765634918 765663376 766020584 766523895
1836.2 766523895 765838699 764743729 765428467 765734634 766417847 766597214 767855148 767873688 761507874
1844.9 761507874 764002151 766746216 766120758 765407715 765963669 766829071 766766129 766675644 766400070 766520767
1854.5 766520767 766551819 766592407 767226105 767048874 766939392 766966248 766976624 766700592 766711197 766863556
$$ packed form
1792.8G57479782p15637M059448Q58994j831818J047821J792297j126251j758423J678162
1801.5G61484375m81033K34680J680221j41143J34658J31607l12194J008072M21218
1810.2G64160461k387847k25449J076355M90951N80063q3313M70352j78680J28861
1818.8G64031754O49414r6207N62973p61719O02875J309891l651505j72348K626877
1827.5G65102005K343826m60205n346451J937180K493362m34799K8458L57208N03311
1836.2G66523895o85196j094970O84738L06167O83213J79367J257934J8540o365814
1844.9G61507874K494277K744065o25458p13043N55954Q65402o2942r0485k75574J20697
1854.5G66520767L1052M0588O33698j77231j09482K6856J0376k76032J0605J52359
$$ plain form
1864.2 766863556 766936417 767712097 767631607 767486343 765737686 763954315 765397186 766760025 767431870
1872.8 767431870 767291641 767106171 766991882 766871185 766711731 766730118 766857376 766158371 766279831 766818466
1882.5 766818466 767121429 766977310 766404495 766809921 767257690 768234100 767925110 765261841 766035080
1891.2 766035080 767062836 766761475 767186508 766414566 765364075 766024857 766199493 766358795 766647263
1899.8 766647263 766699829 766402435 765819702 765977173 765752106 765357895 765775070 766196671 766050339 765836411
1909.5 765836411 765200348 765209274 766187973 765867767 765992661 766118164 766565781 768107529 764785538 762892685
1919.1 762892685 764489212 765259552 766240616 764832993 762998810 763919449 765012589 765017548 764692612
1927.8 764692612 764697647 764784698 764703445 764654999 764675522 764047241 763834381 764009323 764075928 763985214 763580704
$$ packed form
1864.2G66863556P2861P75680q0490j45264j748657j783371J442871J362839O71845
1872.8G67431870j40229j85470j14289j20697j59454J8387J27258o99005J21460N38635
1882.5G66818466L02963j44119n72815M05426M47769R76410l08990k663269P73239
1891.2G66035080J027756l01361M25033p71942j050491O60782J74636J59302K88468
1899.8G66647263N2566k97394n82733J57471k25067l94211M17175M21601j46332k13928
1909.5G65836411o36063Q926R78699l20206J24894J25503M47617J541748l321991j892853
1919.1G62892685J596527P70340R81064j407623j834183R20639J093140M959l24936
1927.8G64692612N035Q7051q1253m8446K0523o28281k12860J74942O6605r0714m04510
$$ plain form
1938.4 763580704 763813248 764207993 765417023 764706421 761453094 762510757 763534317 762570724 762191467
1947.1 762191467 762771683 763215027 762724915 762806931 763235779 762970963 762588882 762699432 762997513 762897186
1956.7 762897186 762570648 761905518 761375351 761299591 761463089 761632919 761506729 761423874 761758804 762019577
1966.4 762019577 761211243 760705032 761247101 761338272 761198959 761197739 760915680 760681686 760702286 760802231
1976 760802231 760701752 760529404 760591431 760788727 760912094 760739212 760467300 760157013 759652557 759182205
1985.7 759182205 758947067 758848343 758217850 757904510 759053879 759321976 757577591 757459564 758289948
1994.3 758289948 758197327 758052902 758083725 757704086 757071838 757030411 757341232 757238922 757152557 757028351
2004 757028351 757032852 757216873 757008362 756742249 756610718 756244888 755746689 755781555 755791397 755251617 755069275
$$ packed form
1938.4G63580704K32544L94745J209030p10602l253327J057663J023560r63593l79257
1947.1G62191467N80216M43344m90112Q2016M28848k64816l82081J10550K98081j00327
1956.7G62897186l26538o65130n30167p5760J63498J69830j26190q2855L34930K60773
1966.4G62019577q08334n06211N42069R1171j39313j220k82059k33994K0600R9945
1976G60802231j00479j72348O2027J97296J23367j72882k71912l10287n04456m70352
1985.7G59182205k35138r8724o30493l13340J149369K68097j744385j18027Q30384
1994.3G58289948r2621j44425L0823l79639o32248m1427L10821j02310q6365j24206
2004G57028351M501J84021k08511k66113j31531l65830m98199L4866R842n39780j82342
$$ plain form
2014.6 755069275 755527191 755507965 754689636 754658356 754896545 754977646 755150604 754643936 754045563 753682861
2024.2 753682861 753539200 753432999 753145523 753107376 753278198 753574295 753591995 753419876 753199615 752760010
2033.9 752760010 752514420 752499313 752240753 751707916 751317749 751277313 751539993 751372070 751264648 751582565
2043.5 751582565 751566849 751442032 750959091 750767136 750988083 750745697 750264816 749854736 749927521 749913559
2053.2 749913559 749884338 749977570 749853821 749704437 749465332 749536743 749498291 749187851 748605118 747942047
2062.8 747942047 747909241 747591171 746854706 746769943 747241898 747491913 747654724 747584686 746931000 746798553
2072.5 746798553 746922684 746507187 745815125 745310135 745246353 745036469 744666595 744710922 744862671 744929123
2082.1 744929123 745049210 744952850 744768219 744623566 744613876 744429932 743944397 743715591 743260574 742950974
$$ packed form
2014.6G55069275M57916j9226q18329l1280K38189Q1101J72958n06668n98373l62702
2024.2G53682861j43661j06201k87476l8147J70822K96097J7700j72119k20261m39605
2033.9G52760010k45590j5107k58560n32837l90167m0436K62680j67923j07422L17917
2043.5G51582565j5716j24817m82941j91955K20947k42386m80881m10080P2785j3962
2053.2G49913559k9221R3232j23749j49384k39105P1411l8452l10440n82733o63071
2062.8G47942047l2806l18070p36465q4763M71955K50015J62811p0038o53686j32447
2072.5G46798553J24131m15497o92062n04990o3782k09884l69874M4327J51749O6452
2082.1G44929123J20087r6360j84631j44653r690j83944m85535k28806m55017l09600
$$ plain form
2091.7 742950974 743138504 743434601 743671265 743764343 744123535 744167480 743961487 743730545 743469696 743420410
2101.4 743420410 743132172 743009186 742952576 743084106 743258743 742984619 742972565 743207703 743478012 743543549
2111 743543549 743426971 743290939 743240814 743209381 742941208 742836685 742891693 742994690 742993546 743107529 743112259
2121.6 743112259 742861938 742876358 742660217 742444534 742294617 742175369 742032013 741477509 741208115 741381760
2131.3 741381760 741816330 742002945 741725845 741611252 741769714 741847687 741800308 741749725 741557693 741459274
2140.9 741459274 741323242 741192017 741224823 741304703 741091766 740626297 740760803 740865326 741088943 741370316
2150.6 741370316 741064911 741076584 741107559 740937119 740658417 740568848 740825958 741070938 741120529 740817947
2160.2 740817947 740857620 740945587 741014557 741109161 741023788 741017303 740716171 740517883 740244675 740147018 740582962
$$ packed form
2091.7G42950974J87530K96097K36664R3078L59192M3945k05993k30942k60849m9286
2101.4G43420410k88238j22986n6610J31530J74637k74124j2054K35138K70309O5537
2111G43543549j16578j36032n0125l1433k68173j04523N5008J02997j144J13983M730
2121.6G43112259k50321J4420k16141k15683j49917j19248j43356n54504k69394J73645
2131.3G41381760M34570J86615k77100j14593J58462P7973m7379n0583j92032r8419
2140.9G41459274j36032j31225L2806P9880k12937m65469J34506J04523K23617K81373
2150.6G41370316l05405J1673L0975j70440k78702q9569K57110K44980M9591l02582
2160.2G40817947L9673Q7967O8970R4604q5373o485l01132j98288k73208r7657M35944
$$ plain form
2170.8 740582962 740632782 740250244 740117874 740312958 740146027 740102921 740116730 739807129 739691544 739774628
2180.5 739774628 739840012 739315109 739007568 739279404 739613724 740099030 740126190 739975052 740029449 739981079
2190.1 739981079 740093689 740383453 740173798 739839096 739911423 739948730 740047760 740247040 740549240 740649948
2199.8 740649948 740419769 740230103 740121536 740046158 739728165 739581451 739597168 739526825 739641266 739871521
2209.4 739871521 740212326 740324326 739978485 739648285 739679794 739577713 739482117 739502869 739294662 739204330
2219 739204330 739198380 739429092 739450684 739380875 739762421 739670486 739206543 739062271 739002914 738633118 738614120
2229.7 738614120 738703537 738440628 738551865 738431244 737946930 737817917 738162918 738292236 738166656 738370819
2239.3 738370819 738283005 737861252 737638397 737559738 737164993 737241516 737794571 737654037 737591858 737817459
$$ packed form
2170.8G40582962M9820l82538j32370J95084j66931m3106J3809l09601j15585Q3084
2180.5G39774628O5384n24903l07541K71836L34320M85306K7160j51138N4397m8370
2190.1G39981079J12610K89764k09655l34702P2327L7307R9030J99280L02200J00708
2199.8G40649948k30179j89666j08567p5378l17993j46714J5717p0343J14441K30255
2209.4G39871521L40805J12000l45841l30200L1509j02081r5596K0752k08207r0332
2219G39204330n950K30712K1592o9809L81546r1935m63943j44272n9357l69796j8998
2229.7G38614120Q9417k62909J11237j20621m84314j29013L45001J29318j25580K04163
2239.3G38370819q7814m21753k22855p8659l94745P6523N53055j40534o2179K25601
$$ plain form
2248.9 737817459 737962112 737985840 737885361 737583389 737174149 736761093 736389847 736739731 736706238 736445389
2258.6 736445389 736559143 736450272 736757278 736852570 736581421 736346130 736187592 736054382 735944519 736075668
2268.2 736075668 735972443 735878983 735839539 735947342 736135483 736292725 736208267 735880966 736207504 736337891
2277.9 736337891 735887756 735297089 735295334 735525513 735318146 735353241 735156631 735425949 735575562 735183411
2287.5 735183411 735150528 735119553 735320587 735033798 734579010 734101028 734149475 734605637 734080200 733698502
2297.2 733698502 733602371 734138184 734580765 734436493 734177551 733623581 733688278 733413239 732932281 732567673
2306.8 732567673 732693787 732796402 732061920 732116852 732056885 732345963 732276535 731729431 732041168 731722870
2316.4 731722870 731584167 731051331 730705185 730853882 729976654 729331055 729406433 730032654 730299225 729947281
$$ packed form
2248.9G37817459J44653K3728j00479l01972m09240m13056l71246L49884l3493k60849
2258.6G36445389J13754j08871L07006R5292k71149k35291j58538j33210j09863J31149
2268.2G36075668j03225r3460l9444J07803J88141J57242q4458l27301L26538J30387
2277.9G36337891m50135n90667j755K30179k07367L5095j96610K69318J49613l92151
2287.5G35183411l2883l0975K01034k86789m54788m77982M8447M56162n25437l81698
2297.2G33698502r6131N35813M42581j44272k58942n53970O4697k75039m80958l64608
2306.8G32567673J26114J02615p34482N4932n9967K89078o9428n47104L11737l18298
2316.4G31722870j38703n32836l46146J48697q77228o45599P5378O26221K66571l51944
$$ plain form
2326.1 729947281 728739395 728110657 728464584 728054428 727118378 726900711 727839203 727702179 728232193
2334.8 728232193 728510132 727732773 728515778 728160324 727533340 727162018 727169495 727572784 727025757 726349792
2344.4 726349792 725647507 726422195 726808777 727849960 730366058 731304398 730460434 729822845 729778137
2353.1 729778137 728964539 727092743 726494446 726169510 725733414 725988998 725266876 725041275 726394501
2361.8 726394501 726260910 725583344 725062637 724567566 725208511 725684357 726133118 726429291 726354752 726346054
2371.4 726346054 726660004 727582626 728293457 728427353 728758621 729815521 730565948 730422745 730109024
2380.1 730109024 730051498 730045166 730148621 730608368 730919952 730986176 731054230 731195908 731439667 731570740
2389.7 731570740 731500015 731246414 731016006 730912933 731074753 731202164 730988464 730599136 730224457 730450058
$$ packed form
2326.1G29947281j207886o28738L53927m10156r36050k17667R38492j37024N30014
2334.8G28232193K77939p77359P83005l55454o26984l71322P477M03289n47027o75965
2344.4G26349792p02285P74688L86582J041183K516098R38340q43964o37589m4708
2353.1G29778137q13598j871796n98297l24936m36096K55584p22122k25601J353226
2361.8G26394501j33591o77566n20707m95071O40945M75846M48761K96173p4539q698
2371.4G26346054L13950R22622P10831J33896L31268J056900P50427j43203l13721
2380.1G30109024n7526o332J03455M59747L11584O6224O8054J41678K43759J31073
2389.7G31570740p0725k53601k30408j03073J61820J27411k13700l89328l74679K25601
$$ plain form
2399.4 730450058 730610275 730295410 730426102 730741348 730621338 730196304 729810257 729683075 729732437 729714584
2409 729714584 729917908 729861755 729288406 729299240 729531479 729655304 729646835 729237289 729058990 729051056 728931198
2419.6 728931198 728770065 728613586 728354034 727940979 727756348 727923813 728121185 728145218 728050995 727874146
2429.3 727874146 727812347 727585068 727160263 727038879 727009583 726771317 726504364 726675720 726876373 726817551
2438.9 726817551 726890182 726842575 726476669 726009140 725852737 725740585 725505676 725390244 725265274 725118256
2448.6 725118256 724805679 724421997 724327393 724837494 725114059 724825439 724888153 724788666 724279175 723646469
2458.2 723646469 723408432 723598785 723470230 723421631 723418274 723563461 723807678 723686981 723566132 723353348
2467.8 723353348 723239059 723006668 722319489 721937866 722006912 722025223 721687393 721577835 721917725 721824722
$$ packed form
2399.4G30450058J60217l14865J30692L15246j20010m25034l86047j27182M9362j7853
2409G29714584K03324n6153n73349J0834K32239J23825q469m09546j78299p934j19858
2419.6G28931198j61133j56479k59552m13055j84631J67465J97372K4033r4223j76849
2429.3G27874146o1799k27279m24805j21384k9296k38266k66953J71356K00653n8822
2438.9G26817551P2631m7607l65906m67529j56403j12152k34909j15432j24970j47018
2448.6G25118256l12577l83682r4604N10101K76565k88620O2714r9487n09491o32706
2458.2G23646469k38037J90353j28555m8599l357J45187K44217j20697j20849k12784
2467.8G23353348j14289k32391o87179l81623O9046J8311l37830j09558L39890r3003
$$ plain form
2477.5 721824722 721634369 721803589 721728668 721379166 721107712 720892029 720344391 719950867 720061951 720071487
2487.1 720071487 720095215 719974365 719822083 719845734 719802475 719907074 719882431 719720535 719285355 718808670
2496.8 718808670 718555450 717981567 717775650 718317032 718919678 718713150 718046112 717741852 717327347 717204742
2506.4 717204742 717404022 717236176 716887283 716643219 716494751 716403198 716693268 716770477 716471100 716576996
2516.1 716576996 716602631 716270294 716150360 716320724 716218338 715625610 715037079 714693604 714571838 714665070
2525.7 714665070 714844437 714777374 714436340 714433136 714668274 714652100 714663925 714667358 714412003 713896790 713379669
2536.3 713379669 713219299 713210449 713370514 713591843 713563614 713589401 713704834 713630371 713223724 712708664
2546 712708664 712395248 712161026 712059555 712044907 711975250 712142944 712232056 711966782 711681595 711632080 711780777
$$ packed form
2477.5G21824722j90353J69220p4921l49502k71454k15683n47638l93524J11084R536
2487.1G20071487K3728j20850j52282K3651m3259J04599k4643j61896m35180m76685
2496.8G18808670k53220n73883k05917N41382O02646k06528o67038l04260m14505j22605
2506.4G17204742J99280j67846l48893k44064j48468r1553K90070P7209k99377J05896
2516.1G16576996K5635l32337j19934J70364j02386n92728n88531l43475j21766R3232
2525.7G14665070J79367o7063l41034l204K35138j6174J1825L433k55355n15213n17121
2536.3G13379669j60370q850J60065K21329k8229K5787J15433p4463m06647n15060
2546G12708664l13416k34222j01471j4648o9657J67694Q9112k65274k85187m9515J48697
$$ plain form
2556.6 711780777 711461258 711113739 711101608 710747528 710322952 709989395 709772491 709663086 709851761 710188370
2566.2 710188370 710109711 710031204 710016403 710125122 709973068 709585266 709349518 708831635 708548508 708403244
2575.9 708403244 708440475 708642578 708534241 708404007 708232956 708347244 708307571 707821732 707323685 707132339
2585.5 707132339 707055740 706798630 706910477 706652985 706399918 706660233 706655197 706651535 706538849 706432724
2595.1 706432724 706191788 705743179 705087280 704629059 704751358 704579086 704633560 704575958 704178696 703999634
2604.8 703999634 703564606 703516846 703754883 703702774 703488541 703347244 703135071 702650070 702268906 702003708
2614.4 702003708 701793518 701392746 701287384 701541367 701558914 701430435 700881653 700569153 700686798 700522079
2624.1 700522079 700095749 699701004 699653931 699459763 699145050 699257889 699364166 699088058 698828735 698890991
$$ packed form
2556.6G11780777l19519l47519j2131l54080m24576l33557k16904j09405J88675L36609
2566.2G10188370p8659p8507j4801J08719j52054l87802k35748n17883k83127j45264
2575.9G08403244L7231K02103j08337j30234j71051J14288l9673m85839m98047j91346
2585.5G07132339p6599k57110J11847k57492k53067K60315n036l662j12686j06125
2595.1G06432724k40936m48609o55899m58221J22299j72272N4474n7602l97262j79062
2604.8G03999634m35028m7760K38037n2109k14233j41297k12173m85001l81164k65198
2614.4G02003708k10190m00772j05362K53983J7547j28479n48782l12500J17645j64719
2624.1G00522079m26330l94745m7073j94168l14713J12839J06277k76108k59323O2256
$$ plain form
2633.7 698890991 698745956 698168869 697832565 697664413 697303925 697034378 696501389 696153030 696373367 696287079
2643.4 696287079 696168137 696104431 696123657 696138916 695604248 695218964 694962006 694540329 694096298 693622208
2653 693622208 693704453 693783035 693533020 693844757 694121170 693964539 693660889 692974548 692566910 692737350
2662.6 692737350 692615585 691929626 691480255 691478195 691418610 691315155 691137238 691002731 691049347 691288834
2672.3 691288834 691331024 690980225 690622940 690099869 689838715 689625092 689350052 689425964 689149780 688709717
2681.9 688709717 688408508 688715897 689203644 688860321 688205719 687465973 687080765 686800079 686489105 686568756
2691.6 686568756 686504059 686380539 686211853 686109619 686249237 686312256 686158218 685960007 685884857 685558777
2701.2 685558777 684893723 684184418 683914108 683791733 683470306 683745499 684161987 683890076 683584900 683519287
$$ packed form
2633.7F98890991j45035n77087l36304j68152l60488k69547n32989l48359K20337q6288
2643.4F96287079j18942o3706J9226J5259n34668l85284k56958m21677m44031m74090
2653F93622208Q2245P8582k50015L11737K76413j56631l03650o86341m07638J70440
2662.6F92737350j21765o85959m49371k060n9585j03455j77917j34507M6616K39487
2672.3F91288834M2190l50799l57285n23071k61154k13623k75040P5912k76184m40063
2681.9F88709717l01209L07389M87747l43323o54602p39746l85208k80686l10974P9651
2691.6F86568756o4697j23520j68686j02234J39618O3019j54038j98211p5150l26080
2701.2F85558777o65054p09305k70310j22375l21427K75193M16488k71911l05176o5613
$$ plain form
2710.9 683519287 683325043 683134918 682649536 682064285 682053909 681847076 681290054 680994415 680873871 680855865
2720.5 680855865 681135406 681472702 681325073 680943909 680593796 680270157 679838181 679228516 678952408 678944626
2730.2 678944626 678636703 678407593 678473816 678006668 677700119 678275757 678613205 678350220 677789230 677351837
2739.8 677351837 677197113 676963882 676674194 676326828 675921097 675681000 675442352 675291443 675641479 675762100
2749.4 675762100 675332489 675061417 674946747 674647980 674142303 673875198 674009628 673928680 673157349 672553101
2759.1 672553101 672878952 673244476 673035126 672582245 672070236 671410751 671033783 670936737 670739899 670636749
2768.7 670636749 670507660 670504837 670358963 669722443 669179459 669251938 669575424 669448929 669268951 668861465
2778.4 668861465 668014374 667305527 667012558 666830368 666219254 665889816 665989990 666133957 666147079 665942001
$$ packed form
2710.9F83519287j94244j90125m85382n85251j0376k06833n57022k95639j20544j8006
2720.5F80855865K79541L37296j47629l81164l50113l23639m31976o09665k76108p782
2730.2F78944626l07923k29110O6223m67148l06549N75638L37448k62985n60990m37393
2739.8F77351837j54724k33231k89688l47366m05731k40097k38648j50909L50036J20621
2749.4F75762100m29611k71072j14670k98767n05677k67105J34430q0948p71331o04248
2759.1F72553101L25851L65524k09350m52881n12009o59485l76968r7046j96838j03150
2768.7F70636749j29089k823j45874o36520n42984P2479L23486j26495j79978m07486
2778.4F68861465q47091p08847k92969j82190o11114l29438J00174J43967J3122k05078
$$ plain form
2788 665942001 665706482 665490417 665671844 665162888 664085999 663656540 663217087 662769394 662596283 662529373
2797.7 662529373 662295227 662085495 661810074 661347961 661169205 661037521 660698471 659861221 659289322 659105530
2807.3 659105530 658824158 658799973 658158188 657236938 656749573 656541595 656485291 656154709 655902786 655635681
2816.9 655635681 655044556 654616699 654182816 653300323 652994308 653129654 652587357 651797714 651302032 651653976
2826.6 651653976 651781158 651150742 650893555 650438614 649588089 648822250 648058319 647298965 646916122 646493835
2836.2 646493835 645923920 645773392 645366364 644733200 643700180 642340240 641353378 640260925 639226761
2844.9 639226761 638069496 636574440 635485916 634694138 633390694 632077484 631418076 630736122 630051155
2853.6 630051155 629837761 629946251 629552994 628945274 628759880 628433380 627933044 627639809 627940063 627909775
$$ packed form
2788F65942001k35519k16065J81427n08956j076889m29459m39453m47693j73111o6910
2797.7F62529373k34146k09732k75421m62113j78756j31684l39050q37250n71899j83792
2807.3F59105530k81372k4185o41785r21250m87365k07978n6304l30582k51923k67105
2816.9F55635681n91125m27857m33883q82493l06015J35346n42297p89643m95682L51944
2826.6F51653976J27182o30416k57187m54941q50525p65839p63931p59354l82843m22287
2836.2F46493835n69915j50528m07028o33164j033020j359940r86862j092453j034164
2844.9F39226761j157265j495056j088524p91778j303444j313210o59408o81954o84967
2853.6F30051155k13394J08490l93257o07720j85394l26500n00336k93235L00254l0288
$$ plain form
2863.2 627909775 627305756 627054062 626758614 626206055 625516815 624930267 624289017 623855019 623641739 622950439
2872.9 622950439 622350578 621706581 621041298 620803490 620782852 620664024 620099373 619730644 619709320 619363937
2882.5 619363937 618723984 618319664 617784157 617019768 616796875 616367111 615522079 615202827 615264473 614817696
2892.2 614817696 613794136 613042183 612382431 611680717 611312599 611022797 610643997 610133324 609496078
2900.8 609496078 608737564 608211021 608061485 607708206 607468376 607263985 606847687 606879921 606384964 605491905
2910.5 605491905 605190163 604748878 604206085 603243790 602160149 601714668 601307831 600930939 600343513
2919.2 600343513 599515953 598762970 598177032 597966881 597808914 597650833 597424164 597270927 597565460 597843781
2928.8 597843781 597910156 597750206 597283669 597294273 597658386 597737732 597830200 597732773 597746582 598335991 598865356
$$ packed form
2863.2F27909775o04019k51694k95448n52559o89240n86548o41250m33998k13280o91300
2872.9F22950439n99861o43997o65283k37808k0638j18828n64651l68729k1324l45383
2882.5F19363937o39953m04320n35507p64389k22893m29764q45032l19252O1646m46777
2892.2F14817696j023560p51953o59752p01714l68118k89802l78800n10673o37246
2900.8F09496078p58514n26543j49536l53279k39830k04391m16298L2234m94957q93059
2910.5F05491905l01742m41285n42793r62295j083641m45481m06837l76892n87426
2919.2F00343513q27560p52983n85938k10151j57967j58081k26669j53237K94533K78321
2928.8E97843781O6375j59950m66537J0604L64113P9346R2468r7427J3809N89409N29365
$$ plain form
2939.4 598865356 599211884 599711571 600131302 600280037 600360451 600142441 599713478 599855347 600163689 599734573
2949.1 599734573 599354744 599410057 599002762 598346024 597925949 597595444 597305946 597388229 597554131 597259674
2958.7 597259674 596827431 596469917 596385994 596289825 596207314 596363335 596621284 597176781 597469406 597738953
2968.3 597738953 598315659 599103355 599920616 600095367 600042343 600223045 600824242 601164436 600924530 601049080
2978 601049080 601846237 602885056 603444290 603734779 604007187 604470329 604869080 604974937 605244179 605365562
2987.6 605365562 605700150 606040459 606295891 606581039 606798973 607410622 607394676 607117691 607399368 607388306
2997.3 607388306 606982536 607112541 607503700 607100983 606799660 606667900 606457176 606645737 606969223 606975174
3006.9 606975174 606542053 606419449 606150742 605771408 605794716 605513039 605198135 605265503 605227394 604534454
$$ packed form
2939.4E98865356L46528M99687M19731J48735Q0414k18010m28963J41869L08342m29116
2949.1E99734573l79829N5313m07295o56738m20075l30505k89498Q2283J65902k94457
2958.7E97259674m32243l57514q3923r6169q2511J56021K57949N55497K92625K69547
2968.3E97738953N76706P87696Q17261J74751n3024J80702O01197L40194k39906J24550
2978F01049080P97157J038819N59234K90489K72408M63142L98751J05857K69242J21383
2987.6F05365562L34588L40309K55432K85148K17934O11649j5946k76985K81677j1062
2997.3F07388306m05770J30005L91159m02717l01323j31760k10724J88561L23486N951
3006.9F06975174m33121j22604k68707l79334K3308k81677l14904O7368l8109o92940
$$ plain form
3016.6 604534454 603898849 603713417 603704147 603478165 602846451 602557030 602536011 602538910 602211266 601769371
3026.2 601769371 601388626 600809097 600733147 600579338 600124168 599764214 599647369 599551430 599065704 598902283
3035.9 598902283 598399811 597702484 597503357 597056999 596693420 596339188 595705070 595351448 595230522 594776306
3045.5 594776306 594082870 593749580 593595123 593118439 592770882 592579651 591920662 591277657 590891190 590611420
3055.1 590611420 590332031 589825249 589431572 588869629 588010826 587596550 587793350 587932167 587315102 586207581
3064.8 586207581 585970039 586350365 585815849 584905853 584294968 583972130 583804436 583567390 583355942 582510681
3074.4 582510681 581945801 582436218 582774925 582520981 581466446 580363693 580011711 579797592 579413681
3083.1 579413681 578703957 578060722 577782173 577658310 577841263 577561150 576911354 576366768 575349388
$$ packed form
3016.6F04534454o35605j85432r270k25982o31714k89421k1019K899l27644m41895
3026.2F01769371l80745n79529p5950j53809m55170l59954j16845r5939m85726j63421
3035.9E98902283n02472o97327j99127m46358l63579l54232o34118l53622j20926m54216
3045.5E94776306o93436l33290j54457m76684l47557j91231o58989o43005l86467k79770
3055.1E90611420k79389n06782l93677n61943q58803m14276J96800J38817o17065j107521
3064.8E86207581k37542L80326n34516r09996o10885l22838j67694k37046k11448q45261
3074.4E82510681n64880M90417L38707k53944j054535j102753l51982k14119l83911
3083.1E79413681p09724o43235k78549j23863J82953k80113o49796n44586j017380
$$ plain form
3091.8 575349388 574683495 574653969 574742470 574231071 573271332 573305168 573475876 573623581 573863907 573053398
3101.4 573053398 571840210 571221657 570804176 570105667 569977341 569977875 569261856 568398476 567514267 567057915
3111.1 567057915 566945114 566555634 566177597 566111641 565620155 565132256 565178909 564523506 563752022 563532028
3120.7 563532028 562932892 561566086 560736923 560824814 560436630 560078239 559904938 559567795 559224625 558402138
3130.4 558402138 557624664 557117500 556260490 555505066 555174904 554680710 554476967 554383888 553898735 553325920
3140 553325920 552756920 552608032 551985245 550849838 550269051 550068588 549440804 548654251 548533936 547826385
3149.6 547826385 546995316 546948547 547041779 546411552 545087547 544757843 544174957 543295212 543092537 542390175
3159.3 542390175 541723557 541435089 541219406 540717812 539828491 538860130 538415260 538339348 537902908 537458572
$$ packed form
3091.8E75349388o65893k9526Q8501n11399r59739L3836J70708J47705K40326q10509
3101.4E73053398j213188o18553m17481o98509j28326N34p16019q63380q84209m56352
3111.1E67057915j12801l89480l78037o5956m91486m87899M6653o55403p71484k19994
3120.7E63532028n99136j366806q29163Q7891l88184l58391j73301l37143l43170q22487
3130.4E58402138p77474n07164q57010p55424l30162m94194k03743r3079m85153n72815
3140E53325920n69000j48888o22787j135407n80787k00463o27784p86553j20315p07551
3149.6E47826385q31069m6769R3232o30227j324005l29704n82886q79745k02675p02362
3159.3E42390175o66618k88468k15683n01594q89321r68361m44870p5912m36440m44336
$$ plain form
3168.9 537458572 536961212 536379051 535570068 534913025 534385071 533782730 533533058 533088074 532357178 531401176
3178.6 531401176 531257858 531234245 530354767 529855537 529561806 529256439 528406487 527752838 527674217 526926994
3188.2 526926994 525959778 525224571 524754143 524168587 523733177 523625336 523480530 522911758 522153931 521429138
3197.9 521429138 520279617 519895630 519572487 519085693 518888626 518366852 518029556 517416687 517313271
3206.5 517313271 517311668 516656837 515964050 514959946 514216614 514026527 514121857 513377991 512484665 511777306
3216.2 511777306 510941734 511006470 510760574 510069351 509565201 509395981 509082870 508429222 508040657 507413063
3225.8 507413063 507195053 506912003 506099815 505589676 505419731 505184631 504659348 504330978 503872986 503286209
3235.5 503286209 502556038 501784935 501269302 500841713 500399933 499898872 499934921 500146942 499965553 498763962
$$ packed form
3168.9E37458572m97360n82161q08983o57043n27954o02341k49672m44984p30896r56002
3178.6E31401176j43318k3613q79478m99230k93731l05367q49952o53649p8621p47223
3188.2E26926994r67216p35207m70428n85556m35410j07841j44806n68772p57827p24793
3197.9E21429138j149521l83987l23143m86794j97067n21774l37296o12869j03416
3206.5E17313271j603o54831o92787j004104p43332j90087R5330p43866q93326p07359
3216.2E11777306q35572O4736k45896o91223n04150j69220l13111o53648l88565o27594
3225.8E07413063k18010k83050q12188n10139j69945k35100n25283l28370m57992n86777
3235.5E03286209p30171p71103n15633m27589m41780n01061L6049K12021j81389j201591
$$ plain form
3245.1 498763962 498072281 498646774 498144455 497257423 496740494 496371078 496019211 495591278 495073433 494503708
3254.8 494503708 494590416 494129219 493463058 493214264 493072929 492971687 492259979 491653671 491205597 490940475
3264.4 490940475 490638924 490072556 489599648 489343452 489210472 488934021 488922424 488591690 488381767 487631035
3274 487631035 486501503 486590195 486018028 485579681 485803947 485724716 485648117 485063095 484178276 483317146
3283.7 483317146 482974968 482786751 482625542 482495079 481563225 480598488 480568695 480839577 480713272 480627022
3293.3 480627022 480164452 479600525 479493980 478926125 477829475 477165794 477202225 476949768 476702652 476655731
3303 476655731 476399384 476062546 475572014 475047340 474427605 474078140 473318329 472873344 473255882 472956657
3312.6 472956657 472532578 471936264 471393852 471227074 470906296 470361366 469602470 469072838 468634567 468287468
$$ packed form
3245.1D98763962o91681N74493n02319q87032n16929l69416l51867m27933n17845n69725
3254.8D94503708Q6708m61197o66161k48794j41335j01242p11708o06308m48074k65122
3264.4D90940475l01551n66368m72908k56196j32980k76451j1597l30734k09923p50732
3274D87631035j129532Q8692n72167m38347K24266p9231p6599n85022q84819q61130
3283.7D83317146l42178j88217j61209j30463r31854r64737k9793K70882j26305q6250
3293.3D80627022m62570n63927j06545n67855j096650o63681L6431k52457k47116m6921
3303D76655731k56347l36838m90532n24674o19735l49465p59811m44985L82538k99225
3312.6D72956657m24079n96314n42412j66778l20778n44930p58896n29632m38271l47099
$$ plain form
3322.3 468287468 467882042 467544136 467098961 466535606 465958748 465341644 465604095 465362740 464660683 464202347
3331.9 464202347 463585320 463569107 463317871 462754860 461803932 460828133 460728416 460346146 459690285 459318123
3341.6 459318123 459060669 458708153 458262405 457651787 456891212 456647949 456891212 456426430 455416794
3350.2 455416794 454987297 454782867 454464645 454009209 453556137 453125191 452803421 452435608 451731071 451151352
3359.9 451151352 450505524 450333977 449939117 449355698 449223747 448120384 447559166 447691650 447488213
3368.6 447488213 447066956 446628876 446364212 445307617 444664650 444555016 444418831 444318695 443720512
3377.2 443720512 443059006 442300644 441793633 441531868 441703033 441740150 441374054 441319847 440808144 440365944
3386.9 440365944 439757652 439029388 438843384 438648605 438526154 437984428 437315254 437078705 437119102 437165146
$$ packed form
3322.3D68287468m05426l37906m45175n63355n76858o17104K62451k41355p02057m58336
3331.9D64202347o17027j6213k51236n63011r50928r75799r9717l82270o55861l72162
3341.6D59318123k57454l52516m45748o10618p60575k43263K43263m64782j009636
3350.2D55416794m29497k04430l18222m55436m53072m30946l21770l67813p04537n79719
3359.9D51151352o45828j71547l94860n83419j31951j103363n61218J32484k03437
3368.6D47488213m21257m38080k64664j056595o42967j09634j36185j00136n98183
3377.2D43720512o61506p58362n07011k61765J71165L7117l66096n4207n11703m42200
3386.9D40365944o08292p28264j86004j94779j22451n41726o69174k36549M0397M6044
$$ plain form
3396.5 437165146 436366081 435684814 436538658 437193489 436421928 435607719 435091820 434787483 434620171 434394684
3406.2 434394684 433979034 433459854 433348579 433207092 432667618 432418213 432615891 432106018 431665535 431785698
3415.8 431785698 431725731 432071609 432341576 432585487 432180061 431058044 430769119 430827026 430604744 430574570
3425.5 430574570 431655884 432140083 431315842 430782928 430534706 430198021 429991035 430023422 429591408 429659920
3435.1 429659920 430124092 430103531 429930916 429846649 430269432 430638428 430926247 430130196 429981918 430731583
3444.7 430731583 430600166 430606613 429187241 429419937 430719337 430407219 430794563 431505928 431806641 431537437
3454.4 431537437 431479836 431121025 431198235 431759377 431308746 432427254 433260040 432844353 432615013 432765961
3464 432765961 433298531 433330383 433726120 433452682 433477936 433901100 433850288 434332619 434284515 434371910 434812813
$$ packed form
3396.5D37165146p99065o81267Q53844O54831p71561q14209n15899l04337j67312k25487
3406.2D34394684m15650n19180j11275j41487n39474k49405J97678n09873m40483J20163
3415.8D31785698n9967L45878K69967K43911m05426j122017k88925N7907k22282l0174
3425.5D30574570J081314M84199q24241n32914k48222l36685k06986L2387m32014O8512
3435.1D29659920M64172k0561j72615q4267M22783L68996K87819p96051j48278P49665
3444.7D30731583j31417O447j419372K32696J299400l12118L87344P11365L00713k69204
3454.4D31537437n7601l58811P7210N61142m50631J118508Q32786m15687k29340J50948
3464D32765961N32570L1852L95737k73438K5254M23164n0812M82331m8104Q7395M40903
$$ plain form
3474.6 434812813 435236053 435432968 435444489 435772133 436142120 436359940 436341248 436467438 436321259 436726303
3484.3 436726303 437100372 437548866 438767815 438579750 438373337 439171600 440098839 440751114 440512085
3493 440512085 440139236 440624886 441312828 440952110 440981750 441645241 442256203 442550583 443117981 444134178
3502.6 444134178 443503990 442917480 443550529 444052353 444465714 445667191 445843430 445141487 446318321
3511.3 446318321 446834221 446759720 446928291 447601509 448426857 448301086 448323975 448214951 448816223 449748993
3520.9 449748993 451015015 451927299 450968742 451024170 451498680 451910324 452170486 452741241 453652077 454468613
3530.6 454468613 454357071 453797073 455309448 456239777 457161179 457218590 455921440 457274132 458455925
3539.2 458455925 459028816 459151001 459612503 460131187 460692940 461444244 461135101 462334557 461362000
$$ packed form
3474.6D34812813M23240J96915J1521L27644L69987K17820j8692J26190j46179M05044
3484.3D36726303L74069M48494J218949j88065k06413P98263R27239O52275k39029
3493D40512085l72849M85650O87942l60718K9640O63491O10962K94380N67398J016197
3502.6D44134178o30188n86510O33049N01824M13361J201477J76239p01943J176834
3511.3D46318321N15900p4501J68571O73218Q25348j25771K2889j09024O01272R32770
3520.9D49748993J266022R12284r58557N5428M74510M11644K60162N70755R10836Q16536
3530.6D54468613j11542n59998J512375R30329R21402N7411j297150J352692J181793
3539.2D58455925N72891J22185M61502N18684N61753P51304l09143J199456r72557
$$ plain form
3547.9 461362000 461566963 463082619 464284134 465848618 463615112 464191780 465535889 466200256 467469215
3556.6 467469215 466944809 468045464 469356422 469878769 469554710 471000977 472030449 471847534 475785103
3565.3 475785103 474723778 472272453 472117653 471175499 474328117 475697746 476788445 478072433 479068565
3574 479068565 479032021 478861580 480168800 480160942 482225189 482966843 481738777 483055305 485087814 486263428
3583.6 486263428 486482506 490092163 491018753 487405090 487419662 485520897 488081856 491027374 493604507
3592.3 493604507 493818474 492739449 495780983 494146843 495583191 498589668 497931213 499828987 499592361
3601 499592361 499621964 501323624 502007713 502974777 505317116 507693558 506575813 509359856 506912308
3609.6 506912308 504870758 512184334 512164078 509132919 513237000 511881485 514984474 519126663 517856331
$$ packed form
3547.9D61362000K04963J515656J201515J564484k233506N76668J344109O64367J268959
3556.6D67469215n24406J100655J310958N22347l24059J446267J029472j82915L937569
3565.3D75785103j061325k451325j54800r42154L152618J369629J090699J283988R96132
3574D79068565l6544j70441J307220p858K064247P41654j228066J316528K032509J175614
3583.6D86263428K19078L609657R26590l613663J4572j898765K560959K945518K577133
3592.3D93604507K13967j079025L041534j634140J436348L006477o58455J897774k36626
3601D99592361K9603J701660O84089R67064K342339K376442j117745K784043k447548
3609.6E06912308k041550P313576k0256l031159M104081j355515L102989M142189j270332
$$ plain form
3618.3 517856331 517840843 516180153 516267929 518965721 521572609 523504105 525135155 526503334 528124504
3627 528124504 534003220 532643013 521079445 526320152 531395531 536032753 535642204 533483276 536444550
3635.7 536444550 539161987 540960503 540966415 541511765 542964821 544985123 546166534 546629562 548851128
3644.4 548851128 551548615 556603050 554299507 550009918 556274223 553534851 547636108 547678909 554638138
3653 554638138 559496574 563920670 569426575 558901100 559815331 565081787 566353760 567614098 566982880
3661.7 566982880 568199654 569117203 570649338 572553978 573309479 577918510 580713234 578199883 575726814
3670.4 575726814 568384285 571568527 580890884 590016174 587447433 566100388 569876442 578928680
3678.1 578928680 583690186 580388298 579800529 582755966 584630852 585842819 586131630 586572800 591072502
$$ packed form
3618.3E17856331j5488j660690Q7776K697792K606888J931496J631050J368179J621170
3627E28124504N878716j360207j1563568N240707N075379M637222l90549k158928K961274
3635.7E36444550K717437J798516N912N45350J453056K020302J181411M63028K221566
3644.4E48851128K697487N054435k303543m289589O264305k739372n898743M2801O959229
3653E54638138M858436M424096N505905j0525475R14231N266456J271973J260338o31218
3661.7E66982880J216774R17549J532135J904640P55501M609031K794724k513351k473069
3670.4E75726814p342529L184242R322357R125290k568741k1347045L776054R052238
3678.1E78928680M761506l301888n87769K955437J874886J211967K88811M41170M499702
$$ plain form
3686.8 591072502 597104263 585224495 580157547 588756523 582439270 581843452 587396507 588128891
3694.5 588128891 589987869 589835052 588666801 589683723 589793434 592790604 595874672 588743973 585694580
3703.2 585694580 590877876 592414474 592226715 593045769 595473480 599053230 591248894 594970169 599345818
3711.9 599345818 584386749 588876991 593464966 594338150 595144157 597410583 598505516 593956451
3719.6 593956451 594927330 600762367 596231346 590994644 596873817 597858772 596528893 593811798 593818817
3728.3 593818817 598473663 599607124 604740410 601714058 593447762 603688240 603818092 590117187
3736 590117187 590751762 594678421 595097504 597661667 601534691 597323341 600095825 611397858 599499435
3744.7 599499435 582731743 593507996 600519867 606920662 602613754 591828461 603832817 596825981
$$ packed form
3686.8E91072502O031761j1879768n066948Q598976o317253n95818N553055P32384
3694.5E88128891J858978j52817j168251J016922J09711K997170L084068p130699l049393
3703.2E85694580N183296J536598j87759Q19054K427711L579750p804336L721275M375649
3711.9E99345818j4959069M490242M587975Q73184Q06007K266426J094933m549065
3719.6E93956451R70879N835037m531021n236702N879173R84955j329879k717095P019
3728.3E93818817M654846J133461N133286l026352q266296J0240478J29852j3700905
3736E90117187O34575L926659M19083K564163L873024m211350K772484J1302033j1898423
3744.7E99499435j6767692J0776253P011871O400795m306908j0785293J2004356p006836
$$ plain form
3752.4 596825981 588036537 593478279 598332443 602287979 596766396 599210510 604944267 595842476
3760.1 595842476 593718300 598188553 599926949 599891319 603116722 600280418 595228271 599218826 604586792
3768.8 604586792 604151764 593470497 594703293 598021622 597997169 598696060 599160881 600714455 601348915
3777.4 601348915 603178253 601525497 593450050 596266975 598817368 600364151 602671890 598439980
3785.2 598439980 597045174 598329086 598470535 599279175 598976517 598893242 599234428 600184937 600159378 601141090
3794.8 601141090 604633598 599534187 594244881 597146606 601812286 607154312 598314285 588645592
3802.5 588645592 592746201 595826111 601252823 606426506 594682884 590503654 596142311 598159866
3810.2 598159866 598322258 599036217 599391403 600847816 606888695 604611053 587563705 593906975 601538696
$$ packed form
3752.4E96825981q789444N441742M854164L955536n521583K444114N733757r101791
3760.1E95842476k124176M470253J738396l5630L225403k836304n052147L990555N367966
3768.8F04586792m35028j0681267J232796L318329k4453O98891M64821J553574O34460
3777.4F01348915J829338j652756q075447K816925K550393J546783K307739m231910
3785.2E98439980j394806J283912J41449Q08640l02658q3275L41186R50509k5559R81712
3794.8F01141090L492508n099411n289306K901725M665680N342026q840027r668693
3802.5E88645592M100609L079910N426712N173683j1743622m179230N638657K017555
3810.2E98159866J62392P13959L55186J456413O040879k277642j7047348O343270P631721
$$ plain form
3818.9 601538696 606806984 607918396 587014198 588526001 594217987 596679497 599665718 599912148
3826.6 599912148 594858589 594810715 597295952 601149216 602890472 592411461 595009346 603042145
3834.3 603042145 596899948 596343460 605263176 597105637 591744614 599788857 593143272 592119789
3842.1 592119789 599019775 595702438 591300964 594246178 596246948 596454201 597910233 596875381
3849.8 596875381 599592514 606400681 598020020 597620430 582977829 584780846 595013618 592665176
3857.5 592665176 591205635 594097710 596709518 599444695 593316612 593245239 600345001 593124199 587673111
3866.2 587673111 592659378 598541260 604940376 593216248 582247772 588377190 596718025 601059341
3873.9 601059341 589034462 589409142 593711739 594449844 597548828 601616745 592899551 584971848
$$ packed form
3818.9F01538696N268288J111412k0904198J511803N691986K461510K986221K46430
3826.6E99912148n053559m7874K485237L853264J741256j0479011K597885Q032799
3834.3F03042145o142197n56488Q919716q157539n361023Q044243o645585j023483
3842.1E92119789O899986l317337m401474K945214K000770K07253J456032j034852
3849.8E96875381K717133O808167q380661l99590j4642601J803017J0232772k348442
3857.5E92665176j459541K892075K611808K735177o128083p1373P099762p220802n451088
3866.2E87673111M986267N881882O399116j1724128j0968476O129418Q340835M341316
3873.9F01059341j2024879L74680M302597P38105L098984M067917q717194p927703
$$ plain form
3881.6 584971848 592669830 593969002 594933128 599331894 584824257 586410561 591758919 593920784
3889.3 593920784 598334961 596356087 587297440 589572716 593248215 591200638 592106361 592917023 594958572
3898 594958572 597910004 588439293 592156067 593237991 587897797 592761459 588799477 587267265 588054657
3906.7 588054657 588794823 590931091 590479965 590811195 590555687 590802040 591320877 590652313 592314682
3915.3 592314682 594419212 590257835 586693573 591470032 591179428 586337700 588870506 590879288
3923.1 590879288 592371216 590161629 586886177 588915672 589815636 590602913 589501877 589216461 591380196
3931.7 591380196 588018951 586358719 587738762 587658806 587954063 588455887 588095551 588401375 588666534
3940.4 588666534 589763145 591005440 586088409 585134430 586829796 586898232 588000107 585935287 587024117
$$ packed form
3881.6E84971848P697982J299172R64126M398766j4507637J586304N348358K161865
3889.3E93920784M414177j978874r058647K275276L675499k047577R05723Q10662K041549
3898E94958572K951432r470711L716774J081924n340194M863662l961982j532212P87392
3906.7E88054657P40166K136268m51126L31230k55508K46353N18837o68564J662369
3915.3E92314682K104530m161377l564262M776459k90604m841728K532806K008782
3923.1E90879288J491928k209587l275452K029495Q99964P87277j101036k85416K163735
3931.7E91380196l361245j660232J380043p9956K95257N01824l60336L05824K65159
3940.4E88666534J096611J242295m917031r53979J695366O8436J101875k064820J088830
$$ plain form
3949.1 587024117 587658806 584968529 587065086 587541504 586742325 586992607 587051620 586911812 586035156
3957.8 586035156 586215401 585711403 586118851 586959953 585903091 585633125 585609779 586252937 586828613 586133919
3967.4 586133919 585961533 585574112 585544052 586587753 586506042 585879288 585534515 585576591 585611954 585058250
3977.1 585058250 585511398 585791130 585262566 584918442 585012741 585034790 584634552 585167198 585165939 584554138
3986.7 584554138 584283142 583817368 583325005 582742271 583047447 583737068 584450798 584236717 583403549 583929634
3996.3 583929634 584491348 584256706 583656311 583827744
4000.2 583827744
$$ packed form
3949.1E87024117O34689k690277K096557M76418p99179K50282N9013j39808q76656
3957.8E86035156J80245n03998M07448Q41102j056862k69966k3346O43158N75676o94694
3967.4E86133919j72386l87421l0060J043701q1711o26754l44773M2076L5363n53704
3977.1E85058250M53148K79732n28564l44124R4299K2049m00238N32646j259o11801
3986.7E84554138k70996m65774m92363n82734L05176O89621P13730k14081q33168N26085
3996.3E83929634N61714k34642o00395J71433
4000.2E83827744
##END=$$ End of the data block
