##TITLE=$$ Begin of the data block
##JCAMP-DX=5.00 $$ ACD/SpecManager v 10.08
##SPECTROMETER/DATA SYSTEM=Varian
##DATE=18 Dec 2012 10:29:24
##DATA TYPE=INFRARED SPECTRUM
##DATA CLASS=XYDATA
##ORIGIN=
##OWNER=
##NPOINTS=3735
##FIRSTX=399.26403809
##LASTX=4000.35498047
##MAXX=4000.35498047
##MINX=399.26403809
##MAXY=77.14067841
##MINY=42.92422104
##XFACTOR=1.0000000000
##YFACTOR=0.000000100000000
##FIRSTY=69.31373596
##DELTAX=0.96440572
##XUNITS=1/CM
##YUNITS=TRANSMITTANCE
##XYDATA=(X++(Y..Y))
399.3 693137360 697949829 683551788 677061691 678683929 675974655 673765945 678587799 676161194
407 676161194 673237305 684108429 687784958 689345932 688707657 678957214 675438919 673964615 673438187
415.7 673438187 674933319 677263870 687449570 692324371 685924530 681301117 679800568 680950165
423.4 680950165 683578491 681866226 680152664 680745010 680755310 683004074 681218719 676059799 672232208
432.1 672232208 677635269 686075592 682735519 680415497 681231689 675939484 673104019 676845779 676226959
440.7 676226959 670318604 674206238 679203186 676457138 671324081 668162231 671700516 678077927
448.4 678077927 682050476 679503708 673984680 670782623 671761246 670287323 666335831 668213501 673943634
457.1 673943634 674180832 669021530 667860489 673780899 679111862 676051331 672447891 673751678 673604813
465.8 673604813 667129974 666600037 672244720 668195801 666107483 665173111 657663727 657213287 661973114
474.5 661973114 671007385 671343689 666652069 668763657 668203354 671717529 676225128 673942261 671964340
483.2 671964340 670640640 667557755 666964798 670053101 669178772 665530396 665534058 670543060 675298843
491.8 675298843 672964554 671585846 671874619 669673767 667978745 669642029 671557236 670710831 671643295
500.5 671643295 673733749 671920547 670980148 670924530 668218460 666176300 666373596 666661453 666007004
509.2 666007004 665837402 664941788 664781113 665536804 663516464 664439240 665423508 662148132 661452942
517.9 661452942 661335144 661182938 660273819 658880692 658323822 658410492 658931274 656861954 656919937 659596939
527.5 659596939 661078873 661718369 660749741 660510025 659124374 656236572 656037827 658480606 660343857
536.2 660343857 660246658 659661255 658160934 657241745 658396683 659596481 659483871 659386520 659361496 658957672
545.9 658957672 659604034 658940735 658572769 659613266 659429626 660119400 661361542 661965561 661769562
554.5 661769562 661237564 661047287 660672226 659967880 660296783 661707230 659786682 657045059 657640762
563.2 657640762 659291840 660643997 660189362 659488525 659779434 659668884 659346390 660546494 662365875
571.9 662365875 659781189 656568604 657126160 657729034 657691879 657310104 657116165 658152847 658887100
580.6 658887100 658482208 658879929 659481049 657672653 655706329 656007156 657206573 658151474 658466110
589.3 658466110 659045334 660336456 661444473 660561752 659356384 660316620 660480270 658009338 656574173
597.9 656574173 657209473 656924133 654777451 653399429 653591690 653569107 653006973 652926483 650884476 647179794
607.6 647179794 645467606 643919525 639656487 633001480 626881905 621528702 615869598 609742432
615.3 609742432 602734566 597418098 594816628 593368759 591011696 591461334 593542938 594261703 596119499
624 596119499 599133911 605440063 613588142 619670448 625178871 632259483 638442764 642189026 644953766
632.7 644953766 646933594 646715317 645296249 644516144 643580170 642191238 641393280 641923981 644307785
641.3 644307785 647848816 651771469 656733322 662640457 666496658 668829193 671176453 673360748
649 673360748 674437790 673676910 672313538 672384109 673006134 673642578 673825760 673159256 674937439 676632690
658.7 676632690 676979675 678862457 680425644 680812073 680190125 680115585 679822693 679935913 678910065
667.4 678910065 670043335 676554642 680395737 681320343 683155594 684429398 684768600 684189758 684349670
676.1 684349670 685364380 686261063 685787735 684143143 684161835 684836349 685826721 686706085 686765289 686793671
685.7 686793671 686815262 686599579 685508728 683657532 681344986 680275269 679731598 677936096 677146301
694.4 677146301 675904617 673965378 674577255 675589142 675432129 675516586 675762405 675705719 675093613 674625473
704 674625473 674633713 674445114 674564056 675454483 676666412 677316513 678484344 680399704 681134415 682525482
713.7 682525482 684021606 684332047 685058289 685368500 686021347 687217026 687553329 687453690 688551254
722.3 688551254 690759964 691431580 691942673 693160706 693109207 692355652 690964203 690176620 690586395
731 690586395 690473251 689649429 688646393 689334183 690121765 689225006 689173431 689948425 690664673 691431198
740.7 691431198 693107452 694220123 692602921 692032013 693772736 695151520 696240768 698008804 700046005
749.3 700046005 702053986 704564285 706726456 708476181 709962082 711098785 712962875 715016479
757.1 715016479 714895554 713429871 714514847 716286011 717473221 719286652 719929352 719684982 719099579
765.7 719099579 718395920 717869339 716980896 715618668 715099640 714998169 714238739 714702606 716158295
774.4 716158295 717651367 718942261 720315704 722798996 725508270 727350311 727888641 727782974 727820587
783.1 727820587 728753738 729993286 731214371 731957855 732169266 733312302 734117889 735759888 736543274
791.8 736543274 735526962 735428619 735662003 736728897 735821915 734925156 735555878 735372009 735918961 735917664
801.4 735917664 736735764 737493057 737040787 737533340 737796402 737509766 737176514 737290344 737928238 738350220
811.1 738350220 737818069 738260269 738749237 738202209 739282227 740555115 741196518 741604919 742061539
819.7 742061539 741171951 739898834 740441208 740546112 740891037 740446701 738650513 736744995 735309601
828.4 735309601 734161453 732082901 730200272 727539520 724997330 723167496 721347351 719892502
836.1 719892502 717661972 714820557 711878967 709513550 707231750 705611343 704722137 702884064 700348587
844.8 700348587 698316727 698421860 699153137 699258270 699554138 699800720 700608215 702099838 704005203
853.5 704005203 706620789 709650955 711546860 712907257 714517441 715855255 718083038 720554810
861.2 720554810 722776642 724452972 725439606 725727692 726441574 727877197 728033752 728931198 729863892
869.9 729863892 730062637 730212021 730624084 732163544 733003387 733774948 734041138 733970413 733762894 733013763
879.5 733013763 731999207 730253677 729160461 727461929 726449509 725675354 724138947 723647537 722346573
888.2 722346573 721127701 719889908 718833847 718714523 718186798 718211365 718956146 719630051 719844284
896.9 719844284 720770416 721327209 721074295 722195435 723004684 722178955 721196671 721028748 720012665
905.6 720012665 718384171 717325211 715906219 714091492 711592178 709007263 707472916 706427078
913.3 706427078 704917221 703143539 701461639 699860001 698096542 695521240 692525711 689762497
921 689762497 687727509 686055145 684077148 682747421 681946869 680604858 679352875 679007568 678565750
929.7 678565750 677015686 676701584 677931137 678357925 678607330 679468002 681203003 683404999 685907135
938.4 685907135 688596497 690832901 693124771 695611954 698783112 701555252 703002930 704578171
946.1 704578171 705853577 707444611 709745026 711071701 712278214 713207626 713617859 714249268 714597702
954.8 714597702 714487152 713928909 713322906 711828918 709739151 708200989 706941147 705212631 703008652
963.4 703008652 701286697 699489059 697701416 696365356 695714035 695626373 695052338 693670578 691962967
972.1 691962967 691672745 692091827 691005783 689546890 689392166 689407578 688619308 688173370 687910538 687555771
981.8 687555771 686691055 685075302 684107971 682991409 680831757 678265686 675864410 673717728 671049881
990.5 671049881 668999634 668530502 667185745 664064560 660312576 657932129 658248901 659834290 661695938
999.1 661695938 662656403 662674789 662110519 661523285 661535492 660524826 658931580 658339462 658223801 657104721
1008.8 657104721 655986557 655694809 654610214 653396988 652525558 651435852 649508057 647369232 645345993
1017.5 645345993 643383865 642348557 640945663 640387344 639759293 637512856 635276566 633065720 631880722
1026.1 631880722 630563774 628599548 627327728 626306305 624562378 622769165 621885338 620863686
1033.8 620863686 619787216 618717957 617861137 616915970 616331825 615995979 615182991 614701271 613441124
1042.5 613441124 612641716 612946587 613205261 612778168 612631798 613471832 613383369 613650055 614180679 614604683
1052.2 614604683 614576492 613371735 612658195 612958565 613608818 612883339 612375984 612113571 611366959 610985756
1061.8 610985756 610343056 610370293 609683456 608719444 607788048 606818810 606981163 606605835 605454712 604367561
1071.5 604367561 604315071 604099770 603762970 603841782 603346367 602208405 601023026 601269379 601354065 600968018
1081.1 600968018 600038223 598647041 597618637 596640930 596446648 595878258 595151711 593775444 591974525
1089.8 591974525 590193863 587612648 584294472 580448685 577642784 573006134 567853432 564166412
1097.5 564166412 560308533 555817299 550334816 546724510 541928139 536587219 532156372 527617607
1105.2 527617607 523142166 517895889 514099045 508923264 504404716 500696564 497183647 494880676
1112.9 494880676 492243423 490466042 487914772 487868843 488324165 488362846 489438438 490210342 490736427
1121.6 490736427 490773163 492958145 493848648 494464836 495849457 497490959 499068260 499631195 501740532
1130.3 501740532 502935028 504806862 506063499 507122993 508218040 508153305 509349747 509106178 510474854
1139 510474854 511665192 512360840 513147316 512256660 512515831 511908112 511656532 510964737 510593605 510375671
1148.6 510375671 509669952 509560699 508582191 509059029 508804474 509341125 509982224 510549660 512088394
1157.3 512088394 512514496 514229317 515184860 517307129 519150391 519992599 521760635 523645439 526683197
1166 526683197 528601723 531782112 535580750 539626961 543172417 545483742 549404068 552935791 555978699
1174.6 555978699 558351097 561106453 563552704 566220551 569706421 571607513 573730698 575768700
1182.4 575768700 578257980 580248528 581642075 583106422 583840218 585000687 585555992 586341362 586821861
1191 586821861 587661476 589006271 590667305 593207016 594707947 597246399 599719543 601769028 603613739
1199.7 603613739 605618019 608629837 610067825 611607323 613297119 615054779 617028999 618829002
1207.4 618829002 621211510 622936935 624575882 626087761 627516174 628421059 628794746 629602928 630315475
1216.1 630315475 630916710 631311874 631834106 631804581 632304192 633475380 633996735 634850311 635446091 635609665
1225.8 635609665 635556374 635915260 635975914 635452499 635566750 635658989 636101036 636378632 636724892 637161636
1235.4 637161636 637462616 638263626 638970718 639473534 639023933 638705750 638941536 638984108 639039688 638950081
1245 638950081 639061012 639411621 640349121 640867081 640907364 641010666 641221466 641341019 640931931 641334763
1254.7 641334763 641594696 641436691 641366119 641319046 641624527 641800156 642155304 642469864 643396759 644197617
1264.3 644197617 644548187 644783859 644917297 645738754 645880890 645804138 645927582 646673737 647863464 648499146
1274 648499146 649396362 650298233 651754150 653009949 653813324 654746399 655813217 656722717 657011108
1282.7 657011108 658095856 659201279 660059509 660896454 661847763 663669815 665189285 666561432 667889633
1291.3 667889633 669411926 670830841 671754074 672704697 673308640 673845367 674580536 675489197 676457825
1300 676457825 677798462 679141464 680007172 680925903 681572723 682303848 682889252 683134689 683519211 683726883
1309.7 683726883 684059143 684268494 684552383 685241318 686100311 686763992 687007217 687558670 688106461 688642578
1319.3 688642578 689353333 690029907 690477371 690299149 690261230 690661011 691366425 691760864 691976852 692811279
1328.9 692811279 693486404 693984604 694595947 695040131 695067902 694935074 694775925 694316330 694257050 694144745
1338.6 694144745 693263855 692277451 693034973 694215622 694353256 694315948 694370422 694654999 694944153 694783707
1348.2 694783707 694224930 693516541 693025665 692532425 692258987 691728897 691518707 691637421 691900177 692130661
1357.9 692130661 691969681 692652817 692218323 691453857 691159744 688487015 688459854 689021301 688519821 688301926
1367.5 688301926 687257004 686225739 686549835 686494598 686564865 686549530 684294662 682895050 683100433
1376.2 683100433 683343658 682619247 681600723 681160126 680762787 681104507 680856476 680600586 681369324
1384.9 681369324 683219070 684547806 682883682 683800812 685202484 685522156 685978470 686517715 687450867
1393.6 687450867 685989304 683634338 684795074 686514893 686989441 684436417 683920441 684769211 684439697
1402.2 684439697 684389877 684447937 681585312 680496216 681680908 681657181 681473923 681393204 681669846 681590729
1411.9 681590729 681307755 681626892 681073761 680960007 680705414 680438766 680458984 674876938 675586929 678432770
1421.5 678432770 679984131 680599594 679139252 679868851 681457138 681001511 680934219 681103897 679366684
1430.2 679366684 679231033 680557098 681107254 681600113 683986511 685673218 679929123 680720825 684136734
1438.9 684136734 685221405 685385513 685323715 684894714 685248566 685503998 685854111 687058945 687152328 685514679
1448.5 685514679 686906433 688984146 689403305 689361649 689966812 691688004 693537521 693546906 688718948
1457.2 688718948 684801483 687177734 689759293 692897491 694587097 695899582 698405380 695212021
1464.9 695212021 694086075 696598587 697722549 698457336 699498215 701825562 702159348 699383545 699102707
1473.6 699102707 703400192 708065186 707042770 707769241 710783463 711929169 712695160 712181244 711983490
1482.3 711983490 713217392 714476852 715552826 716810760 716248779 715639725 718477173 717123489 713468475
1491 713468475 714934540 716765823 717211075 717628098 717881241 711155167 713410873 714027481 710684280
1499.6 710684280 712602615 712922287 712489700 712527084 714395676 716879578 706677933 696287994 698960724
1508.3 698960724 701652451 701776505 704138565 703632736 700815430 701899872 701404190 700741653 697144928
1517 697144928 692901688 697190475 701066742 697253723 688526764 688399963 692537689 696432571 692850571
1525.7 692850571 692071075 693027496 690630417 691541748 693257141 693188629 692311401 690246353 683820724
1534.3 683820724 685500412 687494507 688828659 692356720 689359283 678276062 681308746 682023315
1542.1 682023315 681872406 684435272 683675842 680650177 683312073 684365845 685916290 685544281 682357864
1550.7 682357864 684923782 687203293 689101486 685026779 685003433 690548401 694781036 691492996 672988052
1559.4 672988052 676651764 684729691 689177704 691655579 692678375 691272430 691662216 693972855
1567.1 693972855 695808182 696235428 688805542 689931107 691881714 692008820 692787704 694056702 694527435
1575.8 694527435 684675827 687046967 689633713 689871445 689858017 688694000 688143158 686622772 685658035
1584.5 685658035 684296875 682882843 682010422 680429230 679784470 678108215 677417908 676154175 675118942
1593.2 675118942 673596878 670846634 669961929 667812347 666570206 664979553 663860474 662113342
1600.9 662113342 659966583 658621521 655595245 654694595 653389359 652052231 649544983 648058853
1608.6 648058853 646562958 643400803 642967834 640808716 639732742 638172417 638375359 638537369 627540512
1617.3 627540512 629487038 629377136 628618622 626947670 627117615 625717659 617911186 618726730 618741684
1626 618741684 619491882 616414948 614108009 614342346 613194580 613027573 611874657 613257675 615061913
1634.6 615061913 607285347 603541832 604562950 605020447 606248016 607171364 606104164 606952019 606409721
1643.3 606409721 607821312 609747543 606813202 606248512 603658333 606668243 608977661 612212944
1651 612212944 616533165 613133965 598892670 603904076 610129967 612302322 613933182 615317154
1658.8 615317154 616599007 618182945 619882851 620287704 618486290 621994781 623865509 625071945
1666.5 625071945 627443237 628440170 626018524 626853104 630770416 631304970 634910202 639324188 638091393
1675.1 638091393 635965118 639522858 642944107 644717102 646107712 645583801 649192352 654721985
1682.9 654721985 653625259 646083832 649488602 656334305 660071182 661231918 663432007 663810196
1690.6 663810196 665994949 668311386 670748596 674874573 677075653 670295258 674553299 681513367
1698.3 681513367 688572006 689161911 678888016 687224503 692997513 695470581 696230011 697689056
1706 697689056 697647629 699910660 704290771 706129532 706958923 709372940 711812820 714450989 713629913
1714.7 713629913 712766342 717273407 718018875 708362579 712992401 717549057 719753876 721175308 721200562
1723.4 721200562 721659393 723225784 724231110 725265808 726809921 728967667 727163010 725692596
1731.1 725692596 729677353 732857666 726616669 717157135 724472427 729593811 731187363 733787842
1738.8 733787842 731645508 728394928 733128586 735579681 733038101 732379532 735003815 736711578
1746.5 736711578 737632675 738317032 738641891 742428818 741264191 739655914 744248886 746036301 747976608
1755.2 747976608 750616913 747678375 747737732 749796600 751756516 754416885 750342712 749028397 752818222
1763.9 752818222 754758530 755785217 757725983 758488693 753915710 755705948 759915924 758994675 752913895
1772.5 752913895 750774078 756137848 758597260 757135544 759138184 760289536 761467209 761404266 758653107
1781.2 758653107 759362488 760772858 761403275 759992523 758999557 760726852 761805649 762660904 764273758
1789.9 764273758 764243698 763783112 759955215 759262009 763438110 764398499 762739868 763801727 765787582
1798.6 765787582 764507370 762109604 763966064 763922653 763976593 765376511 765461349 766132965 766373520
1807.3 766373520 765420456 766221313 767224808 764990082 764558487 765642853 766173325 766767426 766635437
1815.9 766635437 767177124 766881104 766971893 767997971 767867966 768155060 767517014 768178482 769476852
1824.6 769476852 765767746 765302582 767792053 770143738 769641953 763829193 765897293 768915558 768899689
1833.3 768899689 769065094 768978577 768877106 768174210 767541656 768352585 768471222 769292374 769611435 770757294
1842.9 770757294 770661850 764394150 767258072 770404816 769712524 768350601 768823700 769755936 769524002
1851.6 769524002 769480362 769337540 769615097 769721069 769610748 769960403 769969330 770107574 769780273 769530563
1861.3 769530563 769309311 769797363 770388641 770406494 770723038 770548477 771304626 769191360 766666794
1869.9 766666794 768559341 769897766 770403214 770540390 770613022 770341110 769934692 769632797 769783401
1878.6 769783401 770047760 769583893 769801865 770011139 770483322 770452042 769938736 770403976 770398788 771406784
1888.3 771406784 771181564 768351288 769028168 769890671 769523773 770041733 769739380 768672562 769308243
1896.9 769308243 769781265 769938202 770226517 770066071 769665451 769412384 769535446 768951721 768662720 769271545
1906.6 769271545 769564133 769399719 769250336 768587723 768423386 769349899 769207764 769530640 769534912 769455185
1916.2 769455185 770699310 767483978 765902252 767765274 768671188 769368515 767686386 766619186 767833328
1924.9 767833328 768528748 768544006 768358078 768198242 768169861 768123322 767985764 767913971 767413254 767140045
1934.6 767140045 767032166 767208176 767422485 767095261 767365646 767629471 768561707 767835236 764714355
1943.2 764714355 765632019 766668015 765963364 765829468 766454849 766700439 766446609 766579514 766477890
1951.9 766477890 766300583 766421280 766487045 766351929 766190033 765930481 765365143 765078506 765075226 765049667
1961.6 765049667 764732895 764714737 765143890 765532150 765647507 764773865 764398346 764837723 764882431 764624405
1971.2 764624405 764263382 764174576 764338608 764245758 763927765 763847351 763807831 763898087 764145737 764162598 764150925
1981.8 764150925 763813477 763243332 762843018 762695770 762550125 762257385 761835861 761529007 762542953
1990.5 762542953 762984390 761376343 761235428 761868134 761916046 761664963 761059036 760740433 760778961 760754242
2000.1 760754242 760498505 760363846 760484695 760397720 760306091 760406189 760370178 760111465 760026474 759809494
2009.8 759809494 759410477 759515381 759474335 759079056 758989182 759222717 758878403 757958450 758027191 758282776
2019.4 758282776 758446960 758761749 758219376 757358246 757099838 757267380 757013931 756757965 756844864 756723404
2029.1 756723404 756814575 756903458 756854401 756804199 756605911 756287918 756115723 755940323 755362320 754954681
2038.7 754954681 754844208 755029144 754980698 754849167 755300064 755502319 755385361 754961853 754691849 754565201
2048.4 754565201 754062119 753585205 753344421 753604507 753564606 753427658 753365021 753174286 753471680 753557510
2058 753557510 753472061 753238297 752866364 752355652 751813126 751956100 751672516 750731430 750275574 750459595
2067.6 750459595 750837173 751255035 751518097 751429062 751376343 750771713 750078354 749673615 748983078 748868561
2077.3 748868561 749029999 748592453 748406448 748906326 749323273 749387207 749281235 749208374 748948288 748476181
2086.9 748476181 748368454 748018036 747334595 747113724 747198563 747213974 747408600 747643738 747739792 748052139
2096.6 748052139 748049393 748008499 747867432 747323914 747352219 747478790 747424927 747189865 746949463 747129974
2106.2 747129974 747161942 747156296 747478485 747861252 747778549 747529373 747388535 747275543 747249298 746886673
2115.9 746886673 746509552 746498642 746776047 746952896 746714706 746467819 746530228 746704407 746747971 746712341
2125.5 746712341 746293869 745907288 746037903 746187897 746004486 745655212 745715866 746028061 746242523 746302414
2135.1 746302414 746187592 745841064 745561142 745658493 745672226 745652771 745577316 745612640 745825806 745723801
2144.8 745723801 745206757 744909744 745453873 745710983 745638504 745499420 745106659 745059357 745121918 745295868
2154.4 745295868 745212631 745156021 745265350 745239334 745384903 745418396 745654526 745723267 745693665 745525208 745321350
2165 745321350 745472794 744915161 744638519 744442444 744046631 744502563 744651108 744550858 744589920 744516296
2174.7 744516296 744546051 744480362 744251556 743997955 743729935 743800659 744149399 744080811 744038620 744197235
2184.3 744197235 744272537 744323578 744370193 744515533 744370804 744262161 744448395 744321365 744000244 743996124
2194 743996124 744218140 744423218 744408493 744420547 744723129 744657135 744646530 744790573 744645233 744426956 744084167
2204.6 744084167 744167175 744151840 744071045 744413986 744462204 744547272 744764404 744783630 744708939 744491501 743929214
2215.2 743929214 743842697 744174500 743962860 743757401 743711548 744092102 744279861 743972931 744244690 744444199
2224.8 744444199 744161072 743596039 743048553 742775421 742722244 742847748 743012238 743144379 743079605 742985458
2234.5 742985458 742927933 743020554 742847366 742568588 742825089 743003235 742880554 742602997 742450943 741999969
2244.1 741999969 741528091 741798172 742282715 742842941 742827835 742311783 742175446 742287064 742235794 742052078
2253.8 742052078 741673813 741355133 741466827 741153412 741141052 741386871 741235275 741417084 741578903 741706467
2263.4 741706467 741504593 741340790 741073837 740537491 740559998 740571823 740582199 740472641 740624924 741027222
2273 741027222 741201630 741036758 740743713 741009598 740749054 740283203 739875336 739882126 740435562 740433731 740433197
2283.7 740433197 740181885 740288620 740284882 739994583 740187531 740130615 740128021 739473267 739212875 739345245
2293.3 739345245 739199829 739332123 739051895 739144211 739317474 739568939 739286804 738697281 738755035 738691101
2302.9 738691101 738889160 738317566 737906952 737901764 737875824 738104630 737557373 737200699 736555862 736965408
2312.6 736965408 737223740 736183243 736756439 737116241 736970520 736416779 735746765 735979385 735495224
2321.3 735495224 734695511 734477692 734833679 734916229 734659958 733990707 733604126 733829880 733596344 732802124
2330.9 732802124 731710815 731413040 731499939 732757874 733700180 733294449 733557663 733318634 732785416
2339.6 732785416 732041168 731885605 731743851 730804520 730647354 730616684 731151428 731268768 732359390 734804306
2349.2 734804306 735813599 735353470 735075455 734549789 733621063 732550278 732015152 731974335 730744629
2357.9 730744629 729406586 729265900 729473038 730608978 730144958 728858795 729154358 729278030 729485168
2366.6 729485168 730001450 730539169 730677414 730591812 731034393 731886902 732837143 733623123 733948898 733969650
2376.2 733969650 734522629 735230713 735216293 734854507 734876404 735156326 735642242 736272507 736338882 736131897
2385.9 736131897 736217957 736673965 737077332 737170334 737318192 737121887 736701279 736265182 735942688 736116409
2395.5 736116409 736033401 735785980 735969772 736196213 736023865 735692825 735843506 735763321 735154190 735174103
2405.2 735174103 735437317 735455704 735334473 734937973 734989395 734979858 734689026 734842300 734874573 734834366 734844208
2415.8 734844208 734800949 734811707 734717255 734359894 733907318 733732910 733428268 733152008 733192368 733484192
2425.4 733484192 733885574 733803024 733620987 733512573 733169174 732843399 732879410 732729187 731985703 731636505
2435.1 731636505 731879959 732106857 731982117 732104263 732682571 732668610 732145538 731726913 731540451 731409683
2444.7 731409683 731239700 730841904 730431671 730361023 730083694 730028763 730298080 730501099 730605011 730316544
2454.3 730316544 730132523 729749298 729030762 728840179 729070892 729099350 728842316 729017639 729355545 729180603
2464 729180603 728942795 728916931 729075012 729045105 728750992 728682861 728425446 727861633 727525406 727418365
2473.6 727418365 727449646 727508392 727557755 727377777 727049637 726987534 726994400 727162094 727377777 726762161 725813141
2484.2 725813141 725767288 725857010 725739975 725916290 725818710 725660477 725359573 725082245 725263596 725209579
2493.9 725209579 724998550 724764328 724590149 724310532 723867264 723713150 723812714 724133148 724109116 723867111
2503.5 723867111 723924789 723825684 723403625 723126144 723034592 722760544 722522430 722263489 722193451 722296753
2513.2 722296753 722347641 722671661 722635803 722319946 722110367 721806793 721639252 721595840 721178055 720569687
2522.8 720569687 720654449 720932007 721016846 721125488 721176758 720987778 720395126 720206833 720329056 720304565
2532.5 720304565 720065842 719554596 719341660 719378738 719408951 719315186 719259720 719326859 719376678 719481277 719362793
2543.1 719362793 718889923 718442078 718566895 718588409 717946320 717567139 717649307 717719879 717857819 718104782
2552.7 718104782 717975998 717718811 717737579 717612305 717241821 716976395 716899567 716732025 716397324 716024780
2562.4 716024780 715901718 715927277 716053467 716199799 715970459 715838623 715816040 715921097 716042862 715507126
2572 715507126 714766998 714502563 714518127 714175262 714197845 714691010 714733582 714579086 714267349 713933868
2581.6 713933868 713692856 713491669 713175125 712843094 712740402 712686005 712720261 712483826 712374878 712517014
2591.3 712517014 712673874 712780685 712422104 712292862 712065811 711481476 710885162 710381622 710426025 710639038
2600.9 710639038 710900116 710684891 710163040 710028381 709771194 709601669 709632492 709500656 709262772 709223480
2610.6 709223480 709115753 708631363 708425674 708535690 708138657 707661362 707889786 707970047 707832108 707789307
2620.2 707789307 707377625 706972809 706746292 706438370 705965576 705650940 705529327 705329285 705349808 705635757
2629.9 705635757 705590668 705098267 705008698 705225449 705000076 704167786 703640442 703842621 703573151 703154831
2639.5 703154831 703024368 703033905 702930450 702347107 702260361 702313309 702191238 702172775 701718826 701388779
2649.1 701388779 701313477 701051712 700873795 700707779 700174561 699727936 699809723 700054016 700269928 700348434
2658.8 700348434 699948425 699242249 698835449 698673630 698368301 697767105 697378464 697508087 697628937 697538071
2668.4 697538071 697198029 697075653 697454910 698042374 697893448 696921539 696705933 696689377 696329880 696004715
2678.1 696004715 695613632 695621262 695643768 695319977 694962082 695205154 695475540 695144348 694542313 693594360
2687.7 693594360 693440323 693607407 693131485 692822189 692683029 692763596 692860260 692779007 692740250 692867813
2697.4 692867813 692868423 692383881 691956711 691824188 691520081 690652008 689906464 689802704 690037994 690494308
2707 690494308 690459518 689898148 689618378 689719162 690113525 690049591 689002686 688606262 688876114 688524399
2716.6 688524399 688257065 687859802 687326050 687268600 687455597 687693253 687468567 687276764 687200165 686773300
2726.3 686773300 686490479 686053391 685357742 685260696 685406647 685092087 684929657 684814301 684617615 684838486
2735.9 684838486 684955215 684379654 683610764 683622055 683786774 683472824 683056335 682620697 682412415 682294693
2745.6 682294693 682266006 682173233 682050858 682152710 682025070 681738358 681435242 681169357 680914383 680673599
2755.2 680673599 680329208 679679794 679230194 679123077 679348373 679485092 679357758 679364014 679028473 678471146
2764.9 678471146 678347092 678344269 677616348 676754608 676708755 676559830 676057587 675825882 675826950 675975189
2774.5 675975189 676077957 675864258 675488663 675281754 674904022 674278336 673899307 673650360 673253326 672964630
2784.2 672964630 672892303 672458344 672339020 673001633 672894287 672190857 671650467 671001968 670467300 670226364
2793.8 670226364 670126114 669458542 668892899 669037857 669012527 668675919 668013000 667790527 667828217 667267456
2803.4 667267456 666881638 666629486 666104889 665604248 665577469 665535965 665034561 664393158 663750992 663748093
2813.1 663748093 663651657 663018341 662638092 662332764 662050476 661423645 660611725 660266342 660153732 659898834
2822.7 659898834 659275818 658563538 658238144 658185120 657873688 657561646 657293930 656635132 656226273 656041641
2832.4 656041641 655381927 654450607 653650970 653179550 652825699 652257843 651425095 650477676 649706421 648786850
2842 648786850 647866287 647252960 646213150 645054550 643876495 642525330 641352921 640045319 638932381
2850.7 638932381 638101463 637851601 637746506 636830025 636133537 636059380 636213875 635864067 635227432 634961815
2860.3 634961815 634518738 634110451 633931465 633756409 633378754 633404617 633607101 632838135 631707802 630880127
2870 630880127 630739746 630478172 629509811 628887863 628490143 627976074 627538338 627360001 627294960 627146454
2879.6 627146454 626961746 626417580 625611038 625314522 625226555 624673004 624188461 623755608 623384285 622940712
2889.3 622940712 622238464 621844749 621265869 620631523 620104713 619437141 618896294 618450165 617925835 616949043
2898.9 616949043 616276741 616067772 615751305 615365143 614804726 614507141 614324760 614065399 613903160 613615608
2908.6 613615608 613129692 612542534 612052536 611697350 611090050 610248604 609501266 608536415 608029594 607751350
2918.2 607751350 606939468 606218834 605222511 604712296 604842834 604672661 604491730 604264603 604046593 603907509
2927.8 603907509 604185257 604537277 604611435 604516792 604277267 604174995 604032364 604253311 604426155 604407578
2937.5 604407578 604825478 605076942 605373688 606169739 606880035 606976700 606848793 606839142 606705513 606458855
2947.1 606458855 606288071 606194000 606293564 606569519 606177406 605442200 604991493 604448433 604082222 604029579
2956.8 604029579 604178658 604246826 603757477 603045731 602881851 602908936 603117218 603911591 604228821 604170761
2966.4 604170761 604379120 604680939 604925079 605214920 605904617 606604767 607016869 607345772 607961464 608109703
2976.1 608109703 607771835 608393097 609379768 609753189 609843025 610440979 610999451 610867844 611047134 611803474
2985.7 611803474 612746048 613179741 613104858 613293114 613551292 613481255 613540802 613960075 613993988 613973846
2995.3 613973846 614156609 614133606 614228058 614304085 614115295 613895302 613808517 613830528 613835640 613760757 613776321
3006 613776321 613499832 613022766 613074303 613232574 613331528 613367157 613217545 612894974 612488441 612334175
3015.6 612334175 612037315 611338615 610710106 610847893 611143608 610809937 610343170 610088501 609875107 609402885
3025.2 609402885 609179878 608522224 607609558 607687302 607587128 607081757 606517029 606202431 606052132 605677567
3034.9 605677567 605513268 605133972 604865379 604311409 603347511 603124199 603190613 603129654 602921486 602710457
3044.5 602710457 602320175 601695099 601066780 600203743 599760284 599757118 599371910 598795586 598276711 597795258
3054.2 597795258 597651367 597438431 596584816 595877113 595859032 595832062 595511208 595206947 594645538 594023437
3063.8 594023437 593498192 593415184 593708458 593042450 592100296 591637955 591457710 590960655 589990692 590043297
3073.5 590043297 590223732 590102425 590300407 589871483 589201202 588194580 587282448 587477531 587360458
3082.1 587360458 586521111 585647278 585214500 585319023 584891930 584648895 584925995 584318199 583249092
3090.8 583249092 582672501 582571259 582028351 581530342 581563759 581053848 580661316 580398903 579947319 579603233
3100.5 579603233 578897400 578299828 578066063 577382393 576666832 576618385 576309853 575932655 575509834 574758263
3110.1 574758263 574443398 574067726 573732681 573621063 573584671 573074989 572353821 572164917 571188354 570350075
3119.8 570350075 570333252 570001678 568910370 567809258 567775497 567447319 566748619 566338272 566087990 565819550
3129.4 565819550 564890480 563953934 563616333 563399353 562663383 562330971 562254944 561386948 560423431 559818916
3139 559818916 559661064 559307976 558831291 558378143 557729378 557116280 556009750 555170746 555052338 554806366
3148.7 554806366 554275742 553820877 553232689 552794685 552622795 551621361 550869560 550534401 549977417
3157.4 549977417 549863548 549221191 548244019 547796364 547263451 546614838 546060257 545341835 544792252 544237862
3167 544237862 543580399 543240395 542510757 542028427 541962929 541251183 540634956 540237846 539414749 538637047
3176.6 538637047 537830849 536968193 536846275 536611748 536180801 535787964 535221138 534860306 533902626 533195038
3186.3 533195038 532734833 531990395 531774025 531282539 530411911 529476891 528875160 528573570 528317375 527913284
3195.9 527913284 527491302 527505074 526771393 525826836 525145340 524676132 524373627 523606873 523028984 522429810
3205.6 522429810 521990318 521517944 521253853 521317329 520433960 519719353 519544029 519089661 518290672 517914848
3215.2 517914848 517550812 516718102 516620712 516514702 515689430 514875107 514699821 514435272 513777390 513313293
3224.9 513313293 512585793 512286186 511893311 511052399 510612755 510013504 509509506 509147682 508648376 508082161
3234.5 508082161 507382851 506783943 506328430 506121750 506010666 505410233 504759445 504353943 504224701 504346886
3244.2 504346886 503638000 503034706 503023949 502606888 501864891 501226768 501003304 500480042 500336037 500107269
3253.8 500107269 499224014 498959885 498491974 497886086 497545280 497517509 497053947 496142235 495646477 495100937
3263.4 495100937 495233688 495139961 494612503 494331894 493988762 493983269 493848305 493131866 492115898 492033005
3273.1 492033005 491478119 490556030 490839996 490387535 489905319 489739456 489161835 488507042 488070602 487910652
3282.7 487910652 487345619 486847420 486424561 486262589 486210976 485675316 485053940 485095901 485251045 484584236
3292.4 484584236 484452858 484016647 483123550 482982521 482786369 482427979 481635780 480969467 480929337 480877647
3302 480877647 480178032 479193306 478822479 479213257 479808540 479354248 478334198 477333679 476643181 476226654
3311.7 476226654 475487671 474919434 474673157 474488792 473767509 473289108 472919350 472349052 472164154 471705551
3321.3 471705551 471539764 471272354 471054916 470702438 470031395 469348297 468019028 468189583 468608627
3330 468608627 467918015 467584953 467186775 466400986 465525551 465573044 465176888 464017525 463366280 462744064
3339.6 462744064 462320938 462092171 461784363 461120758 460596695 459986000 459225311 458793411 458257675 457901649
3349.3 457901649 457710342 457344475 456610336 456366768 456253014 455627022 454915352 454018402 454115334 454371948
3358.9 454371948 454090004 453502617 452287407 451447639 451012611 450631828 449904556 449394913 449315186 448741875
3368.6 448741875 447799988 447431755 447647324 447143021 446593361 446166763 445484810 444873276 444364548 444080887
3378.2 444080887 443429070 442998123 442728920 442389793 442067680 441965179 442152443 441392097 440763245 440371513
3387.8 440371513 440016403 440169182 439990349 439515953 438634644 438179016 438244858 438466339 438786774 438046875
3397.5 438046875 436977081 436657143 436587257 436216049 435818405 435634651 435115929 434582520 434845161 434827766
3407.1 434827766 434210663 434346809 434363594 433461304 432642708 432669525 432809715 432350655 431777954 431503448
3416.8 431503448 431898422 432528954 432919579 432285957 431419563 431550674 431509857 431468925 430826378 430082741
3426.4 430082741 430582924 430817451 430748863 430757484 430406647 430195007 430223160 430165710 430156212 430010948 429806404
3437 429806404 429852486 429978447 430050125 430050125 430222588 429799881 429574242 430320129 431125221 431271095 429576340
3447.6 429576340 429242210 430386543 430495224 430735359 431425247 431859360 431867905 431311226 430821381 431577759
3457.3 431577759 431952019 431406746 431690674 432053337 432724686 432936401 432800674 433563156 434003944 433707275
3466.9 433707275 433262749 433566437 433873825 434117699 434457016 434831772 435559425 435409241 435085335 435368118
3476.6 435368118 436022911 436865387 437663193 437815933 437312469 437013702 436748466 437428551 437656593 437936516
3486.2 437936516 439377823 439488068 439312210 440100784 441031189 440847969 440569611 441233063 441584625
3494.9 441584625 441792679 441575165 441768646 442595177 443239021 443841095 444853630 445453949 444467964
3503.6 444467964 444040298 444420013 444875145 445341263 446574898 447139091 446334648 447348824 448066063
3512.2 448066063 448425827 449082146 449380913 449844513 450147438 450937309 451437378 451371613 451378098 452813797
3521.9 452813797 454027557 452605133 452164268 452763748 453679695 453957748 454457664 455630302 455993805
3530.6 455993805 455946960 455812378 456764183 458028183 459680862 459576340 458210220 459387016 460313416
3539.2 460313416 460685997 460789452 461838112 463055458 463916092 464591904 463729057 464528580 463607140
3547.9 463607140 463957558 465977669 467549553 469533844 467855415 467779274 468607903 469490929 470974770
3556.6 470974770 470573006 471833344 472910309 472856140 472743416 474455299 475369148 475083961 478965263
3565.3 478965263 478446846 476204300 475254478 474402695 478341026 479818802 480733604 482176857 482859268
3574 482859268 483151970 483580399 484481010 484213448 486227913 487360840 486951332 488279724 490028954
3582.6 490028954 490841560 490722466 494424095 495314026 492285500 493345261 491123123 493307571 495965233
3591.3 495965233 498242722 498959198 498153381 501289597 499688721 500393181 503392639 503364182 505673637
3600 505673637 504952545 504138947 506587067 507923622 509236488 512429962 515214005 513834267 515849075
3608.7 515849075 513638687 512386513 519588890 519028473 515014648 518968086 518119621 521583443 525992622
3617.4 525992622 524614296 524639244 523450050 524041519 526433601 528394127 530922813 533455086 534741364
3626 534741364 536139336 542262764 541729851 529701233 533726654 538449745 543798561 544929771 542998009
3634.7 542998009 545141602 547732887 549452438 549069633 549976959 551923447 553911514 555013351 555579491
3643.4 555579491 558113480 561427078 566766815 563896103 559246864 565307617 562265739 557178574
3651.1 557178574 557590141 564391289 569342308 573119545 576829643 566160774 568243637 574315338
3658.8 574315338 575696220 576769485 577136269 578888779 579482346 580733376 582078362 582378006 586785622
3667.5 586785622 589460373 587970200 586985893 579178276 581845093 591727257 601618729 597410736
3675.2 597410736 574940910 579746780 589021606 594351578 591603355 591015701 593350563 595169945
3682.9 595169945 596903992 596548729 596431770 601143150 608125038 596954422 590321083 598772964
3690.6 598772964 592359161 591861496 598227844 599024773 600209274 599824448 598782921 600397568 600843773
3699.3 600843773 603048706 606166039 599678955 596282425 601815071 603599358 603195457 603815002 606441956
3708 606441956 610902405 603384514 606219292 609559517 595057068 600322304 604622536 604696083 605292435
3716.7 605292435 607764626 609277382 604811287 605427742 611639709 607519569 602077675 607850914
3724.4 607850914 608657837 607508659 604494171 604203682 608907318 610250092 615101089 610319443 602694893
3733.1 602694893 614532166 615230064 601368027 602158241 605525436 605481567 608170776 611698494 607231102
3741.8 607231102 610568962 623086929 612930908 594787025 605522232 611826515 617843590 615159111
3749.5 615159111 603180771 613876114 606523094 597478523 603648529 609049301 612862053 607552719
3757.2 607552719 610224457 615731850 605532455 603676987 609173775 611368141 611982117 615661049
3764.9 615661049 612602615 607206421 610739021 615970421 614723854 603194809 605029488 608906212
3772.6 608906212 609414978 609999123 609981995 611452637 612098923 614391594 613381157 604542847 607496719
3781.3 607496719 610648918 611503983 613394051 609591179 607921638 609348145 610327835 611248169 610643997
3790 610643997 610708199 610858841 611667671 611455460 612256203 616397362 611305084 605091095 607554665
3798.7 607554665 612999382 620696182 612808685 600489578 603747902 607095718 612710190 617348785
3806.4 617348785 604646378 600803871 607366180 609952736 610161552 610566216 610984230 612595291 617988586
3815.1 617988586 615645866 599066620 605566750 612777672 616809082 617549629 596244850 598596268
3822.8 598596268 605253754 607832298 610244141 609946747 605556145 605522308 607949982 612396660 614729156
3831.4 614729156 604422836 606922531 615021400 608301697 607926140 617464485 608502579 602434464
3839.2 602434464 609919281 603191299 602981033 610382690 606594620 602342491 606092834 608035736
3846.9 608035736 608671722 610889702 609589233 611868057 618980827 611467819 610516701 593460846
3854.6 593460846 594702759 605720825 604485283 602897720 605760002 608946533 611788330 603914948
3862.3 603914948 603312569 611899300 605125351 598567352 603577232 609857216 617092590 607646713
3870 607646713 596763458 601397591 608286476 611627121 599685860 600411072 605214310 605863533 608370438
3878.7 608370438 613040848 606230087 597425499 603618317 605015030 606992493 611684914 597071037
3886.4 597071037 598402596 602988853 604408913 609352913 608385353 598567314 599953041 603616791
3894.1 603616791 602600517 604227943 605581284 607738686 609181671 599312897 604513664 606405983
3901.8 606405983 599820290 604300537 600890617 599127159 600432091 601354790 603497467 603280029 603125801
3910.5 603125801 602564812 602781563 603533859 603138046 604310760 606253738 602188339 598178444 602642288
3919.2 602642288 602479401 598192177 601209297 603426399 604285469 602095070 598806953 600443497 602208214
3927.9 602208214 603442459 602176170 601817780 603552666 600094490 598217621 599469032 599641876 600521698
3936.6 600521698 601545753 600794029 600141792 600422897 602213783 602860718 597298012 596674385 598935165
3945.2 598935165 599967079 601474876 598977051 598947220 599294510 597017250 599198036 600005798 598937035
3953.9 598937035 599022255 599166145 598942299 597758179 597841606 598176575 598670235 598938522 597352638 597353630
3963.6 597353630 597966957 598056679 598502235 598136711 598484039 598310280 597227058 597988930 598247948 597713623
3973.2 597713623 597329559 597367134 597565269 596952133 597519150 597936287 597435570 596997566 597042007 597669182
3982.8 597669182 597418060 597255478 597239418 597135315 596666336 596150818 596507950 595895309 595187721 596144600
3992.5 596144600 597662048 597283249 595823479 596249313 596848373 595864639 595399895 596451454
4000.2 596451454
##END=$$ End of the data block
