##TITLE=$$ Begin of the data block
##JCAMP-DX=5.00 $$ ACD/SpecManager v 10.08
##SPECTROMETER/DATA SYSTEM=Varian
##DATE=18 Dec 2012 10:43:26
##DATA TYPE=INFRARED SPECTRUM
##DATA CLASS=XYDATA
##ORIGIN=
##OWNER=
##NPOINTS=3735
##FIRSTX=399.26403809
##LASTX=4000.35498047
##MAXX=4000.35498047
##MINX=399.26403809
##MAXY=74.86010742
##MINY=39.19488525
##XFACTOR=1.0000000000
##YFACTOR=0.000000100000000
##FIRSTY=63.78875732
##DELTAX=0.96440572
##XUNITS=1/CM
##YUNITS=TRANSMITTANCE
##XYDATA=(X++(Y..Y))
399.3 637887573 645362930 647303696 647766418 649148560 641334305 638824043 647592010 655086212 651472473
407.9 651472473 649075012 652892380 649836960 644630585 643153000 641826706 643986282 643277664 637893028
416.6 637893028 625972404 599972610 625127373 637859383 638489647 650254440 651077271 644265900
424.3 644265900 637221298 630817070 632740631 635387764 638809242 639014740 637749023 637945251 641406479
433 641406479 647058182 644069061 636462440 631935730 633922424 636918983 636716805 632395325 625524940
441.7 625524940 630014992 637143364 640600510 640856018 634948921 632398987 630137863 627874794 630322952
450.4 630322952 631623001 633419876 635410461 636093750 637143364 634991875 627518387 617610970 619691505
459.1 619691505 624962196 628672104 629547310 630893173 631371918 630175514 630618439 630916901 624697037
467.7 624697037 617803841 618106422 622933388 629807091 629456825 624713974 627766037 632078171 631516953
476.4 631516953 626077576 625285568 629286842 630769043 630775986 632599564 633960800 631530838 631974182
485.1 631974182 633753242 632551575 635198784 637014771 633964691 632508965 628989487 625907402
492.8 625907402 628288574 631407852 634128532 636193085 637219429 634899635 630601501 631257133 633042831
501.5 633042831 630759125 630651207 631104317 630472107 631786118 630758705 627549248 629013062 631749649
510.2 631749649 630258141 626200981 625211639 628041039 627305183 623895760 625088921 628182106 627039185
518.9 627039185 625802956 626842728 625067940 621791000 621679306 622469597 620307541 619747429 622163200
527.5 622163200 621624985 621815872 621934662 621450005 622824745 619463654 615896378 616657486 618158798
536.2 618158798 619788399 619987450 620599442 620889511 620642471 621128006 619843483 618621254 618678856
544.9 618678856 618491898 618278465 618624573 619720039 621404037 622296600 622146683 622590218 622972679
553.6 622972679 622377052 621488914 619363708 616975479 616565857 617987938 620429840 620953674 620583801
562.3 620583801 621832085 622165413 621760330 620500069 620032806 620890770 619402542 618811913 620750237
570.9 620750237 622552299 621401978 620295715 621169205 620180321 620552368 620124512 618086548 619247932
579.6 619247932 621000710 621569061 621242409 620594826 619862709 620065079 621014366 621624870 622686386
588.3 622686386 622024574 620765038 619588356 619002113 620212708 618982887 617817802 619153748 619240150
597 619240150 618241844 618315926 617593460 616381874 616611557 616141205 616204910 615903778 614443321 614359093
606.6 614359093 613173866 611307716 610734444 609514923 607628059 606224976 604911766 604264145 603293343
615.3 603293343 602269630 603189507 603579865 603144035 602699089 601334648 598745422 597574463 598974457
624 598974457 599798927 601614876 605064888 608505669 610961876 613359489 615977745 615602875 615400352
632.7 615400352 616406174 615843048 614898338 613774185 614214401 614921150 614670715 615070992 616800804
641.3 616800804 620058250 621408005 621942673 624038353 625552483 627072983 627794342 627143402 627477684
650 627477684 628765717 628938904 629753571 630419807 628777313 628722839 629913902 630410042 631347847 632801590
659.7 632801590 632336349 630532646 631251984 632170982 632278366 633686218 635788193 637679482 635394554
668.3 635394554 635234566 636344452 636985893 637123413 636812363 635591621 634930725 636809425 637800026
677 637800026 637948227 638064690 638775558 640759354 640294037 638683815 638475075 638957329 638278618 637229042
686.7 637229042 637913246 638146248 637803574 637812881 637817307 637319069 636427269 635752869 634476700 633675270
696.3 633675270 633460655 633310814 633669357 633505325 633455391 634449997 635526047 635135269 634647026 635705490
705.9 635705490 635853310 634869347 634901695 636260223 638242035 639135475 639452515 641187286 642513046
714.6 642513046 642444534 642519836 642786026 643185120 643438950 643173370 644148788 645786209 645018158 644411316
724.3 644411316 646769028 648706207 648642654 647965469 647304840 646719818 646939392 647596130 647404251 647692490
733.9 647692490 649293060 650517883 650549316 650377502 650596695 651428757 652240067 651454163 650634460 651322403
743.6 651322403 652386856 653989639 655890198 657100296 658303528 659121628 659421463 660487671 661327667
752.2 661327667 661980057 663061752 664032745 665324707 666595383 668044434 670128403 671227875 670773010
760.9 670773010 670787125 670974197 670638428 670480957 670533447 671235275 671098099 670920868 672111816 672882385
770.6 672882385 672871780 672414856 671999054 671750259 672332306 673170929 673484650 674680405 676469650 678306274
780.2 678306274 679762726 680966568 682447662 683233795 682468185 682063980 683379059 684317932 685087051
788.9 685087051 686201401 687595596 689288864 690372314 690097275 688260574 686739426 686099014 686836777
797.6 686836777 687489929 687334442 688179855 689708405 691814194 692736053 692709427 692076263 690888672
806.2 690888672 691003036 691396332 691443558 691054916 691545792 692409286 693384476 695450287 696115036 695940704
815.9 695940704 696649094 697335281 695748978 694023132 694653168 695368729 695949554 696481094 696948013
824.6 696948013 697513809 697871552 696947708 695048370 693813705 691863708 689652100 688889465 689025421
833.3 689025421 688712692 687322693 685462418 684394836 683756561 682475433 680737228 678111191 675744324
841.9 675744324 674129105 672792816 672248611 672570419 673458557 674191971 674867859 674722137 674178619
850.6 674178619 674173660 673860168 674272919 675560226 677178421 679021835 681015472 683889542 687140656
859.3 687140656 688803558 688986359 689561157 689596558 689866714 690567551 691340561 692819290 693648987 694876938
868.9 694876938 695994797 696870575 697826843 698422623 698186264 696810074 697048187 697199402 697321472
877.6 697321472 698108902 698462677 699018402 697753983 696390305 695495911 693678360 691765671 690326691
886.3 690326691 689150085 687707748 687407227 687669449 688298569 689949417 690762329 690742111 690432892
895 690432892 689420166 688540726 687638397 686890564 687902527 688664017 689272385 690744476 691368332 691213760
904.6 691213760 689868927 688464432 686735153 684114914 681866913 680249405 680093460 680273743 679474869
913.3 679474869 677867508 676608734 675508652 673661880 671725006 669512177 667690735 666170120
921 666170120 665249710 665190506 664496613 664208679 663988495 662600098 661129150 660021896 659696426 659555054
930.7 659555054 659021912 659146423 659699097 660511398 661731796 663154297 664634552 665755005 666813507
939.3 666813507 667630920 668353043 669419708 670768280 672764435 673981934 675133209 677196960 678670807
948 678670807 680292358 681791916 682681580 682805786 682423096 682218399 682052765 682327118 681950912 681283951
957.7 681283951 680756531 680020065 679133072 677571945 675607071 673061829 670726242 669380569 668630753
966.3 668630753 667926865 667089081 666291885 665810928 665319290 664592514 664118423 662400284 660161591
975 660161591 659140778 658525467 657694473 656739426 656668472 656517105 656192398 655698242 653920517 652231979
984.7 652231979 650756912 649084778 646908722 645016556 643851013 642522430 641690903 640718079 638740196
993.3 638740196 635389481 631687012 629282112 628050346 628312950 628680954 628311386 627968521 626726494
1002 626726494 625395699 624539299 623816757 622799225 620839310 619213486 618253517 617649002 617081909
1010.7 617081909 616481361 616214256 615703278 614441185 612316971 610784874 609785080 608527184 607563438
1019.4 607563438 606650696 605541458 603910561 602935295 602290497 600963974 599675255 598055191 595896873
1028.1 595896873 594390221 594017754 592605171 591451187 591556587 591271133 590985565 590540199 590309982
1036.7 590309982 589693375 589174194 588732910 588699646 589782639 589778709 589407921 589349823 589686165 590053253
1046.4 590053253 590946007 591905632 592035980 592568207 591676254 590802002 591049309 592061424 592465477
1055.1 592465477 591394768 592213860 592416725 592128944 592685509 592256317 591394768 590523682 590897331
1063.7 590897331 591264877 590822830 590111961 590213737 590804214 589778404 588317795 587636070 587741852
1072.4 587741852 587762299 588052063 588278542 587708588 587310524 587648087 588047180 587611961 587538757 586723213
1082.1 586723213 585944862 586331406 586046867 585762253 586044693 586381874 585997276 585994301 585572128 584373360
1091.7 584373360 583150902 582203827 582355576 580664749 578978500 578353119 577516174 576670113 574776001
1100.4 574776001 573947411 572983780 571109810 569686241 569142151 567655144 565361824 564590492 563389473
1109.1 563389473 562512016 560862770 559389153 559065361 558351326 557912178 556955299 556717453 555817032
1117.7 555817032 555742264 555986137 555745621 556710205 556606483 557373505 557391205 556800499 556803589 557108955
1127.4 557108955 557326927 556030006 556524124 557087898 557396774 557810593 558183861 558822479 557983627
1136.1 557983627 557664909 557423096 557320213 556596336 555420570 554300537 553484993 553787804 552603760
1144.8 552603760 552124939 551363258 550068321 549483032 548465881 548117561 547715721 548174210 548042908
1153.4 548042908 547819176 548232040 549262085 550837402 550877533 551654167 552415428 552903824 553944893
1162.1 553944893 555360641 557094116 559121628 561748199 563342743 565199585 567840652 571143532
1169.8 571143532 573719673 575666885 578180771 579901047 582080002 584270058 587081947 590535431
1177.5 590535431 593318176 595945473 597976913 600066872 602247047 603996696 604942741 605748520 606751022
1186.2 606751022 607708893 608905106 610139580 612100334 613787994 615233231 615943184 615621719 616513748
1194.9 616513748 617422295 617961349 618397446 618660583 620109138 622093086 623561287 624613914 625151634
1203.6 625151634 624875069 624643135 624602509 624329414 624410362 625151901 626281128 627021675 627558441 628136787
1213.2 628136787 628568192 628378983 627651443 627302399 627317467 627346115 627067261 627205849 627591896 627771034
1222.9 627771034 628081856 627946625 627812004 627615318 627184258 626603165 626071167 626167336 626471977 626858368
1232.5 626858368 627166328 627673912 627944794 628015137 628259811 628198204 628160744 627800560 627407990 627193947
1242.2 627193947 627561340 628494339 628873329 629193230 629427261 629307823 628755836 628449707 628540878 628283348
1251.8 628283348 628337440 628545990 628611603 628665199 628871994 628787079 628399200 628236465 628429031 629207268
1261.4 629207268 629331474 629056358 629242706 630011368 630893021 631134033 631513977 631870422 632091179 632575645
1271.1 632575645 633470268 633961105 633843269 634354286 635097122 635824203 636479073 637086945 637748146 638129044
1280.7 638129044 638602257 639245911 640040970 640700684 641425629 642639542 643639297 644235687 645193710
1289.4 645193710 646059418 646411667 647034760 648039856 649288788 650131302 650468369 651504364 652913971
1298.1 652913971 653447495 653592377 654368896 655181503 655719833 656440201 657166977 657788162 658340530 658602524
1307.7 658602524 658775101 659191360 659568558 659869995 660310822 660983582 661528625 661854630 662348557 662589722
1317.4 662589722 662610703 662934570 663545074 664131317 664383163 664801483 665546112 665932693 666051102 666499710
1327 666499710 666999969 667025757 667210236 667774582 668040161 667599869 666711273 666943054 667774811 667878723
1336.7 667878723 668004608 667953720 667594147 667404480 667773895 668196793 668158569 668102951 667740784 667647781
1346.3 667647781 668138123 668385010 668037033 667664642 667831345 667742691 667430267 666818542 666476822 666521454
1355.9 666521454 666235504 666051254 666118546 666798859 666863098 666204987 665295486 663934174 664194489 664170380
1365.6 664170380 663961639 663565750 662212448 661212387 661036301 661051941 660988998 660879059 659624405
1374.3 659624405 658760605 659365845 659875107 659592438 658803329 658680649 658576965 658241959 657878113 657882996
1383.9 657882996 658682709 660123444 661103516 660251999 660962982 662050171 662114868 662249527 662635193
1392.6 662635193 663207855 662633591 661859818 662217178 662480621 662516479 660871658 660074463 660119400 659977875
1402.2 659977875 659674759 659101028 658143616 657661743 657984695 657999268 657645798 657238159 656942062 656372986
1411.9 656372986 655465088 654717026 654177475 654443207 654308014 654695435 655817032 653464584 653705368
1420.6 653705368 655015335 655237579 654512939 652891617 653101120 654064407 654366684 654688034 655133743
1429.2 655133743 654958496 654980087 655047607 654788284 654799423 655428314 655967636 653202744 653326035 655346985
1438.9 655346985 656200485 656139450 656155243 656468430 656802292 656737366 656611633 656560059 656277084 655692596
1448.5 655692596 656473999 657742691 658176270 658189850 658835068 660031281 661035004 661741409 659142456
1457.2 659142456 657631607 659870377 660958405 662908096 664699631 666142807 667502289 665898361
1464.9 665898361 665667725 666985779 668305359 669259720 670114288 672252350 673702927 673217392 673344269
1473.6 673344269 675744858 678530960 679131012 679797592 681302948 682420883 683146286 683540878 684615707
1482.3 684615707 685522079 686530151 687296448 687709656 687551193 686620102 686968689 684690247 683400192
1491 683400192 684477844 685214615 685262146 685129776 685660095 681396866 681241684 680601959 678460159 678912582
1500.6 678912582 677999268 676901169 676284485 677336349 677621765 670398483 663651276 664422836 666537094
1509.3 666537094 665461349 666332397 664587936 661756897 661982269 661271896 660376129 655914459 654117355
1518 654117355 656303787 658325195 656311569 651666260 651238174 650779037 652040482 650335770 649695053
1526.6 649695053 649152145 647508469 647592392 647582397 647837372 647193527 645946198 642337646 642972336 643829269
1536.3 643829269 643756866 645638428 644158478 637066956 637396431 638364754 639019165 639900093 639876251
1545 639876251 638578072 640622940 641217651 641660614 641540680 640378342 642044754 642966080 643955460
1553.6 643955460 642495346 643252029 646179962 648184738 650242233 644605179 643254013 645509491
1561.4 645509491 647853928 649500275 650025711 649403305 649514847 651144257 652440262 652603073 649265060
1570 649265060 650645981 651905060 651736526 652455292 653106461 652893295 649005737 650095215 650664215
1578.7 650664215 650628052 650956268 650242462 650074921 649281693 648802643 647838516 646577301 646050186 644699631
1588.4 644699631 643880463 642417526 641592484 640534286 639445915 638145752 635724525 634354362 632645531
1597 632645531 631568604 629566078 627995987 626357079 624738464 623959312 621563797 620091019 618141136
1605.7 618141136 616567802 613859825 611502609 609328651 606304588 605612106 603447800 601969986
1613.4 601969986 599773483 599184990 599856453 590724792 589982376 589402008 588574753 585531273 584132118
1622.1 584132118 582434120 577604294 577860603 576812401 576523628 572893257 570598145 569580956 567735596
1630.8 567735596 566750908 564935646 565363655 565338287 562113228 558308372 559101067 559159698 558717804
1639.5 558717804 559454002 558287277 558880501 557927513 558323402 559843102 558303604 558061600 556322479
1648.1 556322479 559591827 561101532 563532143 566147652 569469719 564354210 560804405 563580322
1655.9 563580322 564620323 566093979 567025261 568663483 570393143 571531105 573062630 571629219
1663.6 571629219 573467140 574612007 575840263 577506905 579112053 579741745 579729233 583040619 583646965
1672.3 583646965 585898170 588400459 589273796 588869514 590408173 593461304 595233879 597593307 598103409
1680.9 598103409 600920029 605938950 609161797 606711807 605014305 609265671 611826630 613323860
1688.6 613323860 615214081 616597061 619376259 621486702 624313278 627640457 630894814 629562035
1696.4 629562035 632464943 636886520 640325089 639631271 637081108 644650497 649172134 651751404
1704.1 651751404 653852921 656184998 658134460 660479507 663915100 665607605 666820526 668649826
1711.8 668649826 670657349 673565521 675120010 675997238 677995605 680079880 676472778 678294373
1719.5 678294373 681005249 681456528 682004318 682438278 682534409 683569565 684709091 685733261 686986771
1728.2 686986771 688751450 688322601 688077087 690482941 692268448 688971100 684376678 688969955 692301102
1736.9 692301102 693696899 695558090 695784073 694845123 697451859 699102936 698274078 698671112 700930176
1745.5 700930176 702984619 704300156 705286560 705944824 708870621 710141830 710750732 714324875 716126404
1754.2 716126404 717509766 719205246 718117905 718979721 720743179 722536087 725429306 724289322
1761.9 724289322 723529587 726272354 727452164 727978592 729096451 729430466 727339172 728878250 731879044
1770.6 731879044 732100983 729190216 728088608 731561890 733553009 732805328 733758545 734130783 734717178
1779.3 734717178 734656296 733370819 734055862 735466537 736706772 736482010 736231766 736919327 737304535
1788 737304535 737827225 738768158 738320847 737862167 736517563 736069031 738620834 739196625 738585205 739717102
1797.6 739717102 741141129 741101685 739479523 740062180 739519424 739726715 741139603 741395264 741815872
1806.3 741815872 742012177 742319412 743060226 743331375 742141876 741938248 742537994 742580032 742933426 742934418
1815.9 742934418 743373566 743547668 743807373 744537888 744349823 744359665 744141998 744824829 745293732 742607117
1825.6 742607117 742720337 744639816 745876617 745093536 742352676 743762054 745718460 745785294 745387039
1834.3 745387039 745081863 745314255 745200729 744496536 745140915 745526505 746023178 746568909 747956696
1842.9 747956696 748601074 743875198 744883118 746294556 745725555 745095673 745324860 746237488 746674271
1851.6 746674271 747286301 747389221 747458649 747154236 746689377 746995926 746595764 746399689 746352310 746551514
1861.3 746551514 746793900 747085114 747349854 747331238 747763062 747493820 747754440 746598206 745007095
1869.9 745007095 746198273 746948090 747276993 747214737 747288742 747393494 747424927 747400970 747156830 747316971
1879.6 747316971 747153168 747088928 747193756 747414322 747086182 746699066 747268295 747329636 747712326 747707901
1889.2 747707901 746338577 746576462 747275162 747058105 746887054 746548462 745915680 746503677 746888733
1897.9 746888733 747132111 747349854 747064667 746810226 746415939 746608582 746481857 746434937 746825027 746554947
1907.6 746554947 746325073 746566544 746637573 746263580 746514664 746256943 745893402 745881271 745784302 746444855
1917.2 746444855 745181808 744664688 745669403 745909500 746184921 745181351 744437790 744950256 745260544
1925.9 745260544 745074997 744937897 745017090 744696350 744505386 744870758 745420227 744912949 744454880 744651108
1935.5 744651108 744417191 744285736 744213028 744317169 744322586 744574432 744282684 743085251 743611603 743896408
1945.2 743896408 743534012 743246002 742933426 742968140 743146820 743291702 742986832 742801514 742987747 743138428
1954.8 743138428 743060837 742828598 742700424 742192078 741806335 741981506 742166824 742287827 742491150 742560959
1964.5 742560959 742581253 742709351 742199631 741607513 741710739 741551132 741213303 741326370 741344681 741239777
1974.1 741239777 741318130 741396027 741335831 740820618 740256882 740070496 740067444 739995346 739834213 739951172 739925995
1984.7 739925995 739746246 739893341 739847336 739361572 739179001 739525452 739421997 738094788 737429657 738011856
1994.3 738011856 738265915 738094788 737922668 737844467 738078232 737741241 737331314 737281418 736985168 736720810
2004 736720810 736435165 736333771 736624908 736827545 736551056 736133728 735990372 735787430 735612488 735473938
2013.6 735473938 735241013 735199051 734772949 734098434 734297943 734711761 734805450 734677353 734305420 733960495
2023.3 733960495 733713989 733695297 733632202 733533783 733548889 733549118 733433075 732837524 732491150 732507248 732441788
2033.9 732441788 732435913 732156372 731677780 731631012 731982727 731739655 731330109 731284561 731136856 731030350
2043.5 731030350 730908737 730945053 730963135 730814056 730616684 730476074 730312653 730101929 730279694 730282974
2053.2 730282974 730210648 729920349 729546509 729581985 729035034 728482513 728294601 728306580 728423843 728444748
2062.8 728444748 728738785 728643265 728248520 728123398 728016586 727756958 727489243 727305832 727144012 726971207
2072.5 726971207 726843567 727047958 726932983 726793442 726985092 726818314 726487427 726062927 725867081 725769272
2082.1 725769272 725653076 725636139 725528030 725547867 725513077 725600891 725669098 725414734 725163193 725062866
2091.7 725062866 724894867 724643097 724588165 724559860 724563904 724601898 724878845 725091934 724861450 724444885
2101.4 724444885 723895340 723946686 724192123 724036102 723821411 723898392 724268341 724213715 724004517 723945007
2111 723945007 724039612 723836517 723541031 723501816 723122482 723172455 723205261 722936935 722938919 723010941 723286667
2121.6 723286667 723265686 723183365 723187561 723131866 723158951 722904434 722477570 722193146 722324219 722657776 722865448
2132.3 722865448 722824478 722554474 722454834 722552109 722282181 721918869 721920471 721796646 721917191 722106323
2141.9 722106323 722106857 722327347 722421036 722460480 722366867 722273026 721989517 721450043 721214294 721232452 721577530
2152.5 721577530 721743240 721671066 721781006 721949463 721856155 721539078 721329346 721001968 721026382 721405411
2162.1 721405411 721575699 721726074 721910400 721892242 721830292 721937485 721770706 721518402 721166000 720958252
2171.8 720958252 721157608 721277695 721401596 721241455 721305008 721242599 720648499 720596695 720670166 720860062
2181.4 720860062 721086044 720915833 720826950 720731964 720655136 721056366 721537170 721322250 720790787 720537872
2191.1 720537872 720494308 720540466 720700836 720674286 720584259 720569611 720486221 720856781 721131058 720977097 720697479
2201.7 720697479 720507889 720249100 719584579 719746704 720194016 720304871 720561066 720700607 720668182 720022049
2211.3 720022049 719534225 719468231 719583511 719710922 719606323 719711914 719453201 719365692 719657822 719774170
2221 719774170 719798813 719727478 719816513 719523773 718982239 718658829 718707352 718770828 718497925 718654099 719010239
2231.6 719010239 719040527 718837357 718738251 718641815 718440247 718399048 718301010 718148727 718060455 718259354 718273468
2242.2 718273468 718032761 718251190 718448029 718306503 718051605 717740555 717506104 717475128 717453613 717405243
2251.8 717405243 717381210 717471542 717619400 717631683 717601547 717108994 716752396 716713791 716633072 716645508 716259689
2262.4 716259689 716454391 716859360 716803360 717179337 717436218 717218170 716831665 716683197 716584778 716460571
2272.1 716460571 716557770 716773300 716806793 716619949 716645737 716554489 716660004 716577606 716314850 716478424
2281.7 716478424 716064072 715517197 715339661 715427780 715383835 715554352 716091766 716019974 716123734 716048508
2291.4 716048508 715536194 715333405 715717392 715868912 715041962 714972534 715331650 715759277 716183701 716077805
2301 716077805 716114349 715697098 715246964 714971085 714974136 715057373 714790802 715093613 715685730 716223831 716304703
2311.6 716304703 716281662 715912018 715157013 715014572 714836655 715255814 715289154 714703217 714913559 715458679
2321.3 715458679 716130371 715676727 714627151 714279175 714456635 714792099 715349731 715937729 715795059
2329.9 715795059 715669327 715410004 715436478 715644302 715687103 716055527 715890884 715978470 715867996 715360565
2339.6 715360565 715195847 715346756 716374741 716594620 716020737 715976257 716205444 715957718 715189972 715268555
2349.2 715268555 715765152 715711060 716239624 717006149 716714401 717092209 718437805 718423462 717378769 717092590
2358.9 717092590 716664200 716153870 716643906 716366119 715871582 716135941 715745239 715331039 715022812 714508667
2368.5 714508667 714705124 715501099 715353317 714242630 713807602 714337006 714913406 714954681 715211258 715362320
2378.2 715362320 714854813 714561081 714369583 714329529 714193573 713795090 713641205 713326035 713448029 713960571
2387.8 713960571 714311218 714811401 714690857 714262314 714142151 713864288 713583755 713541107 713467178 713376465
2397.4 713376465 713594055 713739853 713690186 713473053 713296280 713541031 713722229 713715286 713398361 713058319
2407.1 713058319 713069000 713076706 713106384 713146667 713238678 713052673 712674408 712499847 712274170 712063751 712017593
2417.7 712017593 712131958 711945038 711828156 712159119 712325745 712556763 712643433 712282715 711907425 711659470
2427.3 711659470 711362686 711057129 711029968 711121292 711216736 711399307 711512833 711407547 711212769 710740814
2437 710740814 710357666 710496826 710394592 710222473 710216141 710413055 710676727 710422516 710239029 710175781
2446.6 710175781 710115509 710020981 709592819 709225388 709208145 709305725 709127655 708983536 708885193 709024048
2456.3 709024048 709530716 709599533 709230881 708711090 708342743 708307419 708555145 708538666 708088379 707936859
2465.9 707936859 708145142 708628159 708483200 707774353 707546692 707484055 707485352 707318497 707066422 707033615
2475.6 707033615 707215576 707424240 707258072 707114410 706996155 706711807 706494598 706405945 706005783 705495682
2485.2 705495682 705749817 706083450 706073990 706066055 706140671 706249237 705785522 705091705 704814758 704793777 704823837
2495.8 704823837 704676743 704635544 704971237 704968567 704543076 704408798 704348984 704190979 704161835 704063797 703737259
2506.4 703737259 703293304 703149567 703269730 703214951 703217545 703348465 703417664 703338699 702932281 702609940
2516.1 702609940 702379761 702294693 702715530 702729797 702353745 702395935 702465134 702306061 702261963 702425079
2525.7 702425079 702389374 701953583 701520767 701533966 701379471 700745163 700562057 700759735 700953674 701131592
2535.4 701131592 701109085 701127548 700902939 700447388 700656586 700909729 700499802 700118103 699890289 699708710
2545 699708710 699789124 700224686 700427399 700194321 699933395 699477692 699333496 699137039 698770752 699070206
2554.6 699070206 699165649 698885117 698763657 698969574 698913269 698325195 698264008 698388062 698207550 698005371
2564.3 698005371 697833710 697541122 697336502 697411041 697339020 697366104 697394714 697035217 696461792 696208496
2573.9 696208496 696337280 696378555 696503830 696642685 696695175 696323318 695815277 695670242 695336609 695211182
2583.6 695211182 695334702 695327454 695339966 695246964 694767380 694338379 694492111 694304047 693872986 693909912
2593.2 693909912 693728256 693297729 693367538 693487930 693406067 693521729 693225937 692749405 692370529 692242584
2602.9 692242584 692296066 691910324 691853027 691909485 691731567 691233444 690724487 690870895 690932999 691292648
2612.5 691292648 691284714 690575790 690450211 690302124 690002975 689872818 689610825 689346313 689385605 689354095
2622.1 689354095 689099655 688884811 688509903 688014374 687409668 687181625 687486420 687631226 687356949 687229919
2631.8 687229919 687546310 687537766 687000732 686302643 686196289 686279984 685857925 685547180 685340576 685214005
2641.4 685214005 684771500 684498749 684659576 684487839 684226608 683642502 683428726 683485794 683218994 683094482
2651.1 683094482 682865448 682740097 682313538 682092896 682521820 682609863 682366562 681899567 681767349 681778030
2660.7 681778030 681655960 681713715 681410828 681100540 680793533 680250015 680097656 680205688 680059509 679551239
2670.4 679551239 679183655 679214249 679183121 678963089 678684235 678467102 678500366 678759613 678746796 678302231
2680 678302231 677931900 677659912 677409973 676999130 676625595 676646881 676115189 675359421 675302048 675377731
2689.6 675377731 675293121 675367355 675754242 675800400 675416336 675016479 674642563 674463654 674133453 673858566
2699.3 673858566 674105835 674167252 673685532 673313141 673002014 672479553 672360153 672625427 672611618 672246170
2708.9 672246170 671998596 671921158 671820908 671572189 671149979 670982132 670705795 670171509 669961395 669755707
2718.6 669755707 669228516 669065628 669423523 669439392 669292221 669372253 669372711 668926163 668381195 668370895 668188705
2729.2 668188705 667606125 666863480 666310196 666133270 665976181 666080704 666113052 666026459 665692520 665225830
2738.8 665225830 665130920 664890747 664912186 664950027 664649887 664455872 664197845 664157181 664090500 663864441
2748.5 663864441 663885956 663711090 663013992 662418060 662380981 662568054 662443924 662071304 661857300 661657715
2758.1 661657715 661548996 661365814 661090622 660836639 660304413 659999084 659725037 659479904 659424591 659274979
2767.8 659274979 659343262 659138794 658690796 658274918 657961273 657996216 657973633 657667618 657022858 656442871
2777.4 656442871 656153107 656053085 655999451 655722427 655350113 655020599 655015640 654768753 654051514 653799057
2787 653799057 653862686 653837433 653593826 653108368 652690506 652229233 651901016 651841125 651559143 651240768
2796.7 651240768 650759964 649970245 649468842 649071198 648930588 648874893 648309479 647817993 647404099 647081985
2806.3 647081985 647371674 647253036 646208496 645803528 645882263 645370178 644582901 643813934 643593750 643415222
2816 643415222 642980194 642837524 642535095 641922913 641144943 640908890 641006927 640740738 640433350 639611473
2825.6 639611473 638724594 638316383 637914047 637616272 637214012 636610832 636209259 635974045 635459404 634709549
2835.3 634709549 634116821 633655777 633137474 632380409 631178093 629735756 628465385 627418900 626479187
2843.9 626479187 625183182 623710632 622662735 621506729 620069885 618687439 617473106 616398849
2851.7 616398849 615452232 614844513 614290810 614065437 614354439 614369354 614416237 614826660 614739952 614358711
2861.3 614358711 614223557 613925476 613760719 613873329 613424263 612247925 611229591 610772743 610556793
2870 610556793 610447197 610125618 609727974 609364548 608650017 607993736 607598457 607375298 607272072 606912422
2879.6 606912422 606636963 606550636 606262970 606098213 605825539 605254822 604741478 603936844 603109665 602847900
2889.3 602847900 602845497 602656021 602043533 601003647 600267220 600206947 599724770 598647270 597975044 597832336
2898.9 597832336 597375832 596554413 595960693 595320587 595045166 594850769 594014053 593401260 593340607 593164825
2908.6 593164825 592186241 591223640 590879021 590593567 590049667 588982010 587962723 587112961 586187477
2917.2 586187477 585176506 584075394 582927208 581954193 581661377 581642685 581965446 582048378 581730843
2925.9 581730843 581629715 581244812 581368370 581445236 581185265 581446762 581426048 581451530 581759109 581999779
2935.6 581999779 582495384 583031273 583393707 583772926 583934441 584095535 584461975 584737434 585202637 585366440
2945.2 585366440 585337791 585602989 585316849 584508743 584148178 584339790 584012184 583222351 582645645 582331009
2954.8 582331009 582274246 581765594 581123962 581192284 581294899 581005363 581066437 581304283 581007957 580711021
2964.5 580711021 581006660 581415100 581359596 581424637 581849174 582386894 582930565 583340378 583866386 584424629
2974.1 584424629 584973869 585196877 585389061 585953751 586546669 587254486 587599068 587724648 587789116 587859268
2983.8 587859268 588241539 588506508 588627014 588380203 588583069 589407501 589706039 589742966 589848595 590090256
2993.4 590090256 590250931 590388680 590379982 590007858 590121574 590491180 590429802 590271072 590198822 589969444
3003.1 589969444 589764595 589413605 588658333 588406448 588564072 588444214 588168144 587902527 587923584 587820892
3012.7 587820892 587570992 587513542 586910629 586287270 586190376 585946732 585587654 585001335 584531097 584345131
3022.4 584345131 583905716 583645020 583506126 582692375 581598587 581005402 580631104 580613976 580585442 579960747
3032 579960747 579759254 579524422 578746986 577959900 577496109 577558975 577716827 577851334 577104683 575557137
3041.6 575557137 574766846 574566917 574244652 573829651 573249855 572519760 572360764 572218704 571410866 570718307
3051.3 570718307 570014610 569642982 569498253 568811073 568493347 568182640 567614365 567583923 566904716 565854301
3060.9 565854301 565325928 565018158 565051651 564525795 564050369 563692245 562580719 562046280 561905441 561675797
3070.6 561675797 561167374 560445595 560039787 559671707 559499321 559211197 559018364 559255219 559018936 558152275
3080.2 558152275 557512360 556889915 555855865 555344353 555085182 554659805 554312553 553921471 553624115
3088.9 553624115 553576202 553248634 552039490 551301765 551390724 551320229 550748177 549978523 549871101 549800224
3098.5 549800224 549354439 548649559 548103485 547860031 547632523 547350769 546526031 545805740 545371819 545118828
3108.2 545118828 544685974 543960495 543292046 542569542 542435913 542084351 541723557 541202126 540602379 540727386
3117.8 540727386 539992752 539454155 538905907 537962608 537387428 536624413 536151352 535592079 535561523 535054092
3127.5 535054092 533808861 533344383 532747574 532114944 531655693 531122360 530379601 530220566 529944344
3136.1 529944344 528785820 528371010 528013763 527541542 526974831 525758591 524751205 524315872 524123077
3144.8 524123077 523709564 523198013 522787132 522595749 521917038 521032677 520535355 519952240 519565353 518970375
3154.5 518970375 518279915 517530518 516776924 516371231 515871086 515134163 514265594 513776894 512998543 512190628
3164.1 512190628 511889381 511337776 510761147 510131264 509417877 508800888 508441544 507662506 506675797 506221924
3173.8 506221924 505618973 504989548 504591141 504333420 503516922 502952728 502722244 501557388 500537376
3182.4 500537376 499754448 499146996 498467674 497937164 497789650 496822853 496021690 495671120 495339470 495128746
3192.1 495128746 494790268 494245605 493418503 492685089 492045288 491158218 490048523 489511795 489501076 489490623
3201.7 489490623 488826981 487626038 487100525 486764603 486237335 485053902 484118767 484082870 483395767
3210.4 483395767 482508507 481863556 481810989 481574936 480706177 480095406 479225540 478905220 478760757 478093567
3220 478093567 477652359 477148323 476579323 476161842 475509720 474617767 474104996 473702927 473048820 472429352
3229.7 472429352 472055626 471654053 471439934 471341286 470472794 469621773 468963547 468609200 468620224 468252945
3239.3 468252945 467587738 466612587 466433525 466406250 465554123 464915543 464754829 465127220 464828949 463594894
3249 463594894 463020706 462948685 462311707 461488228 460768127 460032692 459935760 459779739 459428368 459502258
3258.6 459502258 459241371 458440094 457701836 457207680 457043266 456968307 456451530 455870247 455220795 454862213
3268.3 454862213 454860382 454654961 454414330 453620491 452879715 452253532 451871834 452125015 451807442 451349907
3277.9 451349907 451064453 450752106 450028229 449211388 449051399 448856812 448344841 447410583 446923866 446754265
3287.5 446754265 446065941 445647621 445871849 445938377 445336914 445007324 444413872 443352051 442719536 442560616
3297.2 442560616 442574539 442216682 441683846 440919800 440705605 440858536 440481796 439970131 439213943 438232460
3306.8 438232460 437039413 436851616 437190247 436546326 435718803 435364494 435384293 434813080 434263153 433772240
3316.5 433772240 433138580 432662277 431689072 431266975 431096230 430617027 430114937 429650383 429445152 428736649
3326.1 428736649 427902908 427311058 426688576 426219749 425787697 425031128 424425011 424207954 423852959 423591499
3335.8 423591499 422998123 421881866 420840683 420417366 420460091 420299339 419671135 418674316 418565216
3344.4 418565216 418506966 417706985 416861420 416119537 415875053 415173149 414524841 414428978 414230881 413775711
3354.1 413775711 412771416 412257652 411960907 411504936 411136208 410533028 410101471 409645844 408963318
3362.8 408963318 408257103 408062820 408217468 407628746 406516953 405898056 405638466 404985771 404539490
3371.4 404539490 404513206 404267540 403663979 402780647 402481918 402542648 401904221 401294098 400943832 400678558
3381.1 400678558 400472412 400040245 399983215 399558067 398947906 398841705 398452530 398353081 398095055 397825394
3390.7 397825394 398177376 397938843 397296066 397088547 396727562 396126938 396113396 395784798 395101280 395017395
3400.4 395017395 395051193 394991417 394576187 394354286 394598732 394705925 394549217 394009399 393407288 393112793
3410 393112793 392897797 393091507 394081039 393957558 392813377 392426071 392521019 392531013 392195053 392461243
3419.7 392461243 392708435 392232819 391948853 392252235 392829552 392390747 392138786 392263145 392023163 392009125
3429.3 392009125 392208099 392576828 392393417 392247047 392196693 392380676 392941132 393066940 393029747 392737389
3439 392737389 392665215 392899437 393352661 393095131 392703934 393414841 394007454 394635773 394064941 393689270
3448.6 393689270 394361496 394564705 395321388 395794487 396108551 396267166 395850296 395947800 396467171 397163620
3458.2 397163620 397392883 397568855 397880058 398216858 398672295 398621025 398805084 399361954 399288864 399156952
3467.9 399156952 399861870 400236931 400064964 400542755 401539879 402032852 402463570 403192711 403189392 403285217
3477.5 403285217 403668556 404121895 404448586 404273376 404753685 405634880 406162796 406017723 406387138 407475128
3487.2 407475128 407865067 407906151 407969017 408484154 408788681 409023094 409862785 410762062 411365395 411573105
3496.8 411573105 411968307 412020874 412157478 412886467 414168968 415388756 415253944 414995079 415243607
3505.5 415243607 415862122 416298180 417343292 417968025 417104950 417562447 418468208 419542198 419996147
3514.2 419996147 419958572 420478592 421018333 421567230 421569023 422472420 423518829 424321785 425276985 425356140
3523.8 425356140 425738373 426161804 427290535 428126602 428201637 428413887 428957291 429545326 429431458 430348740
3533.5 430348740 431146431 431817741 432197151 432021751 432990150 433402328 433975830 434561043 435370865 436388550
3543.1 436388550 436962433 437442703 437623558 439193115 439091454 439246674 440595779 441755028 443217354
3551.8 443217354 442538452 442774849 443192940 443899307 445395355 445497513 446124458 447164230 448352737
3560.5 448352737 448578491 450125847 451280479 450033379 451995468 452171707 451173058 451690102 451933479
3569.1 451933479 454298325 455067749 456026268 457518959 458580093 459118996 459372482 460460968 460641403
3577.8 460641403 461858559 463105202 463558693 464629478 465652885 466280365 466272736 468993721 470713577
3586.5 470713577 469210548 470531807 469878616 471169891 472843895 474577942 475222244 474867897 477645226
3595.2 477645226 476687737 477014923 479621048 480632782 482495003 481878548 482000275 483573494 484718933
3603.9 484718933 485919685 487275734 489451561 488449020 489863091 490005989 488869133 493976974
3611.6 493976974 495757484 494368553 496921120 495804749 497833443 500915565 500374870 501328392 501299629
3620.3 501299629 500714264 502219887 504453735 505990448 507648888 510001183 511796913 516147194
3628 516147194 517639313 509201813 511550140 514469299 518435211 520412903 518900223 520444450 523064461
3636.6 523064461 524979362 524980774 525828781 527684212 529490700 530629005 530448074 531914749 535134697
3645.3 535134697 540857925 541985970 538986893 544073334 542479286 538269844 538328018 542332306 545454025
3654 545454025 548225670 552009850 546705475 547673836 550858650 552333374 554424744 554799576 555973969
3662.7 555973969 556599083 558233299 560107689 560378456 563505821 565544243 564378357 564490662 560499268
3671.4 560499268 562229271 568668289 575864983 576202507 562435913 564567566 570733452 574587059
3679.1 574587059 573265190 572788277 574315796 575169983 575974579 576658897 577279129 580210228 583979378
3687.8 583979378 577171135 574624176 580881920 578302994 577319107 580084496 580136032 581343269 581931610
3696.4 581931610 581569710 581841812 581784439 583615036 586031151 582933884 580777168 584175568 585714264
3705.1 585714264 586154823 587172050 588724289 591789436 586513596 588316078 591589432 581512222
3712.8 581512222 585315285 588881760 589561424 590365753 591995316 593213997 590945206 591232262 594504547
3721.5 594504547 591634064 588106995 592693176 595123062 595569878 593801918 592175941 594169197
3729.2 594169197 594891167 598593254 595969810 590089836 596933098 595990219 588272133 589713554 592031555
3737.9 592031555 592534142 594673004 597593460 594540672 596623421 605601654 600584030 587312584
3745.6 587312584 592767220 596775856 602335167 600772858 590679169 597561111 593996582 590217934
3753.3 590217934 594267426 596845284 599007721 595215034 596533241 600235939 593751984 592700729
3761 592700729 596647568 597954674 597986298 600243263 597995872 595010185 597471352 600582581 600158119
3769.7 600158119 593475380 595018387 597037048 596753960 597471962 597596626 597923203 597880325 599969406
3778.4 599969406 600650749 595185928 596794739 598493767 598503151 599653473 597655144 597135849 598221779
3787.1 598221779 598196182 598444252 598355408 598318939 598291054 599075966 598936348 599082260 601223526 597750664
3796.7 597750664 595144653 597334442 599495888 602560501 598483429 593028870 595035858 596444511
3804.4 596444511 598840446 601743965 595890465 593382950 597090302 598578835 598420448 598337402 598149948
3813.1 598149948 599017372 602694283 601833649 592198753 595634804 599879570 603884735 605778618 592185516
3821.8 592185516 593393898 596889648 597587967 598905258 599396210 596245461 595787010 597079887 599471092
3830.5 599471092 600978813 594600906 596531258 601943245 597611084 596816673 602451477 596014938
3838.2 596014938 591879082 597841072 593856392 593459167 598623886 597574730 595879097 597451286
3845.9 597451286 597307205 596878624 598600311 598068428 598853302 603588028 601061058 601641769 588614845
3854.6 588614845 588504906 596236610 596403046 595077858 596575394 597924728 599218559 595568275 594958916
3863.3 594958916 599223976 594750710 591809921 594755554 597133484 600840149 594772644 589421043
3871 589421043 592820663 596911278 599298897 591985588 593094597 595814705 595351295 596494446 599913330
3879.7 599913330 597080879 590674133 595328217 596709061 596968193 599387093 588642540 590084038
3887.4 590084038 594460907 595792007 598404617 597808189 591663246 593014030 595800323 593920097
3895.1 593920097 593975410 594447441 596263046 597654266 590108490 593415031 594695206 591492729 595334511
3903.8 595334511 592800064 591604538 591858749 592009468 593619881 593562431 593823814 594099579 594196320
3912.5 594196320 594115334 593218269 593655205 594502678 591454659 589734459 593447456 594119759 591626625
3921.1 591626625 592862549 593507576 594025230 592460937 589926338 591602135 593042564 593455086 592470779
3929.8 592470779 592265778 593660774 591060371 589555931 591089058 591666946 591876144 591959953 591308784
3938.5 591308784 591245422 591284599 592020760 592904739 589500351 588881264 590404968 591138573 592175560
3947.2 592175560 590144043 590389328 591561928 590432701 591137581 590771408 590417747 590875397 590774536
3955.8 590774536 590315285 589516411 589287834 589037743 590014305 590670357 589479637 589604721 590242043
3964.5 590242043 590308990 590260010 589984016 590174561 589761009 588946991 589466820 589607124 589658585 590067482
3974.2 590067482 589741173 589244003 589197388 589791985 589327316 588653183 588500862 588402290 589236565 589397507
3983.8 589397507 589054718 588755798 588875618 589450722 589902687 590351562 589543533 588870964 588842812 588859787
3993.5 588859787 589069176 588462067 587989616 588090668 588332100 588401909 588550262
4000.2 588550262
##END=$$ End of the data block
