##TITLE=$$ Begin of the data block
##JCAMP-DX=5.00 $$ ACD/SpecManager v 10.08
##SPECTROMETER/DATA SYSTEM=Varian
##DATE=18 Dec 2012 10:43:22
##DATA TYPE=INFRARED SPECTRUM
##DATA CLASS=XYDATA
##ORIGIN=
##OWNER=
##NPOINTS=3735
##FIRSTX=399.26403809
##LASTX=4000.35498047
##MAXX=4000.35498047
##MINX=399.26403809
##MAXY=75.30362701
##MINY=39.55402374
##XFACTOR=1.0000000000
##YFACTOR=0.000000100000000
##FIRSTY=67.86904144
##DELTAX=0.96440572
##XUNITS=1/CM
##YUNITS=TRANSMITTANCE
##XYDATA=(X++(Y..Y))
399.3 678690414 651400146 639822845 645230713 650598297 638786697 625094185 630523415 640651855
407 640651855 645595627 647041321 646186218 647719193 645439148 639849396 642052155 645438080 644283218
415.7 644283218 645945587 645933685 638205872 642955246 637279320 633780708 640950470 648448944 644733276
424.3 644733276 637784653 633627548 630579567 628105125 630740814 632663498 634624786 638846970
432.1 638846970 637406158 634994926 635136795 633514061 635034065 638295670 634195251 628682022 628011894
440.7 628011894 629472771 636359367 637133293 630793419 631637001 634316559 634657288 631350899 627823982
449.4 627823982 634187279 639684143 639918137 641966019 639916191 636141243 632325745 628822517 629921570
458.1 629921570 631743050 629062729 625756989 629154549 632265244 633611336 635709152 633172607
465.8 633172607 627392502 622559891 624988060 626367645 623913994 624977493 622494316 619463310
473.5 619463310 619845772 621889725 626153259 627178879 627535477 627884979 629767418 631763229 633991394
482.2 633991394 637246933 633766518 630096550 629229202 627554245 627957153 629305267 629534798 627548332
490.9 627548332 627703362 628492737 628711548 630332756 630328217 631223450 631771774 629866371 627970314 628152924
500.5 628152924 628909035 625522232 624505043 626117325 627177391 627104530 625378647 626434212 627893410
509.2 627893410 627062988 625754204 625247765 625628204 624774475 622224121 620813599 623006630 625124016
517.9 625124016 625406876 627635956 627983742 624023743 619476509 618004761 618092155 618072281 619713478
526.6 619713478 620458069 620056534 619822197 617913132 617218742 618492050 617716141 616342621 616183395
535.2 616183395 616259956 614794846 614426651 617437706 619220657 619638863 619775009 618120079 617518730
543.9 617518730 618347969 617981186 616667099 615957069 616049576 615523796 616766129 620519333 622437668
552.6 622437668 622160339 619867401 617733269 617045860 616851768 617979050 618386383 619850960 620879669
561.3 620879669 618677139 618211365 619148445 619365158 619668198 620317688 619694214 617409706 616381493
570 616381493 617220268 618556786 619346809 620437279 621170006 620713921 619053040 618296509 618737297 617723083
579.6 617723083 618443375 618806381 618180885 620033417 619535713 619376907 620659943 620411110 619718475
588.3 619718475 618452301 618113327 617455063 617412300 618706245 617710304 616090279 615812454 615775642 616618843
597.9 616618843 617843246 616953697 615365219 614811401 614571648 613329773 612028465 612307587 612696152
606.6 612696152 613376007 612295532 610506516 610011559 608517075 606872139 604328575 602466812 601491127
615.3 601491127 600484581 601430664 601875877 601054001 600580673 601225586 600012474 598103600 598743553
624 598743553 599771729 601624527 604585953 608002968 609938202 611322174 613426514 614234924 614984627
632.7 614984627 614995461 613870468 613574638 614254837 614489250 613494949 612901764 613520355 615652161 618449783
642.3 618449783 620844574 622765503 623536987 623719749 625791664 628243256 627417030 626702347 628198204
651 628198204 628380127 627901955 628008575 628168602 629024506 630399361 631015739 630843773 631267281 631545677
660.6 631545677 630848007 630378418 630546532 631283188 632968140 634871674 635056801 632424278 635006142
669.3 635006142 635886383 635438461 635686226 635775757 634990120 634841919 635935364 637733459 639023361
678 639023361 638389359 637365570 637918434 639075279 639734650 639818001 639104805 637917824 637156982 636819458
687.6 636819458 636831627 637021942 637269630 637249146 636214256 635346069 635060272 634837303 634678345 633845024
697.3 633845024 633202438 633049583 632954521 633682289 634790688 635558662 635019035 634096069 634647141 635024605
706.9 635024605 634800034 635676117 636817856 637472420 638222427 638678207 639974327 642223892 642919083
715.6 642919083 642353745 642289047 642862625 643209763 643798447 645351334 645772018 645140686 645618286 646665878
725.2 646665878 647841873 648832397 648863297 648367767 647479553 647579498 648051224 647098007 647140961 648307724
734.9 648307724 649055634 649790192 650025635 650418091 651177216 651583862 651615295 651375580 651871872 652917099
744.5 652917099 654297867 656163940 657480927 658657684 659695358 659639587 659274139 660123444 662409515
753.2 662409515 664368973 665585327 666697159 667580109 668735428 670730667 672302322 671893845 671534348
761.9 671534348 671531830 670413132 669559097 670033875 671052856 671576767 672124939 672462692 672923279 673415909
771.5 673415909 673004532 672897186 672811813 672686081 672909164 673999100 675321274 676365585 678639374
780.2 678639374 680325241 681279144 682778168 684061737 684381104 683816528 683632126 684196625 685261688
788.9 685261688 686261749 688513489 689900589 689118423 689249649 689350510 689052505 688317337 687889633
797.6 687889633 687576370 687806015 689599380 690760803 692090836 692730637 693544159 694621201 693366699
806.2 693366699 692121582 691380386 691407623 692065430 692132797 692499771 694576263 696384888 696235962 696571884
815.9 696571884 697297974 698311920 698500671 697402267 696356201 695712204 696782990 698054504 697938309
824.6 697938309 697137146 697480621 697600403 695970535 693906326 691128464 689574509 689286575 688644409
833.3 688644409 687891541 686860504 685562363 684966660 685247040 684087753 681310806 678064880 675829391
841.9 675829391 674584351 672902527 672101212 672773437 674159317 674889984 674764099 674701996 674660873 674730148
851.6 674730148 674568939 675196075 676410904 677563019 679602814 681822281 683953629 686604919 689023590
860.3 689023590 689640656 689140167 689244995 690189056 690527420 691086273 692658386 693716431 695085831
868.9 695085831 696401215 698387146 699581985 698442917 698096619 697936554 698172531 698360062 698724289
877.6 698724289 699969940 699838257 699216461 698732147 697963867 696449432 694677811 692752838 690777130
886.3 690777130 689356461 688114777 687892380 688235474 689411469 690738297 690955963 691174545 690263748
895 690263748 689450607 689667511 688890152 688231583 688754578 689366760 689913254 690706177 691522903 691743774
904.6 691743774 690860519 689286728 686770782 684250565 682529068 680953293 680236282 680007019 679200745
913.3 679200745 678488388 678154373 677145386 675181580 672599030 670081253 668319626 666936951 666304703
922 666304703 666199265 665363083 664192352 663490448 662874451 662649536 662376022 661189041 660286942 659893112
931.6 659893112 659915237 660251999 660843353 662280197 663856506 665317688 666358109 667403107 668601456
940.3 668601456 668983688 669859390 670982056 672504425 674903564 676798401 678339691 679650879 681413116
949 681413116 682956314 683698807 683943863 683350983 682783890 682526855 682753830 682787857 682462311 681580505
958.6 681580505 680460968 679918137 678148117 675960999 673633957 670915375 670056992 669670563 668751526
967.3 668751526 667773132 666673050 666617355 666293869 665013580 663707809 662068481 660702057 659782867
976 659782867 658779144 658001175 657852173 657855377 657764435 657047424 655603180 654332047 652627563 651000748
985.6 651000748 649336090 647122345 645871735 645046997 644034424 642870483 641333694 639016228 636065407
994.3 636065407 632896080 630187035 629334145 628707809 627834435 627993050 628343506 627432404 626090927
1003 626090927 625392113 624305229 623077316 621482811 619567413 618428535 617865829 617191429 616736145
1011.7 616736145 616854782 616212120 615186234 614093361 612729454 610786438 608732758 607533989 606141853
1020.3 606141853 605540924 604908295 603735313 602601547 601017990 599966469 598555450 596762581 595326118
1029 595326118 594508286 592986336 591771889 592283554 591844902 591093788 590313721 590304337 591173096 590860596
1038.7 590860596 590147095 589789085 589617081 589580688 590101585 590429382 590901146 591098785 591279068 591822090
1048.3 591822090 591213570 591059990 590979042 591827736 593374481 593339348 593012581 593221207 594392281 594380226
1058 594380226 593389206 592944260 592648430 592460442 591620369 590815163 590484810 591119499 591441078 591204796
1067.6 591204796 590984001 590755844 590753822 589473724 588803101 588968887 589158669 589357948 588776093 587944756
1077.2 587944756 587196732 587696342 588185997 588218994 587970238 587823143 587836990 586715164 586610527 587339821
1086.9 587339821 587208710 586317520 586326752 586918259 586292038 584727669 583009415 582733955 581587219
1095.6 581587219 579860916 579331665 578341255 577004242 575643005 575164680 574617615 573511696 571505089
1104.2 571505089 569248581 567734337 566642685 565651855 563143539 562025070 561400261 560001183 559187393
1112.9 559187393 558563766 558922920 558293571 557515945 556760025 556246758 556198807 556526146 557594337 557332611
1122.6 557332611 557908440 558514404 558133736 557566223 557530746 557645416 556706696 557777061 558983078
1131.2 558983078 559529648 559503479 558575401 558426704 558038712 557884521 557397728 556981544 556628952 556245537
1140.9 556245537 555947609 555377007 555178032 554305573 553689957 552540855 551305351 550810394 550376167
1149.6 550376167 549963760 549238739 549428864 548964310 549240227 550242882 550821457 551857986 552190971
1158.3 552190971 552870827 553464890 554093628 554813156 556192932 558310280 560102501 562185707 564236755
1166.9 564236755 567066231 569888954 572531509 574998894 577421951 579693756 581132812 583799362
1174.6 583799362 586904373 589380608 591860390 594899139 597621727 599437752 601502686 603534279
1182.4 603534279 605119171 605971794 606875954 608019028 609524117 611243515 612359238 613898849 615453300
1191 615453300 616802750 617613449 618009682 618564606 618834991 619604454 620364189 620983238 622045593 623536682
1200.7 623536682 624853401 625645180 626313248 626391411 626511574 626355743 625929108 626372795 627047920 627743759
1210.3 627743759 628455772 629364128 630095787 629981804 629386063 629176521 629460411 629193230 628429184 628068199
1220 628068199 628366203 628523598 628822327 629669952 629957466 629588966 629134674 628634949 627736511 627456360
1229.6 627456360 627718964 627616119 628021545 628809853 629471817 629688339 630095253 629939537 629200516 629281731
1239.3 629281731 629056816 629094238 629322090 629519081 630260315 630652428 630781670 630789413 630794487 630517387
1248.9 630517387 630368271 630071754 629508781 629686890 629935799 630242081 630421028 630762329 630935974 630649719
1258.5 630649719 630508499 630219612 630784302 631192284 630943375 631057053 631595230 632307777 632542877 632934761
1268.2 632934761 633300133 633483582 634299126 635278625 635560608 635674400 636031227 636695442 637802658
1276.9 637802658 638278427 638467903 639015274 639614792 639935799 640467148 641753464 642394180 643015594
1285.5 643015594 644013519 644908905 646044083 646880417 647616272 648083801 648609848 649580231 650822067
1294.2 650822067 651941223 652492294 653438416 654430466 654871521 655470276 656466980 657201767 657311401
1302.9 657311401 657712097 658262405 659119873 660138779 660226669 660433273 661052628 661629791 661947174 662011261
1312.5 662011261 662512054 662897797 663547440 664511795 665028305 665291367 665409317 665634613 666007767 666469193
1322.2 666469193 666931534 667516098 667861938 668035965 668694916 669229889 669424591 669674835 670456848 670655899
1331.8 670655899 669746857 669187851 669268494 669884109 670301819 670042801 669575195 669347839 669368134 669505920
1341.5 669505920 670216370 670584106 670190964 669704437 669676285 669973679 670024109 670039520 670229340 670385971
1351.1 670385971 670149384 669731064 669090195 668747787 668631668 668326874 668379059 668439636 668828583 668459778
1360.8 668459778 667924500 667743988 665908432 666075821 666384659 665803299 665286102 664466095 664060440
1369.4 664060440 663691864 663372498 663322678 662972412 661857986 661213150 661419754 661183395 660435333 660145569
1379.1 660145569 660270615 660370789 660729294 660561676 660300598 660979385 662157898 662952499 662512131
1387.8 662512131 663245239 664028320 664130783 664558105 665024414 665823517 665329895 664021988 664411697
1396.4 664411697 664772644 664761276 662586441 661763077 662383347 662362442 661968613 661586914 660815430 660020142
1406.1 660020142 659900894 659868393 659848480 659277954 658628845 658360291 657695618 657282486 657074203 657157211
1415.7 657157211 657101440 657232819 658016357 655953979 655777893 656992340 657078171 656052246 654938202
1424.4 654938202 655643921 656426239 656478271 656936874 657443314 657044220 656973572 656802444 656269684 656605606
1434.1 656605606 657824707 658572159 655080109 655101089 657108688 657948303 658402328 658786392 658974075
1442.7 658974075 659284592 659256439 659165039 659345016 658920670 657746658 658778992 660077286 660259781
1451.4 660259781 660750351 661602783 662588654 663618317 664042206 661423798 660266037 662274704 663525314
1460.1 663525314 665580292 666973343 667964020 669487457 668303604 668214951 669534378 670454865 671236038
1468.8 671236038 672475052 675100174 676786194 675470810 675692215 678166428 680562897 681225052 682638550
1477.5 682638550 684337158 685099487 685771561 686363678 687361069 688268127 689130936 689567566 689979630
1486.1 689979630 690378265 689894485 690709534 688330078 685988541 687283096 687910767 687782288 687755356
1494.8 687755356 687783661 682896347 683516083 682963562 680335083 681170731 680530014 679515381 678982468
1503.5 678982468 680271759 681867523 676055756 667632141 666605682 668426056 667736816 668290710 666761627
1512.2 666761627 664245377 664368134 663872986 663181610 658826370 656377411 658615570 661275711 659525681
1520.8 659525681 652985840 653624878 654687729 656485519 653895493 652238159 651942825 650522232 650360870
1529.5 650360870 650073853 649816284 649313278 648467789 644879227 645607681 646349716 646590881 648517990
1538.2 648517990 644336319 639162064 642343903 643722839 642351837 642009277 642616653 641772079 643364410
1546.9 643364410 644090576 644559174 644303360 643574829 644793854 645135880 645894547 644664688 645693665
1555.6 645693665 648850021 651881332 652959824 644051971 645281754 648119431 650504456 651837234
1563.3 651837234 652286072 651997757 652490921 654014130 655332108 656423950 652150040 652940598 654608841
1572 654608841 654646149 655387802 656207275 656283722 651032486 652175446 653333969 653746109 654232254 653312683
1581.6 653312683 652952881 651996841 651483765 650697937 649348831 648374023 647022476 646462708 644906845
1590.3 644906845 644047318 642822952 641815414 640769348 638220444 636817245 635086288 633978043
1598 633978043 631873970 630359612 628760376 626695328 625531540 623153610 621989784 620214386 618672409
1606.7 618672409 615847244 613647346 611899643 608502693 607252312 604735489 603266144 601434059
1614.4 601434059 601006126 600980911 591829300 591557579 590262070 589068680 586519432 585674706 583908958
1623.1 583908958 578195686 578515968 577436218 577106133 573690834 571623840 570573730 568682442 567713814
1631.7 567713814 565765533 566198730 565643654 562105713 559809341 560166779 559973984 559689331 560431252
1640.4 560431252 559167633 559785309 559198036 560007858 561302643 559170074 560244942 558422203 561024361
1649.1 561024361 562262802 564659271 567799988 566810036 561932793 562423592 565780449 566826057 568517609
1657.8 568517609 569541473 570587959 572140579 573509941 574614830 573209610 575448532 576975060
1665.5 576975060 578522491 579944458 581081810 582605820 582962303 585642853 586088371 588628387 591466408
1674.2 591466408 592058678 591466217 593480453 596513901 598149490 600561867 600979233 603461227 607822495
1682.9 607822495 609493790 608762817 607998314 612203102 614839630 616319389 618197174 619547844 622382355
1691.5 622382355 624711266 627509689 630706062 634010239 633348427 636081963 640211563 643774872
1699.3 643774872 644052429 640992126 647993927 652485733 655637512 658413315 660483780 661831436
1707 661831436 663892822 667131348 669031296 670358963 672000122 673869781 676629791 677968750 678334808
1715.6 678334808 680638351 683323364 680070038 681870117 684288406 685045547 685842896 686118774 686123352
1724.3 686123352 686983185 688274460 689473877 690624313 692151947 691592941 691835785 694852524 697461624
1733 697461624 693829193 687898865 692482605 695846634 697565155 699520264 699536133 698753662 701548538
1741.7 701548538 703238373 702329788 702848663 705190506 707070389 708184738 709573135 710556107 713062057
1750.4 713062057 713846054 714109573 717652206 719948654 721566315 723158340 722160339 722753830 724667435
1759 724667435 726629257 729235077 728759384 728192749 730208817 731076965 731862259 733231277 733763123
1767.7 733763123 731893921 733125992 736117020 736706238 733879318 733021545 735999756 737332001 736594849
1776.4 736594849 737883530 738647690 739479980 739452744 737869949 738278961 739671478 740867004 740285034
1785.1 740285034 739858017 740918884 741678619 742158051 742853622 742158813 741568451 740436096 740172958
1793.8 740172958 742812042 743772812 743214645 744100723 745401535 745387878 743963547 744385147 743956528
1802.4 743956528 744223785 745333557 745599365 746063080 746220169 746455307 747191696 747429276 746016541
1811.1 746016541 745972061 746570511 746611938 747380066 747612228 747921219 747894363 748073807 748692169 748515778
1820.8 748515778 748905716 748665695 748899765 749430618 747072449 747005310 748725204 750084763 749848175
1829.4 749848175 747070770 748076477 749934769 749981537 749702225 749655609 749807205 749480209 748992615
1838.1 748992615 749635468 749938736 750565109 751180038 752567291 753036270 748060074 748986816 750613327
1846.8 750613327 750305023 749834747 750345459 750921021 750922165 751568756 751691666 751834488 751733856 751379318
1856.4 751379318 751482849 751005173 750882721 750861435 751042404 751118469 751553726 751891098 751602554 752051849
1866.1 752051849 751995773 752188950 750850372 749314117 750507812 750978470 751104736 751354370 751885681
1874.8 751885681 752325745 752373199 752121582 751848068 751981049 751908264 751939316 751905365 751913834 751478653 751265945
1885.4 751265945 751896057 752090454 752562103 752078552 750388031 750723114 751473923 751423187 751426086 751386185
1895 751386185 751077194 751504898 751685867 751775284 751872253 751616440 751243286 751028595 751474304 751421204
1904.7 751421204 751238251 751280823 751176224 751088409 751039505 750711670 750393448 750970230 750935135 750982132
1914.3 750982132 750882797 750708923 751523666 749880524 749253159 750212402 750554199 750847321 749590530
1923 749590530 749057922 749871597 750268631 749963303 749947739 750050735 749680481 749738846 749840546 749944763
1932.6 749944763 749762726 749684830 749678726 749071884 748576584 748562088 748800354 748682938 749162674 748853531
1942.3 748853531 747347031 747976532 748576126 748592224 748479385 748266220 748095703 747893372 747934570 747903595
1951.9 747903595 747808456 747837753 747962570 747578354 747272034 747292786 747075500 747179947 747089310 746907501
1961.6 746907501 747050934 747260361 747357788 747412338 747636871 746889267 746006851 746191559 746264572 746042023
1971.2 746042023 746037369 746121445 746198196 746459351 746539841 746212692 745843811 745455780 745018997 744858170
1980.8 744858170 744895630 744964676 745019379 744866791 744974976 745329819 745138626 744462967 744066849 744345245
1990.5 744345245 744627914 743477783 742498779 742886276 743098602 743088226 743290710 743422546 743209229 742757187
2000.1 742757187 742561340 742264786 742070312 741836777 741601105 741669922 741619110 741547089 741215897 740965195
2009.8 740965195 740766144 740649185 740727386 740418777 740253067 740248795 740145874 739656754 739393768 739664154
2019.4 739664154 739678040 739751282 739583359 739051056 738791733 738969040 738889847 738558807 738545303 738383408
2029.1 738383408 738341751 738268661 738067017 737934341 737669525 737289581 736974411 736963730 736874847 736961060
2038.7 736961060 736824265 736458664 736393509 736502762 736752930 736423721 736261520 736140442 735724869 735549774
2048.4 735549774 735232697 735018234 734960632 735396957 735565109 735417786 735252686 734887772 735246277 734987793
2058 734987793 733914795 733215866 733371353 733664474 733576431 734226379 734347687 733752594 733435822 733131332
2067.6 733131332 733022919 732814178 732461319 732390137 732741165 732641525 732402420 732526398 732579346 732470779
2077.3 732470779 732052536 731752167 731325684 731306763 731512299 730921478 730492706 730473022 730646973 730778961
2086.9 730778961 730839996 730870056 730703354 730593491 730558548 730467987 730366516 730648193 730597916 730327988
2096.6 730327988 730429230 730279541 730183258 729986343 729736633 729669418 729551468 729458542 729131165 728993073
2106.2 728993073 729338379 729718552 729867783 729765549 729616623 729573517 729265823 728822708 728838654 728888855
2115.9 728888855 728871918 728782578 728307037 727992706 728188858 728572845 728977509 729126282 728882370 728754959
2125.5 728754959 728594360 728401871 728236084 727894135 727979279 728250504 728407288 728389130 728085022 728089600
2135.1 728089600 728176727 727861404 727629547 727677994 727726135 727924118 727874985 727687149 727864609 727813416
2144.8 727813416 727750549 727741318 727514114 727325592 727051239 726824188 726959991 727300720 727467346 727654877
2154.4 727654877 727968597 727968750 727657013 727331924 726825638 726365204 726667328 727178345 727304764 727441483
2164.1 727441483 727683105 727610321 727518921 727690506 727542267 727337646 726913910 726408539 726623459 727060852
2173.7 727060852 727370987 727321320 727070847 726940765 726722488 726491776 726392365 726533432 726718216 726653976
2183.4 726653976 726460190 726623230 727075272 727302017 727225418 727011337 726803665 726685867 726776199 727008591
2193 727008591 727214508 726915359 726559982 726607819 726467819 726598663 726990433 727214127 727081375 726620865
2202.6 726620865 726145477 725647888 725649948 725913010 726290817 726584625 726473618 726447067 726486740 726695175
2212.3 726695175 726519699 725928955 725661011 725664291 725554733 725360260 725621262 725873566 726084976 726230240
2221.9 726230240 725992203 725785217 725554886 725245209 724991684 725044174 724944305 724796066 725024109 725305710
2231.6 725305710 725503082 725161362 724992218 725140533 724851837 724404068 724029617 723885269 723895340 724142151
2241.2 724142151 724397354 724406586 724503174 724689941 724587708 724333038 724230423 723955460 723742905 723460388
2250.9 723460388 723193283 723352051 723598557 723932571 724067764 723863831 723527069 723397675 723213654 723017807
2260.5 723017807 723086395 722793350 722907944 723195953 723182983 723471146 723513565 723442078 723389893 723084106
2270.2 723084106 722792587 722651367 722536087 722848206 723343887 723549042 723608627 723209991 723058701 722898407
2279.8 722898407 722367020 722093277 721862335 721827164 721762848 721898651 722241287 722547684 722733688 722675247
2289.4 722675247 722794495 722559814 722322388 722158661 722021255 722107468 721856461 721728973 721748505 722147217
2299.1 722147217 722531433 722794418 722816162 722249146 722351837 722071838 721530304 721479645 721332016 721746750
2308.7 721746750 722555618 723388367 723377304 722897339 722434845 721776123 721638870 721501389 721501617 721309128
2318.4 721309128 721626053 722594757 722203674 722080078 722699585 722175217 721626053 722068329 722224197 722083969
2328 722083969 722024002 722044067 722411957 722157440 722525635 723297424 722830734 722084808 721307678 721421738
2337.7 721421738 722031479 722087631 722219696 722359619 722521210 722690201 722033005 721001968 721242828 721614838
2347.3 721614838 721743546 722661438 723212967 722784805 722835236 723262787 723215866 723005829 723070145 722798767
2356.9 722798767 723384018 724857788 724356232 722801514 721644974 721107559 721296539 722488937 723200760
2365.6 723200760 721705704 721318741 722132263 721749115 721369476 721634979 721804352 721363220 721415253 721832733
2375.3 721832733 721476288 721345215 721635513 721831589 721787567 721420212 721507950 721596909 721067352 720920792
2384.9 720920792 720973663 720816956 720910568 721124573 721235504 721223984 721322250 721333313 721132355 720880890
2394.6 720880890 720503540 720529404 720735092 720601044 720529938 720569839 720448532 720592499 720898895 720456085
2404.2 720456085 720119934 720217056 719975739 719840164 719697952 719528885 719816666 720301895 720423355 720209427
2413.8 720209427 720065155 719753952 719256363 719121933 719162750 719020004 719257889 719575195 719568634 719797211
2423.5 719797211 719892273 719598846 719087524 718649902 718571396 718476562 718227310 718048553 718235092 718705063
2433.1 718705063 718904648 718705826 718600006 718590164 718434906 717858810 717128677 717342911 717784348 717854538
2442.8 717854538 717807236 717560959 717493362 717426605 717484055 717264099 716906967 716975327 716859589 716698303
2452.4 716698303 716368790 716369629 716617966 716603546 717065735 717155304 716640015 716340332 716121063 715824051
2462.1 715824051 715660858 715549240 715376053 715406418 715454712 715783310 715964127 715364761 714959412 715078583
2471.7 715078583 715131760 715042572 715020752 714792328 714803314 715024185 714640198 714246902 714112167 714022064
2481.3 714022064 713741302 713372803 713248215 713272629 713373566 713220367 713511658 714003525 713884583 713689957
2491 713689957 713181839 712675705 712405701 712182388 712081909 711889954 712004242 712201996 712146988 712113724
2500.6 712113724 712367096 712361526 711796799 711772079 711890411 711636810 711316833 711161575 711205597 710823975
2510.3 710823975 710766907 710886536 710808563 710877304 710552673 710583267 710683975 710435562 710295868 709901657
2519.9 709901657 709650726 709737473 709906998 709929657 710024109 710052795 709878006 709822769 709435043 709163666
2529.6 709163666 709040375 708822784 708712997 708637466 708886871 709058914 708947601 708504562 708231049 708309937
2539.2 708309937 708018112 707758102 707757187 707923508 707937088 707859268 707851868 707628021 707325211 707146683 707316895
2549.8 707316895 707022247 706768036 707275620 707386475 707249451 707154541 706930923 706543121 706269760 706208878
2559.5 706208878 706085281 706180878 706300201 706273575 705960922 705563812 705483246 705598450 705903778 705900803
2569.1 705900803 705342712 704943924 704897919 704508286 704210892 704181824 704012756 704330597 704619370 704397049
2578.7 704397049 704097214 704158173 704243851 703744812 703396835 703070297 702653275 702701569 702980042 703022461
2588.4 703022461 702643356 702420807 702327957 702098007 702032471 701926880 701640930 701426849 701233978 701245117
2598 701245117 701388474 701008377 700606155 700655136 700760803 700473099 699855881 699559708 699501419 699297714
2607.7 699297714 698915329 698922577 699198685 699279938 699491959 699188843 698469696 698192291 698139954 698101044
2617.3 698101044 698086929 698027191 698022614 698020859 697536697 697004089 697001953 697007751 696493607 695939789 695846634
2627.9 695846634 695840530 695834961 695705948 695537109 695145721 694666901 694572372 694179687 694151306 694316330 693957748
2638.5 693957748 693837128 693809280 693848495 693530426 692979965 692705231 692485886 692480011 691988144 691465988
2648.2 691465988 691773148 691852646 691496201 691266556 690988541 690791245 690759583 690670242 690747681 690587769
2657.8 690587769 690195312 690009232 689659271 689593353 689853668 689798508 689403305 688690643 688391495 688608170
2667.5 688608170 688689270 688700409 688202209 687557068 687642670 687890015 687521515 686707535 686655273 687107544
2677.1 687107544 687118149 686858673 686387405 685957108 685480957 685392914 685517960 685121231 684821167 684388885
2686.8 684388885 683905411 683811340 683986664 684108429 683956375 684092255 684005890 683632050 683474045 683328552
2696.4 683328552 683169861 682618942 682129593 681974106 681648407 681690063 682070236 681998596 681506500 680959854
2706 680959854 680803757 680793152 680623932 680598450 680351562 680344467 680381317 679770050 679374847 678976059 678891907
2716.6 678891907 679216156 678814850 678159103 677826233 677766037 677703857 677660522 677585449 677427139 677532806
2726.3 677532806 677117310 676327438 676142044 675970993 675522842 675159836 674713593 674406128 674639587 674941788
2735.9 674941788 674778137 674128418 673715134 674072952 674139557 673668518 673404388 673025055 672733917 672701721
2745.6 672701721 672536545 672319565 672285233 672576447 672465439 672108383 671757431 671073380 670832214 670872421
2755.2 670872421 670977631 670710983 670148163 670356369 670420837 669942017 669323578 669073715 669202499 668918304
2764.9 668918304 668574524 668383331 668361130 668110886 667414474 666799469 666468964 666294785 666139221 666206589
2774.5 666206589 666005859 665706940 665520477 665117264 664789734 664429779 664338226 664078064 663445129 663150101
2784.2 663150101 662896729 662666626 662777252 662958221 662585220 661990204 661539917 661118622 660728531 660303040
2793.8 660303040 660173874 659921799 659498672 659353638 659095383 658511200 657830124 657363129 657235947 657323761
2803.4 657323761 657148514 656806793 656351929 655869370 655493164 654916534 654745865 654581680 654223099 653997879
2813.1 653997879 653562851 653395920 653086624 652438126 651987686 651663055 651054459 650329437 649966660 649599838
2822.7 649599838 649570694 649466095 648434143 647427216 647172546 646869507 646051331 645453720 644950714
2831.4 644950714 644683380 644593353 644025269 643316345 642645874 642245712 641529007 640501022 639645271 638582840
2841.1 638582840 637768402 636856499 635543060 633886490 632281075 631409988 630139999 628530388 627298164
2849.7 627298164 626101799 625087357 624304619 623750992 623189430 622864494 622942238 623132553 623670387
2858.4 623670387 623950424 623893547 623708458 623007431 622393723 621888390 621706696 621590729 620530472 619635391
2868.1 619635391 619212990 618923416 618781891 618290367 618187103 618270035 617548561 616679230 616163330 615683250
2877.7 615683250 615605316 615810699 615581093 615202637 614771309 614420052 614159241 614048615 614099236 613306046
2887.3 613306046 612290077 611748314 611326981 610910187 610042992 609518738 609411621 608586502 607698669
2896 607698669 607042503 606428833 606283798 605871353 605286980 604953232 604268684 603581619 602986603 602617912
2905.7 602617912 602237129 601499138 601030235 600743561 600494995 599589844 598692017 598656082 597934570 596777229
2915.3 596777229 595997887 595299454 594450073 593229370 591802559 590762825 590369225 590117302 590126801
2924 590126801 590136566 590127411 590282364 589843292 589365578 589689369 590072289 589593735 589424973 590081558 590704460
2934.6 590704460 591239891 591231880 591217842 591817894 592363777 592308235 592352180 593102722 593711090 594201279
2944.2 594201279 594332733 593921242 593708992 593511810 592960358 592457581 592654266 592645531 592198792 591792793
2953.9 591792793 590968285 590725288 590879211 590339355 589829407 589688644 589712067 589838142 589864311 589494247
2963.5 589494247 589389153 590089798 590348778 590341568 590789223 590952225 591268768 591778374 592003174 592340965
2973.2 592340965 593015175 593686523 593756294 594004059 594686508 595330811 596027527 596389885 596565170 596759224
2982.8 596759224 597105560 597379494 597462616 597600555 597497902 597754402 598444557 598973351 599218864 599300499
2992.5 599300499 599480247 599338264 598957024 598900642 599010391 599123344 599369659 599281616 598925438 598911018
3002.1 598911018 598886375 598428230 597497368 597067108 597153969 597219391 597826576 597850342 597107468 596893387
3011.7 596893387 597024956 597083359 596739655 596208801 595683556 595151291 594960556 594511681 593991241 594124908
3021.4 594124908 593699608 592681198 592244682 592246246 591962547 591253891 590817871 590330353 590001717 590021629
3031 590021629 589381142 588850365 588791161 588570824 588110352 587674179 587004471 586324463 586436539 586156273
3040.7 586156273 585247192 584414024 583850403 583512077 582843857 582273254 581720886 581403542 581060333 580319633
3050.3 580319633 580121269 579698830 579057045 578572884 577987251 577713089 577028580 576038589 575627975 575383949
3060 575383949 574945755 574542274 574260521 573879814 573354797 573250122 573066597 572050323 571382637 571343346
3069.6 571343346 571039543 570222435 569331245 568936844 568716698 568504829 568387337 568155174 568027420 567823410
3079.2 567823410 567089195 566398659 565949936 565534630 565051651 564497566 564366417 563896675 563153839 562960358
3088.9 562960358 562779007 562307968 561505356 561008263 560511665 560030632 559922981 559101334 558491020 558274040
3098.5 558274040 557574921 556972275 556804085 556830025 556452408 555856094 555503159 554889603 554003334 553558311
3108.2 553558311 553112679 552767830 552567673 551623650 551002350 550905914 550632935 550020638 549018707 548682785
3117.8 548682785 548739510 548100815 547298012 547055473 546799202 546357384 545676193 544820747 544456329 543998451
3127.5 543998451 543601494 543184509 542419662 541701012 540801353 539949150 539167404 538772087 538577080 538134689
3137.1 538134689 537736969 537213974 536582336 535776062 534835052 533782768 533147507 533200455 533039513 532418633
3146.8 532418633 531815910 531339111 530612030 529869232 529204979 528835258 528541946 527738686 526728287
3155.4 526728287 525795364 525637054 525218315 524307594 523954391 523217964 522243996 521600838 521002769 520072975
3165.1 520072975 519442978 519214821 518708725 518290024 517662621 516908951 516177063 515390205 514555397 513854866
3174.7 513854866 513330078 512701836 512382851 511748276 511049423 510363235 509347763 508784447 508457298
3183.4 508457298 508044357 507127342 506405144 506182365 505814552 505192833 504531708 504049759 503055458 502094307
3193 502094307 501211319 500636635 500578918 500115471 499670067 499010925 498150024 497323418 497053261 496727676
3202.7 496727676 495755157 495430107 494966545 493946686 492763329 492320862 492483330 491920586 491010780
3211.4 491010780 490258598 490185776 489744225 489155655 488727303 487663689 487335815 487290688 486556473 485719757
3221 485719757 485141716 484297600 483664017 483219376 482214241 481803474 481347847 480687790 480287590 479524307
3230.7 479524307 478904228 478794670 478490334 477594986 477401161 477141380 476300430 476071663 475992584 475399704
3240.3 475399704 474616356 474373894 473867378 473341484 472668991 471729584 471671486 471432304 471006889 470447159
3249.9 470447159 469946785 469908638 469548645 468831787 468175812 467767906 467130814 466926842 466806679 466466675
3259.6 466466675 466041260 465186691 464964981 464648514 464513054 464492493 463650780 463023109 462580032 462432861
3269.2 462432861 462147331 461492844 460996017 460285225 459431801 459229813 459129143 458609848 458549995 458197060
3278.9 458197060 457840729 457612152 456713829 456120720 455821037 455706902 455362053 454594612 454102592 454024429
3288.5 454024429 453927689 453499565 453078537 452530098 451894913 450995941 450466270 450521622 450160103 449712219
3298.2 449712219 449152107 448276711 447452278 447378120 447245674 446511536 446238403 445868835 445287361 444643288
3307.8 444643288 444060364 443707695 443146019 442336082 441686249 441697617 441513023 440746651 439634209 439071236
3317.4 439071236 439065323 438422737 438027573 437854271 437222786 436326752 436050491 436327705 435638008 434631500
3327.1 434631500 433782349 432795563 432355919 432327347 431661415 430655632 430143585 429770813 429214020 428479958
3336.7 428479958 427911301 427360039 426620941 425865631 425612717 425774918 425366516 424701767 423872032 423259850
3346.4 423259850 422808228 422224274 422006416 421287537 420271797 419663887 419478951 418876381 417915688
3355.1 417915688 417685814 417242432 416685371 416347160 415929222 415336151 414536934 413969078 413331032 412835770
3364.7 412835770 412768402 412752876 412500572 412000923 411123238 410377502 409974403 409322472 408967438 408544617
3374.3 408544617 408035660 407835541 407513618 406764145 405754585 405628357 405494385 404660873 403731956
3383 403731956 403361855 403814392 403698883 403303185 403180466 402914352 402370644 402345085 402850075 402053642
3392.7 402053642 400692825 400055428 399732971 399917297 400115738 399638290 399391251 399459305 399240532 399135971
3402.3 399135971 398986626 398703423 398134956 397746582 397843628 397891502 398056526 397902870 397423553 396989365
3412 396989365 397030220 397165222 396690483 396038284 395780945 395956688 395572891 395667610 396028748 395606880
3421.6 395606880 395763931 395701408 395540237 395771866 396210976 396437149 395832176 395665512 396262054 396531944
3431.2 396531944 396450424 396598625 396314926 396161308 396287308 396213036 396647301 396640015 396621246 397070923
3440.9 397070923 397214165 397089348 396941452 396776962 397086868 398070908 397631989 397513390 398614998
3449.6 398614998 398918114 398691826 398724670 399336739 399510689 399756508 400148964 400383949 400766907 400733490
3459.2 400733490 401325493 401889839 402445183 402661171 402238503 402505836 402791595 403382530 403518028 403772621
3468.8 403772621 404509392 404446449 404792404 405358047 406070442 406579170 406089668 406325493 407248383 407664490
3478.5 407664490 408299294 408854980 408976936 409431458 409624481 410141449 410694313 411022873 411391907 411109161
3488.1 411109161 411393394 412619286 413822098 414183159 414463005 414873505 415356750 416167564 415976105
3496.8 415976105 416150131 416670494 417054024 417832985 418651123 419687347 419492035 419477844 420190964 420427933
3506.5 420427933 421262283 422598991 422955437 422608795 423350296 424130325 424767799 425311089 425473900
3515.1 425473900 426171837 427010956 427256737 427048264 427562370 428768120 429842224 430378227 430582657
3523.8 430582657 430981941 431731300 432349548 432318497 433329773 433693733 434171524 435344086 435314217 435910950
3533.5 435910950 436318741 437318077 438202171 437895279 439070282 440027885 440467720 440897903 441890182
3542.1 441890182 442730408 443807373 444731140 444235802 445063972 444757805 445785599 447314911 447933273
3550.8 447933273 449287300 448830681 449583931 449864960 450414963 452452888 452943192 453451805 454198723
3559.5 454198723 455312500 455535469 456940536 458013573 457481918 460603447 460914993 458948708 459628296
3568.2 459628296 459447403 461101913 462556915 464026871 465082436 466154671 466830902 467445831 468772125
3576.9 468772125 468875313 470009308 470915337 471262321 472522621 473882103 474951134 475298386 477467117
3585.5 477467117 478303299 477323380 478727341 477876854 479071159 481437607 484290924 485057220 484021378
3594.2 484021378 485887947 485199547 486581993 489432182 489432144 490969505 491739769 492309227 493659630
3602.9 493659630 494287567 495541344 497834129 499960289 498651543 500135269 500290871 499413261 504363289
3611.6 504363289 505107193 502970085 506393585 505724792 507340126 510876236 511584930 512724075 511777725
3620.3 511777725 511339836 513506622 515391655 516805611 519135208 521609001 523199234 527013741
3628 527013741 527185707 519519386 522172470 525192757 529415779 531729813 530699158 532326164 534725952
3636.6 534725952 536885033 536635437 536769409 539348145 541850815 542730942 542595024 544383926 547680931
3645.3 547680931 553039436 553782234 549119492 552424049 553394928 552646790 551457863 554411201 557798958
3654 557798958 560770187 564342957 558316841 559228706 563544121 565901680 567690697 567234459 568128853
3662.7 568128853 569532204 571788292 573267365 573076973 576615677 579583931 578645821 578449745 575107231
3671.4 575107231 575734520 580451088 586740265 587693977 575887794 577611580 583166809 587121925
3679.1 587121925 586363258 585814857 587489433 589161301 590341492 590900536 590530739 592611427 597388535
3687.8 597388535 591583557 588568916 594867783 591633415 590631523 594070358 594148979 594712982 595124969
3696.4 595124969 595028114 595758705 595401497 596770706 599197235 595709343 593981133 597762566 599678078
3705.1 599678078 600312805 601245232 602818031 605440903 600719528 602960205 605625954 595994911 600141563
3713.8 600141563 603092422 603025055 604336243 606508484 607467575 604555321 604913559 609177246 606677551
3722.5 606677551 602137299 606302834 608394775 607773705 606326866 606612167 609322586 609972382 613512535
3731.2 613512535 610592651 604598351 611707497 611729813 605397530 607288513 608489685 607692299 609558449
3739.8 609558449 611934357 608658714 611256447 619285507 611947823 600142555 606099472 610603180
3747.5 610603180 615536461 613273125 604774628 613471985 611150780 604920387 608750114 611214752
3755.3 611214752 613029785 609563217 610696793 614705467 609430237 608498344 611992187 612527580 612282295
3763.9 612282295 615182152 613455162 609778366 611852112 614734650 614051552 607438278 609026070
3771.7 609026070 611828041 612272987 612492294 612222519 612629738 612851944 615283279 615658531 610252151
3780.3 610252151 611657028 612734833 613040276 614754677 612434425 611302490 612554893 612922173 613471756
3789 613471756 613230705 612786369 612762451 612899323 612537041 613297234 615989151 613342056 610119476 611732903
3798.7 611732903 614426727 618720360 613536072 606846771 610394325 611954231 614567986 618232803
3806.4 618232803 611461067 607736092 611682243 613517876 613078194 613152008 613241196 614299622 618464813
3815.1 618464813 618018723 607163696 609524384 613666306 617887383 620428581 607075729 608196449
3822.8 608196449 612062836 612614403 614158173 615264359 612338333 611663284 612396584 614316444 616054039
3831.4 616054039 610217438 611472397 616944847 613561592 612191315 617830429 612295685 607599869
3839.2 607599869 613158913 609340668 609185982 614614220 613377686 611103859 612702026 612820358 612274170
3847.8 612274170 613799210 613626251 614766273 619804687 615796814 613241882 601941452 603113022
3855.6 603113022 610438347 610410881 609764671 611467934 613130531 615121269 610747910 610099411 615651207
3864.2 615651207 611437111 606925583 609533081 612597580 617528992 612123756 604865952 608302307
3871.9 608302307 612665787 615159988 608641510 609273987 611390991 610284615 611124191 614976540 612557602
3880.6 612557602 605641403 609850960 610901337 611035156 615465393 607057076 607042198 609765244 610134811
3889.3 610134811 613404198 613161812 606815529 607863083 610212250 609164124 609708824 610380325 612142029
3898 612142029 612849731 604867058 608597603 611053391 607256355 610864220 609216194 607495880 607328758
3906.7 607328758 607453346 609485245 609783821 609544983 609179268 609222946 609251404 608530502 609420853 610761032
3916.3 610761032 607720146 605010643 608438148 609332809 606530571 607642326 608086586 608978233 608509293
3925 608509293 606025429 607403984 608649368 609313774 608619614 608037300 609547958 607781372 606505775
3933.7 606505775 607701569 607482224 606923599 607911873 608176003 607254601 607398682 608568077 608818474
3942.3 608818474 605304832 604967613 606506615 607127800 608358536 606667061 606567192 607163849 606016655
3951 606016655 606994247 606655960 606221771 606740494 606988258 606772995 606347160 606986542 606691933 606306152
3960.7 606306152 605874443 604813309 605322533 606209831 606266823 606017685 605573006 605652657 605890274 605189514
3970.3 605189514 605536461 605915947 605781097 606350021 605914307 605041161 604187393 604473763 605208817 604818916
3980 604818916 604896355 605500259 606095848 605896301 605559006 605177040 604548836 604533386 605026970 605995445
3989.6 605995445 605864563 605180321 604624939 604293327 604522285 603932915 603652916 604068718 604389420 604035072
3999.2 604035072 603790054
4000.2 603790054
##END=$$ End of the data block
