##TITLE=$$ Begin of the data block
##JCAMP-DX=5.00 $$ ACD/SpecManager v 10.08
##SPECTROMETER/DATA SYSTEM=Varian
##DATE=18 Dec 2012 10:43:18
##DATA TYPE=INFRARED SPECTRUM
##DATA CLASS=XYDATA
##ORIGIN=
##OWNER=
##NPOINTS=3735
##FIRSTX=399.26403809
##LASTX=4000.35498047
##MAXX=4000.35498047
##MINX=399.26403809
##MAXY=75.90589905
##MINY=40.13513184
##XFACTOR=1.0000000000
##YFACTOR=0.000000100000000
##FIRSTY=64.56693268
##DELTAX=0.96440572
##XUNITS=1/CM
##YUNITS=TRANSMITTANCE
##XYDATA=(X++(Y..Y))
$$ plain form
399.3 645669327 646762009 648582840 649115219 643718567 629690208 627552681 638920555 642138672
407 642138672 639840355 637237663 633339767 640934982 642819595 638509865 638479805 637473717 639131165
415.7 639131165 635953255 629306450 623518143 642115250 639319725 628931847 630095253 631852074
423.4 631852074 633990021 630144958 624421959 625502243 627645073 635880661 634397240 629169044
431.1 629169044 632577248 635614204 633581276 627729759 631058578 631559868 628731461 629828148 627149048
439.8 627149048 625179672 627468948 631493835 629322548 628634644 628918533 624778671 624412956 624059868
448.4 624059868 624964294 630366783 631634445 628281403 630437546 631882477 629901924 633139725 630368614
457.1 630368614 620029182 623495865 621882401 620599747 626099701 628352127 628622017 627247047
$$ packed form
399.3F45669327J092682J820831N32379n396652j4028359k137527J1367874L218117
407F42138672k298317k602692l897896P595215J884613m309730l0060j006088J657448
415.7F39131165l177910o646805n788307J8597107k795525j0387878J163406J756821
423.4F31852074K137947l845063n722999J080284K142830Q235588j483421n228196
431.1F29169044L408204L036956k032928n851517L328819N01290k828407J096687k679100
439.8F27149048j969376K289276M024887k171287o87904K83889m139862l65715l53088
448.4F24059868R04426N402489J267662l353042K156143J444931j980553L237801k771111
457.1F30368614j0339432L466683j613464j282654N499954K252426K69890j374970
$$ plain form
464.8 627247047 623042412 619832115 616098480 614822121 616772804 618771324 620037842 615952950
472.6 615952950 612710495 615010147 618337402 621875267 622622681 620438538 623917274 629448967 628052559
481.2 628052559 626759491 624224815 622447090 625288010 626289024 627183342 626725922 626241837 625799408
489.9 625799408 624469414 624346657 625295715 625663567 625918617 627927551 626347504 622597427 622218704
498.6 622218704 622907372 622798805 622556305 624049950 625094643 625906258 626723862 626213455 623062820
507.3 623062820 623564415 628257484 626206093 620508041 617438469 618070984 620576553 618480301 617267723
516 617267723 619250946 619709663 621099663 624010811 622796364 619131012 616717834 615698814 616805878
524.6 616805878 615411224 613990631 616156578 617398682 617934303 615711937 615546036 617103500 615022545
$$ packed form
464.8F27247047m204635l210297l733635j276359J950683J998520J266518m084892
472.6F15952950l242455K299652L327255L537865P47414k184143L478736N531693j396408
481.2F28052559j293068k534676j777725K840920J001014Q94318m57420m84085m42429
489.9F25799408j329994j22757R49058L67852K55050K008934j580047l750077l78723
498.6F22218704O88668j08567k42500J493645J044693Q11615Q17604n10407l150635
507.3F23062820N01595M693069k051391n698052l069572O32515K505569k096252j212578
516F17267723J983223M58717J390000K911148j214447l665352k413178j019020J107064
524.6F16805878j394654j420593K165947J242104N35621k222366j65901J557464k080955
$$ plain form
533.3 615022545 613100662 612420311 611908150 611984291 613960228 615047150 615096474 616368675 616559982
542 616559982 616766052 616167145 614938736 614222984 613550987 613999443 615482674 616959190 616939278 618033295
551.6 618033295 619274712 618681259 617247696 615044212 613673630 612747726 612997589 613865929 615477562
560.3 615477562 618428383 618306847 616651573 616238136 615937080 616432381 617089272 616608734 615650139
569 615650139 614983139 615608368 616747055 616382370 616890717 618587608 618676300 617043152 614928017 613582802
578.6 613582802 614337692 615426407 613810349 613738480 616630554 616828079 615209846 615608368 616996956
587.3 616996956 616690140 615810013 616408234 616202126 615699272 616248093 616438217 616489296 616446075 615940742
597 615940742 615699921 615249214 613500137 613208656 613999939 613166656 612707672 611935730 610557251 611043434
$$ packed form
533.3F15022545j921883o80351n12161P6141J975937J086922M9324J272201J91307
542F16559982K06070n98907j228409p15752o71997M48456J483231J476516j9912J094017
551.6F18033295J241417n93453j433563k203484j370582r25904K49863Q68340J611633
560.3F15477562K950821j21536j655274m13437l01056M95301O56891m80538r58595
569F15650139o67000O25229J138687l64685N08347J696891Q8692j633148k115135j345215
578.6F13582802P54890J088715j616058p1869K892074J97525j618233L98522J388588
587.3F16996956l06816q80127N98221k06108n02854N48821J90124N1079m3221n05333
597F15940742k40821m50707j749077k91481P91283q33283m58984p71942j378479M86183
$$ plain form
606.6 611043434 610630188 608976593 608739738 607874565 606128235 603756828 600828018 599948387 599596481
615.3 599596481 599522972 599905434 599175682 599002075 598805199 598289223 597137527 595640755 595927277 597251663
624.9 597251663 599042473 601820831 605063057 606964798 608132019 609689560 611131096 612405624
632.7 612405624 612714386 611593971 610592842 611412849 612512779 611763191 610695190 611268005 613211365
641.3 613211365 615576859 617542763 619493217 620992661 622018929 624823151 626091042 624964752
649 624964752 626013489 627433548 626885071 626297150 627007637 627863960 627642326 628096886 629740906 630349159
658.7 630349159 630595703 630766029 629892693 629082680 629065933 630532570 632444649 633245010 631713409
667.4 631713409 627298050 631885948 634517632 635153427 635399284 636086998 635306053 633894081 635279617
$$ packed form
606.6F11043434m13246j653595k36855q65173j746330k371407k928810q79631l51906
615.3E99596481p3509L82462p29752j73607j96876n15976j151696j496772K86522J324386
624.9E97251663J790810K778358L242226J901741J167221J557541J441536J274528
632.7F12405624L08762j120415j001129Q20007J099930p49588j068001N72815J943360
641.3F13211365K365494J965904J950454J499444J026268K804222J267891j126290
649F24964752J048737J420059n48477n87921P10487Q56323k21634M54560J644020O08253
658.7F30349159K46544J70326q73336q10013j6747J466637J912079Q00361j531601
667.4F31713409m415359M587898K631684O35795K45857O87714p80945j411972J385536
$$ plain form
676.1 635279617 637179375 637862244 637419510 636989861 637637100 637614555 637367897 638077545 638181076 636376266
685.7 636376266 635915527 636501236 636253548 636726685 636380081 635931664 635163879 633826523 633718147 633409729
695.3 633409729 632911224 631840210 631073685 632046928 632860069 632922707 633051414 633827209 634296265 634071808
705 634071808 634181862 634819527 635168076 635429153 636053658 636844025 638279953 639267235 640064316 641289902
714.6 641289902 642032700 642025528 641333084 641790237 642655182 642745285 643611908 644170837 643941727 644832611
724.3 644832611 647057724 648960724 649039612 647599335 646640701 646040268 646144638 647011719 646913910 647579727
733.9 647579727 648710480 649879074 651358871 650717316 650070038 650760345 651518860 651650848 651220398
742.6 651220398 652168655 653003082 653742371 655875549 657487335 658740082 659740372 659766159 660128250
$$ packed form
676.1F35279617J899758O82869m42734m29649O47239k2545k46658P09648J03531j804810
685.7F36376266m60739N85709k47688M73137l46604m48417p67785j337356j08376l08418
695.3F33409729m98505j071014p66525R73243Q13141O2638J28707P75795M69056k24457
705F34071808J10054O37665L48549K61077O24505P90367J435928R87282P97081J225586
714.6F41289902P42798p172o92444M57153Q64945R0103Q66623N58929k29110Q90884
724.3F44832611K225113J903000P8888j440277r58634o00433J04370Q67081r7809O65817
733.9F47579727J130753J168594J479797o41555o47278O90307P58515J31988m30450
742.6F51220398R48257Q34427P39289K133178J611786J252747J000290K5787L62091
$$ plain form
751.3 660128250 661365433 662351837 662620010 663040771 664472351 667109146 669691849 672130356 673278809
760 673278809 672019043 671551056 670917053 669902802 670802383 671952286 672072525 671129074 671420670 672499161
769.6 672499161 672898102 672887573 672160950 672503510 673009338 672578125 672471466 674163818 676507645 677935791
779.2 677935791 680213394 682240753 683154907 683428421 683830414 684081497 683084335 683000107 683936234 685077591
788.9 685077591 687125549 690041428 691268311 691186295 690982513 689429626 688846207 688494186 688089981
797.6 688089981 688346481 689316559 690581284 690808945 691918106 693164368 694636917 694450912 692487335
806.2 692487335 692136841 691606903 691315918 691289062 692239532 693976135 695500565 697374878 697868881
814.9 697868881 697555618 697597656 698461151 697404404 695773621 696136322 696121292 697164459 698887634
$$ packed form
751.3F60128250J237183R86404K68173M20761J431580K636795K582703K438507J148453
760F73278809j259766m67987o34003j014251Q99581J149903J20239r43451K91596J078491
769.6F72499161L98941j0529p26623L42560N05828m31213j06659J692352K343827J428146
779.2F77935791K277603K027359R14154K73514M01993K51083r97162q4228R36127J141357
788.9F85077591K047958K915879J226883q2016k03782j552887n83419l52021m04205
797.6F88089981K56500R70078J264725K27661J109161J246262J472549j86005j963577
806.2F92487335l50494n29938k90985k6856R50470J736603J524430J874313M94003
814.9F97868881l13263M2038Q63495j056747j630783L62701j5030J043167J723175
$$ plain form
823.6 698887634 699522324 699120178 699124374 698829575 696696930 694363098 692274094 690893173 689379044
832.3 689379044 688115158 687826385 687398224 685880280 684543152 684487457 683226929 681460953 678890533
841 678890533 676501389 675379105 673065186 671964798 672446671 673670349 675694427 676459732 675448151
849.6 675448151 674506226 675112152 675524292 676009903 676860428 678046951 679966888 681633377 684184189
858.3 684184189 687402344 689517365 690039902 689966660 689639282 690377350 691821976 692648544 694458008
867 694458008 695804977 696498566 697724609 699345703 699457779 698371124 698530807 698656006 699655762
875.7 699655762 699875412 698925629 698765717 699182663 699861298 698941879 698376389 697456284 695492172 693591080
885.3 693591080 691675262 690960312 689808121 688944321 688801422 689169922 690309448 691229858 692134323
$$ packed form
823.6F98887634O34690m02146M196k94799k132645k333832k089004j380921j514129
832.3F89379044j263886k88773m28161j517944j337128n5695j260528j765976k570420
841F78890533k389144j122284k313919j100388M81873J223678K024078P65305j011581
849.6F75448151r41925O05926M12140M85611Q50525J186523J919937J666489K550812
858.3F84184189L218155K115021N22537p3242l27378P38068J444626Q26568J809464
867F94458008J346969O93589J226043J621094J12076j086655J59683J25199R99756
875.7F99655762K19650r49783j59912M16946O78635r19419n65490r20105j964112j901092
885.3F93591080j915818p14950j152191q63800j42899L68500J139526R20410R04465
$$ plain form
894 692134323 691656952 690890503 690154724 689247742 689420395 690157547 691213684 691419067 691314468 691576843
903.7 691576843 691453781 690535660 688613205 686803436 685235519 683392105 682028122 681579285 681398392
912.3 681398392 680743027 679683075 678412857 676705399 674598770 672327194 669968033 667958832 667009277
921 667009277 666806946 666783218 666678772 665873566 664736176 663642120 662937546 662703400 662028961 661297989
930.7 661297989 660982590 660914459 660830307 661385422 663150330 664544296 665307083 666457138 668108292
939.3 668108292 669297638 669475403 670302963 671938477 673742828 675580215 677136765 678537521 679848175
948 679848175 681448822 682880936 684137726 684387817 683671799 683338089 683100357 683186798 683041763 682872543
957.7 682872543 682109985 680996246 680648193 679131470 676923981 674393692 671725616 670419235 669346008
$$ packed form
894F92134323m77371p66449p35779r06982J72653P37152J056137K05383j04599K62375
903.7F91576843j23062r18121j922455j809769j567917j843414j363983m48837j80893
912.3F81398392o55365j059952j270218j707458k106629k271576k359161k009201r49555
921F67009277k02331k3728j04446q05206j137390j094056p04574k34146o74439p30972
930.7F61297989l15399o8131q4152N55115J764908J393966P62787J150055J651154
939.3F68108292J189346J77765Q27560J635514J804351J837387J556550J400756J310654
948F79848175J600647J432114J256790K50091p16018l33710k37732Q6441j45035j69220
957.7F82872543p62558j113739l48053j516723k207489k530289k668076j306381j073227
$$ plain form
966.3 669346008 667800903 667041473 667304840 666858826 665414505 664512100 663692551 662638626 661897964
975 661897964 660812073 660060272 659889526 659436264 659075012 658251114 657152481 656193695 654734802 653004227
984.7 653004227 651112061 649431152 647812958 646258469 645233536 644466248 643401489 641139221 638654633
993.3 638654633 636445541 633477707 631192055 630111351 629764366 630098534 629891930 629270859 628207970
1002 628207970 627055283 626194992 625437851 624318237 622002983 620226288 619272079 618319855 617677612
1010.7 617677612 617382317 617062073 616434708 615666618 613732643 611917992 610622253 609624367 608979530
1019.4 608979530 607594147 607042427 605936966 604328995 603342056 602231636 601320496 599836311 598734016
1028.1 598734016 597461548 596059875 594582024 593208313 593497772 593611412 593226242 592658577 591887779
$$ packed form
966.3F69346008j545105p59430K63367m46014j444321r02405q19549j053925p40662
975F61897964j085891p51801j70746m53262l61252q23898j098633r58786j458893j730575
984.7F53004227j892166j680909j618194j554489j024933p67288j064759k262268k484588
993.3F38654633k209092k967834k285652j080704l46985L34168k06604o21071j062889
1002F28207970j152687q60291p57141j119614k315254j776695r54209r52224o42243
1010.7F17677612k95295l20244o27365p68090j933975j814651j295739r97886o44837
1019.4F08979530j385383n51720j105461j607971r86939j110420r11140j484185j102295
1028.1E98734016j272468j401673j477851j373711K89459J13640l85170n67665p70798
$$ plain form
1036.7 591887779 591099472 590690613 590328865 590314102 591473389 591349907 590509605 591117210 592511024
1045.4 592511024 592423096 592190437 592927666 592614594 592120476 591493721 591741257 592397842 592800941 593199539
1055.1 593199539 592822685 593472633 594058075 594216003 593974152 593552322 593469238 592908897 593086777 592963448
1064.7 592963448 592483902 592004890 591640778 591518402 591470108 591394081 590341187 590025291 589958420 590019875
1074.4 590019875 590012932 589433250 588664513 587610741 588372154 588955536 588869629 588436852 587824898 587938576
1084 587938576 586917038 587122650 588546867 588806190 588273163 587930756 587525063 586636276 586245308 585636902
1093.6 585636902 584528351 582804527 581308517 579944267 578295517 577088852 575948639 575103989
1101.4 575103989 573646622 572456818 570924950 568847275 567178650 566048317 565845337 564423332
$$ packed form
1036.7E91887779p88307m08859l61748j4763J159287j23482q40302O07605J393814
1045.4E92511024q7928k32659P37229l13072m94118o26755K47536O56585M03099L98598
1055.1E93199539l76854O49948N85442J57928k41851m21830q3084n60341J77880j23329
1064.7E92963448m79546m79012l64112j22376m8294p6027j052894l15896o6871O1455
1074.4E90019875o943n79682p68737j053772P61413N83382q5907m32777o11954J13678
1084E87938576j021538K05612J424217K59323n33027l42407m05693q88787l90968o08406
1093.6E85636902j108551j723824j496010j364250j648750j206665j140213q44650
1101.4E75103989j457367j189804j531868k077675j668625j130333k02980j422005
$$ plain form
1109.1 564423332 563629532 562716866 561021461 559961014 559118538 559314804 558808556 558343849 557579384
1117.7 557579384 556698990 556686287 557153511 557946510 558050880 558819313 559179115 559023895 558474693 558112755
1127.4 558112755 557896194 557383499 558245544 558360443 558985596 559322739 559063187 559349480 558620262 559093742
1137 559093742 559542542 558844872 557626991 557093620 556546249 555351944 554987946 553940620 553466873
1145.7 553466873 553273125 552731514 551608200 550569038 550303268 549831810 550341454 550124855 550503616
1154.4 550503616 551000443 551405678 552964249 553661766 554311905 554726295 556319771 557539291 558051033
1163.1 558051033 559697380 561598701 564104309 565925560 568152733 570909767 573640633 576149292
1170.8 576149292 578649673 581278191 583077888 585604057 588147087 590684280 593732758 596922798
$$ packed form
1109.1E64423332p93800r12666j695405j060447q42476J96266n06248m64707p64465
1117.7E57579384q80394j2703M67224P92999J04370P68433L59802j55220n49202l61938
1127.4E58112755k16561n12695Q62045J14899O25153L37143k59552K86293p29218M73480
1137E59093742M48800o97670j217881n33371n47371j194305l63998j047326m73747
1145.7E53466873j93748n41611j123314j039162k65770m71458N09644k16599L78761
1154.4E50503616M96827M05235J558571O97517O50139M14390J593476J219520N11742
1163.1E58051033J646347J901321K505608J821251K227173K757034K730866K508659
1170.8E76149292K500381K628518J799697K526169K543030K537193L048478L190040
$$ plain form
1178.5 596922798 599595261 601378288 603283272 604929619 606743317 607760353 608209343 609665909
1186.2 609665909 611269150 612334480 613482590 615687485 617334099 618544121 619419823 619347458 619425011
1194.9 619425011 619767303 621264877 622469406 623172646 624555893 625545387 626565285 627507133 628274574
1203.6 628274574 628648949 628244858 627694740 627422905 627780342 628345795 629160347 630157928 631061668 631678619
1213.2 631678619 631630096 631371002 631490555 631614876 631050301 630447617 630368576 630288162 630102577 630790634
1222.9 630790634 632173462 632376862 631666451 631145210 630578308 629979515 629813347 629932060 629986992 630142021
1232.5 630142021 630501556 631001701 631426277 631995277 632051353 631719322 631471634 631220131 631551628 631461220
1242.2 631461220 631722107 632537422 632623825 632929115 633249855 633044891 632279816 631902695 631877365 631493225
$$ packed form
1178.5E96922798K672463J783027J904984J646347J813698J017036M48990J456566
1186.2F09665909J603241J065330J148110K204895J646614J210022Q75702p2365P7553
1194.9F19425011L42292J497574J204529P03240J383247R89494J019898R41848P67441
1203.6F28274574L74375m04091n50118k71835L57437N65453Q14552R97581R03740O16951
1213.2F31678619m8523k59094J19553J24321n64575o02684p9041q0414j85585O88057
1222.9F30790634J382828K03400p10411n21241n66902n98793j66168J18713N4932J55029
1232.5F30142021L59535N00145M24576N69000N6076l32031k47688k51503L31497r0408
1242.2F31461220K60887Q15315Q6403L05290L20740k04964p65075l77121k5330l84140
$$ plain form
1251.8 631493225 631577950 631969223 632425499 632493668 632472572 632755585 632951965 632486649 631900177 632641182
1261.4 632641182 633162231 633186035 633276253 633612404 634505653 635062828 635464287 635595665 635869102 636657372
1271.1 636657372 637243080 637452927 637522659 638082428 639023552 639827919 640501785 641184921 641652374 642063217
1280.7 642063217 642531815 643306274 644520416 645296326 645691757 646182175 647010727 647914734 648861542
1289.4 648861542 649645996 650179443 651323547 652179642 652785721 653595810 654365463 655566711 656426849
1298.1 656426849 656863327 657517853 658484879 659376297 659842682 660502014 661351852 661936417 662399292 662812500
1307.7 662812500 663145065 663442993 663672714 664022980 664668808 665078583 665446243 666468430 667485733
1316.4 667485733 667872849 667773514 667492142 667737656 668572159 669379272 669574585 669686890 670435181 671058426
$$ packed form
1251.8F31493225Q4725L91273M56276O8169k1096K83013J96380m65316n86472P41005
1261.4F32641182N21049K3804R0218L36151Q93249N57175M01459J31378K73437P88270
1271.1F36657372N85708K09847O9732N59769R41124Q04367O73866O83136M67453M10843
1280.7F42063217M68598P74459J214142P75910L95431M90418Q28552R04007R46808
1289.4F48861542P84454N33447J144104Q56095O06079Q10089P69653J201248Q60138
1298.1F56426849M36478O54526R67026Q91418M66385O59332Q49838N84565M62875M13208
1307.7F62812500L32565K97928K29721L50266O45828M09775L67660J022187J017303
1316.4F67485733L87116r9335k81372K45514Q34503Q07113J95313J12305P48291O23245
$$ plain form
1326 671058426 671245041 671531830 671944427 672179108 671964264 671979294 672741241 672628784 672069092 672458191
1335.7 672458191 672671967 672744370 672693863 672131653 672034378 672393646 672739487 673021774 673004074 672555237
1345.3 672555237 672582626 672970352 673214569 673195419 672912521 672877884 672604599 672341919 671937256 671544342
1355 671544342 671458206 671297913 671346512 671170959 671207504 671006241 670702667 670245056 669004364 669397888
1364.6 669397888 669386139 668696671 668280334 667383118 666403809 666193390 666321259 666180725 665635681 664474030
1374.3 664474030 664449768 664682083 664399948 664170761 663526688 663214798 663505554 663614273 662974472 662634125
1383.9 662634125 663444138 664854279 665854721 665405197 665992126 666718979 666861649 667348785 668026123
1392.6 668026123 668878326 668141479 666726685 667364273 668140488 668219528 666487350 665770035 665715179 665373383
$$ packed form
1326F71058426J86615K86789M12597K34681k14844J5030P61947j12457n59692L89099
1335.7F72458191K13776P2403n0507n62210r7275L59268L45841K82287j7700m48837
1345.3F72555237K7389L87726K44217j9150k82898l4637k73285k62680m04663l92914
1355F71544342q6136j60293M8599j75553L6545k01263l03574m57611j240692L93524
1364.6F69397888j1749o89468m16337q97216r79309k10419J27869j40534n45044j161651
1374.3F64474030k4262K32315k82135k29187o44073l11890K90756J08719o39801l40347
1383.9F62634125Q10013J410141J000442m49524N86929P26853J42670M87136O77338
1392.6F68026123Q52203p36847j414794O37588P76215P9040j732178p17315n4856l41796
$$ plain form
1402.2 665373383 665138016 664854507 663731232 663195648 663741608 663553696 662867661 662119598 661880569
1410.9 661880569 661666412 660906677 660469742 659778595 659839935 660176926 660274429 660601120 658038483 658643646
1420.6 658643646 660329971 660762100 659796982 657700119 658156128 659408875 659683533 659961929 660093689
1429.2 660093689 659740448 660184402 660553894 660501251 660395966 660941544 661447372 657576599 657677002 660065918
1438.9 660065918 661133881 661497192 662052841 662409058 662378769 662134247 662094193 662131653 661515732 660969315
1448.5 660969315 662289886 663327789 663357620 663711929 664524536 665696182 666891632 666984406 663831711
1457.2 663831711 662852707 665196228 666981049 669339752 670981293 671915741 673222275 672127762 672047195
1465.9 672047195 673379364 674155884 674699249 675673141 677660522 678621216 678404465 679227829 681514511
$$ packed form
1402.2F65373383k35367k83509j123275n35584N45960j87912o86035p48063k39029
1410.9F61880569k14157p59735m36935o91147O1340L36991R7503L26691k562637O05163
1420.6F58643646J686325M32129r65118k096863M56009J252747K74658K78396J31760
1429.2F60093689l53241M43954L69492n2643j05285N45578N05828l870773J00403K388916
1438.9F60065918J067963L63311N55649L56217l0289k44522m0054L7460o15921n46417
1448.5F60969315J320571J037903K9831L54309Q12607J171646J195450R2774l152695
1457.2F63831711r79004K343521J784821K358703J641541R34448J306534j094513q0567
1465.9F72047195J332169P76520N43365R73892J987381R60694k16751Q23364K286682
$$ plain form
1474.6 681514511 684095459 684336395 685798111 687944260 688635559 689099579 689473190 690595245 691623306
1483.2 691623306 692397385 693383026 694096298 693515854 692316818 693044281 690978699 689381332 690424423
1491.9 690424423 691019287 691063995 690808868 690703430 686901932 687802277 687054291 683911285 684312057
1500.6 684312057 683368759 682473907 682257309 683381119 684536743 681572571 672668610 670079498 671915817
1509.3 671915817 671091766 671546326 669715881 667787857 668104324 666941528 666274643 662886734 660803299
1518 660803299 662461243 664776917 664260254 658941498 657847443 657432327 658292542 655827103 655572510
1526.6 655572510 655798721 654093552 654076080 654004288 653737869 652467041 650445557 647691498 649005203
1535.3 649005203 650084381 650407562 652080917 647485352 642410278 645831985 646692276 645838013 646237946
$$ packed form
1474.6F81514511K580948K40936J461716K146149O91299M64020L73611J122055J028061
1483.2F91623306P74079R85641P13272n80444j199036P27463k065582j597367J043091
1491.9F90424423N94864M4708k55127j05438l801498R00345p47986l143006M00772
1500.6F84312057r43298q94852k16598J123810J155624k964172q903961k589112J836319
1509.3F71915817q24051M54560j830445j928024L16467j162796o66885l387909k083435
1518F60803299J657944K315674n16663n318756j094055m15116Q60215k465439k54593
1526.6F55572510K26211j705169j7472p1792k66419j270828k021484k754059J313705
1535.3F49005203J079178L23181J673355m595565n075074L421707Q60291q54263L99933
$$ plain form
1544 646237946 646607666 645278854 646832962 647683487 648501358 647919235 646751862 648707428 649595718
1552.7 649595718 650569382 649255066 649830246 652593536 654542847 654242325 647689896 649282761 651838074
1561.4 651838074 654020081 655266953 655964127 655867004 656306915 658131180 659073257 658948288 655732117
1570 655732117 656975555 658280487 658334427 659067078 659637451 659406662 654205399 655812225 657126694
1578.7 657126694 657332840 657634125 656568375 656095581 655335541 655049362 654372406 653108215 652105331
1587.4 652105331 650690994 649870834 648072281 647330093 646056442 644926529 643891907 641554108 640088806
1596.1 640088806 637715149 636560822 634853058 633446579 631645164 629371643 628409958 625917473
1603.8 625917473 624500504 622703781 620983582 618059502 615748901 613877029 610611877 609343109
$$ packed form
1544F46237946L69720j328812J554108Q50525Q17871n82123j167373J955566Q88290
1552.7F49595718R73664j314316N75180K763290J949311l00522o552429J592865K555313
1561.4F51838074K182007J246872O97174r7123M39911J824265R42077j24969l216171
1570F55732117J243438J304932N3940P32651N70373k30789n201263J606826J314469
1578.7F57126694K06146L01285j065750m72794p60040k86179o76956j264191j002884
1587.4F52105331j414337q20160j798553p42188j273651j129913j034622k337799j465302
1596.1F40088806k373657j154327j707764j406479j801415k273521r61685k492485
1603.8F25917473j416969j796723j720199k924080k310601j871872l265152j268768
$$ plain form
1611.5 609343109 606803513 605471344 603511467 602544823 601651039 593378525 593561478 591781845 590278587
1620.2 590278587 587695274 586823425 585388603 580034523 580156326 579293404 579048538 574708443 572507019
1628.9 572507019 572190857 570591011 569312210 567010078 567340126 566930695 563282814 560821037 561511383
1637.5 561511383 561456909 561220665 561761093 560342941 560950394 560205688 561354561 563202324 560895500
1646.2 560895500 560703468 559506416 563373032 564798889 567406158 571133804 572760315 564000664
1653.9 564000664 563981743 568100777 569439468 571174316 572150841 573554497 575375137 576394196 577404976
1662.6 577404976 576094170 578338928 579708519 581397133 583541489 585245781 586323280 585780830
1670.3 585780830 588579445 589456940 591979675 594653816 595136681 595557022 597592430 600155411 601506844
$$ packed form
1611.5F09343109k539596j332169j959877r66644q93784q272514J82953j779633j503258
1620.2E90278587k583313q71849j434822n354080J21803q62922k44866m340095k201424
1628.9E72507019l16162j599846j278801k302132L30048m09431l647881k461777O90346
1637.5E61511383n4474k36244N40428j418152O07453p44706J148873J847763k306824
1646.2E60895500j92032j197052L866616J425857K607269L727646J626511q759651
1653.9E64000664j8921M119034J338691J734848R76525J403656J820640J019059J010780
1662.6E77404976j310806K244758J369591J688614K144356J704292J077499n42450
1670.3E85780830K798615Q77495K522735K674141M82865M20341K035408K562981J351433
$$ plain form
1679 601506844 604184837 605296402 607869148 612660332 614367065 609011269 610364418 615751152 618797913
1687.7 618797913 619909477 621469765 623426895 626648865 629290314 632347908 635432549 638876839
1695.4 638876839 637988205 640707779 645131302 648913498 650641327 646277847 652625656 657261810
1703.1 657261810 660436783 662659988 664647369 666549683 668596802 671730194 673700104 675156174
1710.8 675156174 676953201 679028397 682059402 683272629 683823166 686501312 688422394 685102539
1718.5 685102539 687046204 689183655 689827881 690484924 690919418 691466141 692418823 693487549 694691315
1727.2 694691315 695959167 697460937 696960449 697396469 700122223 701575699 696548767 692021637 697597580
1735.9 697597580 701271057 703054810 705197220 704804153 703405762 706353760 708275223 707316818 707586060
$$ packed form
1679F01506844K677993J111565K572746M791184J706733n355796J353149N386734L046761
1687.7F18797913J111564J560288J957130L221970K641449L057594L084641L444290
1695.4F38876839q88634K719574M423523L782196J727829m363480O347809M636154
1703.1F57261810L174973K223205J987381J902314K047119L133392J969910J456070
1710.8F75156174J797027K075196L031005J213227N50537K678146J921082l319855
1718.5F85102539J943665K137451O44226O57043M34494N46723R52682J068726J203766
1727.2F94691315J267852J501770n00488M36020K725754J453476n026932m527130N575943
1735.9F97597580L673477J783753K142410l93067j398391K947998J921463r58405K69242
$$ plain form
1744.6 707586060 710200577 712659683 714109268 714639587 715088882 718685074 720190430 720059738 723368912
1753.3 723368912 725368652 727019043 728685303 727430801 728293762 730475540 732494659 734957123
1761 734957123 733576736 733081055 735841141 737216110 737824249 738812790 739407196 737540894 738624649
1769.7 738624649 741128387 741393204 739369812 738555603 741736984 743201370 742724762 744058838 744048080
1778.3 744048080 744122086 743771362 742978973 744149399 745431213 746567688 746447296 746144028 746813278
1787 746813278 747399445 747864609 748646698 748371582 748104324 747250290 746730804 748958969 749744873 749252396
1796.7 749252396 750168533 751420441 750985413 749487762 750542755 750061646 750052261 751345139 751593018
1805.3 751593018 752036896 752330093 752605057 753382111 753684921 752360001 752470627 752989960 752804413
$$ packed form
1744.6G07586060K614517K459106J449585N30319M49295L596192J505356j30692L309174
1753.3G23368912J999740J650391J666260j254502Q62961K181778K019119K462464
1761G34957123j380387m95681K760086J374969O08139R88541N94406j866302J083755
1769.7G38624649K503738K64817k023392q14209L181381J464386m76608J334076j0758
1778.3G44048080P4006l50724p92389J170426J281814J136475j20392l03268O69250
1787G46813278N86167M65164P82089k75116k67258q54034n19486K228165P85904m92477
1796.7G49252396R16137J251908m35028j497651J054993m81109r385J292878K47879
1805.3G51593018M43878K93197K74964P77054L02810j324920J10626N19333j85547
$$ plain form
1814 752804413 753301773 753245621 753599625 753838501 754254990 754754562 754344711 754738998 754604034 755076828
1823.7 755076828 755486984 753144836 753527756 755233002 756338425 756008301 753906403 754896164 756379166
1832.3 756379166 756232986 755817871 755817871 756062393 755654297 755112610 755899582 756314392 756857452 757228165
1842 757228165 758218842 758592758 754282455 755389633 756867599 756494751 755829086 755980377 756895599
1850.7 756895599 757424164 758136139 758190918 758014984 757913971 757898636 757975311 757417679 757479324 757684250
1860.3 757684250 757852859 757722931 757873993 757956085 757751160 758274765 758025208 758176804 757031403 755667877
1869.9 755667877 756873474 757559967 757943344 758056030 758210754 758430176 758613205 758432159 758065414
1878.6 758065414 758156052 758316040 758746796 758559265 758380127 758022766 757728729 758344269 758462906 759058990
$$ packed form
1814G52804413M97360n6152L54004K38876M16489M99572m09851L94287j34964M72794
1823.7G55076828M10156k342148L82920J705246J105423l30124k101898R89761J483002
1832.3G56379166j46180m15115%K44522m08096n41687P86972M14810N43060L70713
1842G57228165R90677L73916m310303J107178J477966l72848o65665J51291R15222
1850.7G56895599N28565P11975N4779j75934j01013j5335P6675n57632O1645K04926
1860.3G57684250J68609j29928J51062Q2092k04925N23605k49557J51596j145401j363526
1869.9G55667877J205597O86493L83377J12686J54724K19422J83029j81046l66745
1878.6G58065414R0638J59988M30756j87531j79138l57361k94037O15540J18637N96084
$$ plain form
1888.3 759058990 758811111 756922836 757397919 758449020 758451767 758532791 758302536 757448883 757729721 757945633
1897.9 757945633 758006592 758158493 758254395 758269653 757844086 757766266 757344131 757120819 757487717 757762985
1907.6 757762985 757827759 757946625 757722549 756967621 757341080 757470551 757644119 757711868 757233047 757858124
1917.2 757858124 756800232 756172409 756925278 757340546 757710114 756667938 756237717 756652451 756617126
1925.9 756617126 756456757 756585464 756573181 756482162 756540070 756238327 756416321 756440277 756383362 756112976
1935.5 756112976 755568237 755553894 755455093 755849304 755951538 756087112 755636902 754207306 755078659 755599442
1945.2 755599442 755297623 755232010 754910278 754691620 754476929 754433670 754496536 754710236 755079575 754930801
1954.8 754930801 754337997 754196320 754273605 754277191 754220428 753956604 754053345 754010162 753823318 753944626 754171066
$$ packed form
1888.3G59058990k47879j888275M75083J051101K747Q1024k30255q53653K80838K15912
1897.9G57945633O0959J51901R5902J5258m25567p7820m22135k23312L66898K75268
1907.6G57762985O4774J18866k24076p54928L73459J29471J73568O7749m78821O25077
1917.2G57858124j057892o27823P52869M15268L69568j042176m30221M14734l5325
1925.9G56617126j60369J28707j2283r1019N7908l01743J77994K3956n6915k70386
1935.5G56112976n44739j4343r8801L94211J02234J35574m50210j429596Q71353N20783
1945.2G55599442l01819o5613l21732k18658k14691m3259O2866K13700L69339j48774
1954.8G54930801n92804j41677P7285L586n6763k63824R6741m3183j86844J21308K26440
$$ plain form
1965.4 754171066 754529572 753998871 753017731 752917023 752845306 752693710 752919998 752889557 753064117 753365250
1975.1 753365250 753143234 753121033 752811279 752427597 752322540 752120514 752088165 752012100 751962051 751751709
1984.7 751751709 751749649 752130051 752100983 751629181 751305161 751598129 751425858 750094376 749565964 750004883
1994.3 750004883 750359116 750399246 750388336 750430374 750230408 749873886 749725266 749419327 749100189 748708801
2004 748708801 748473816 748784332 748952789 749132767 749002686 748370972 748000717 747982101 747906113 747603455
2013.6 747603455 747461700 747502289 747426605 746868439 746721191 746949463 746767044 746814499 746690063 746407623
2023.3 746407623 746337280 746237488 746069946 745858612 745770340 745715561 745766602 745389328 744958038 744852371
2032.9 744852371 744736099 744812088 744708481 744590225 744389877 744257660 744409866 744409332 744112625 743679504
$$ packed form
1965.4G54171066L58506n30701r81140j00708p1717j51596K26288l0441J74560L01133
1975.1G53365250k22016k2201l09754l83682j05057k02026l2349p6065n0049k10342
1984.7G51751709k060L80402k9068m71802l24020K92968j72271j331482n28412M38919
1994.3G50004883L54233M0130j0910M2038j99966l56522j48620l05939l19138l91388
2004G48708801k34985L10516J68457J79978j30081o31714l70255j8616p5988l02658
2013.6G47603455j41755M0589p5684n58166j47248K28272j82419M7455j24436k82440
2023.3G46407623p0343r9792j67542k11334q8272n4779N1041l77274m31290j05667
2032.9G44852371j16272P5989j03607j18256k00348j32217J52206n34k96707m33121
$$ plain form
2042.6 743679504 743582306 743456879 743381653 743409348 743535309 743592300 743050156 742633514 742562103 742719345
2052.2 742719345 742788391 742895966 742746735 742180557 742200775 741887360 741314545 741275024 741577377 741490402
2061.9 741490402 740995941 741367340 741526108 741181107 741164856 740921097 740531082 740275726 740050049 739819565
2071.5 739819565 740010376 740146484 740122681 740161133 740007095 740071716 739952545 739468918 739115448 739120712
2081.1 739120712 739227295 738848267 738454742 738601151 738699799 738506546 738360443 738304062 738475418 738511581
2090.8 738511581 738365784 738185043 737919159 737865524 737809143 737916718 737917252 737841187 738077850 738008194 737639008
2101.4 737639008 737490311 737582016 737236633 737137527 737525635 737693481 737791824 737462845 737368546 737498322
2111 737498322 737327805 737135468 737053604 737141113 736915512 736976700 737051392 736760635 736837158 736909332 736979599
$$ packed form
2042.6G43679504r7198j25427p5226K7695J25961N6991n42144m16642p1411J57242
2052.2G42719345O9046J07575j49231n66178K0218l13415n72815l9521L02353q6975
2061.9G41490402m94461L71399J58768l45001j6251k43759l90015k55356k25677k30484
2071.5G39819565J90811J36108k3803L8452j54038O4621j19171m83627l53470N264
2081.1G39120712J06583l79028l93525J46409R8648j93253j46103n6381J71356L6163
2090.8G38511581j45797j80741k65884n3635n6381J07575N34p6065K36663o9656l69186
2101.4G37639008j48697R1705l45383r9106L88108J67846R8343l28979r4299J29776
2111G37498322j70517j92337q1864Q7509k25601O1188P4692k90757P6523P2174P0267
$$ plain form
2121.6 736979599 737255249 737261276 736702194 736385880 736371231 736111221 736025009 736171265 736543808 736779480
2131.3 736779480 736615524 736468430 736472626 736577988 736633606 736400528 736215210 736074295 735598450 735536423
2140.9 735536423 735625839 735759506 736217880 736246109 736134872 736012726 735939331 735712814 735383835 735469666
2150.6 735469666 735538712 735704498 736116638 736570587 736563187 736366806 736191635 735750122 735481491 735121689
2160.2 735121689 735073929 735324478 735653305 736210480 736188278 735991745 736197128 736180649 735453186 735093918
2169.9 735093918 735266037 735221024 735366364 735434113 735514374 735504684 735256805 735204468 735193634 735124741 734964523
2180.5 734964523 735066299 735157623 735083313 735247192 735351944 735487900 735739975 735731430 735442810 735220718
2190.1 735220718 735124130 734948502 734962006 735464706 735805206 735792618 735699539 735444336 735456085 735515289 735341034
$$ packed form
2121.6G36979599K75650O027n59082l16314j4649k60010q6212J46256L72543K35672
2131.3G36779480j63956j47094M196J05362N5618k33078j85318j40915m75845o2027
2140.9G35536423Q9416J33667M58374K8229j11237j22146p3395k26517l28979Q5831
2150.6G35469666O9046J65786M12140M53949p400j96381j75171m41513k68631l59802
2160.2G35121689m7760K50549L28827N57175k2202j96533K05383j6479p27463l59268
2169.9G35093918J72119m5013J45340O7749Q0261r690k47879n2337j0834o8893j60218
2180.5G34964523J01776R1324p4310J63879J04752J35956K52075q545k88620k22092
2190.1G35220718r6588j75628J3504N02700L40500j2588r3079k55203J1749N9204j74255
$$ plain form
2200.7 735341034 735041122 734799042 734505768 734166107 734460220 734679794 735061951 735753174 735758591 735303192
2210.4 735303192 734937592 735261536 735137558 734629440 734675369 734614410 734594803 734450989 734293137 734203033
2220 734203033 734284668 734548340 734603271 734756546 734640350 734357147 734243240 734286194 734167786 733889999
2229.7 733889999 734108810 734193268 733925095 733829346 733835373 733707275 733552780 733471069 733477631 733556290 733384399
2240.3 733384399 733233414 733205643 733285065 733479462 733698578 733828125 733472366 733251801 733268890 732853088
2249.9 732853088 732554474 732904663 733111267 732983704 732991791 733132935 733161621 732454376 732048950 732309875
2259.5 732309875 732206116 731961365 731686249 731592026 731759872 732245789 732724686 732982178 733035736 732772141
2269.2 732772141 732720871 732277908 731724167 731712723 731989517 732211609 732149429 732282181 732383118 732489395
$$ packed form
2200.7G35341034k99912k42080k93274l39661K94113K19574L82157O91223N417m55399
2210.4G35303192l65600L23944j23978n08118M5929o0959j9607j43814j57852r0104
2220G34203033Q1635K63672N4931J53275j16196k83203j13907M2954j18408k77787
2229.7G33889999K18811Q4458k68173r5749O027j28098j54495q1711O562P8659j71891
2240.3G33384399j50985k7771P9422J94397K19116J29547l55759k20565J7089m15802
2249.9G32853088k98614L50189K06604j27563Q087J41144K8686p07245m05426K60925
2259.5G32309875j03759k44751k75116r4223J67846M85917M78897K57492N3558k63595
2269.2G32772141n1270m42963n53741j1444K76794K22092o2180J32752J00937J06277
$$ plain form
2278.8 732489395 732299652 732022095 731782913 731366043 731239471 730784683 730887680 731352158 731622314 731737900
2288.5 731737900 731522522 732023621 731922836 731343536 730826263 730428009 730898743 731331787 731609497 731343536
2298.1 731343536 731532745 732163620 732281418 732176285 731507721 731393661 731146545 730780716 730916214 730928192
2307.8 730928192 731408691 732084427 732535019 732217636 731956787 731746521 731289368 731344376 731094818 731139069
2317.4 731139069 730989075 730909576 731594391 732020645 732404327 732108154 731083984 730367737 730663376 731110153
2327.1 731110153 731603470 731892471 731236954 730990448 730467224 731161118 732685089 732233505 731395950
2335.7 731395950 731221619 732193298 732795486 732569427 732202225 730728073 730732117 732226639 732639313 732244415
2345.4 732244415 731399002 730833435 731298294 732718887 733446350 731959915 731283417 732651138 733320084
$$ packed form
2278.8G32489395j89743k77557k39182m16870j26572m54788J02997M64478K70156J15586
2288.5G31737900k15378N01099j00785n79300n17273l98254M70734M33044K77710k65961
2298.1G31343536J89209O30875J17798j05133o68564j14060k47116l65829J35498J1978
2307.8G30928192M80499O75736M50592l17383k60849k10266m57153N5008k49558M4251
2317.4G31139069j49994p9499O84815M26254L83682k96173j024170p16247K95639M46777
2327.1G31110153M93317K89001o55517k46506n23224O93894J523971m51584q37555
2335.7G31395950j74331R71679O02188k26059l67202j474152M044J494522M12674l94898
2345.4G32244415q45413n65567M64859J420593P27463j486435o76498J367721O68946
$$ plain form
2354.1 733320084 732553406 732632675 734039383 733930359 733317108 732306900 730951157 730588837 730971985
2362.7 730971985 732609406 733033524 731900253 730851212 731328278 732343445 731795502 731643219 731784668
2371.4 731784668 731969147 731721497 731057434 731263580 731254654 731485367 731729736 731482697 731579819 731523895
2381.1 731523895 731403427 731179047 730697403 730470886 730591583 731211243 731690369 731633377 731756973 731789246
2390.7 731789246 731664505 731490631 730844955 730532684 730766373 730870667 730842896 730874863 730942383 730717697
2400.3 730717697 730551910 730854645 731005630 730679092 730556030 730552750 730448227 730528870 730263138 730187912
2410 730187912 730462570 730527039 730824661 730793839 730143433 729444199 729134674 729163055 729327621 729472198
2419.6 729472198 729354401 729692535 729970322 729789429 729901428 729792557 729654770 729638519 729406586 729093704
$$ packed form
2354.1G33320084p66678P9269J406708j09024o13251j010208j355743l62320L83148
2362.7G30971985J637421M24118j133271j049041M77066J015167n47943j52283J41449
2371.4G31784668J84479k47650o64063K06146q926K30713K44369k47039R7122n5924
2381.1G31523895j20468k24380m81644k26517J20697O19660M79126n6992J23596L2273
2390.7G31789246j24741j73874o45676l12271K33689J04294k7771L1967O7520k24686
2400.3G30717697j65787L02735J50985l26538j23062l280j04523Q0643k65732p5226
2410G30187912K74658O4469K97622l0822o50406o99234l09525K8381J64566J44577
2419.6G29472198j17797L38134K77787j80893J11999j08871j37787j6251k31933l12882
$$ plain form
2429.3 729093704 728598862 728414230 728664856 729003448 729248047 729283676 729269714 728904648 728383026 728019409
2438.9 728019409 727628784 727612839 727993622 728376465 728393478 728309937 728540192 728621292 728406372 727879486
2448.6 727879486 727442856 727286758 727149811 727198563 727272949 727369308 727401962 727511139 727656097 727646637 727495270
2459.2 727495270 726925201 726609879 726440659 726149216 726019592 726052933 726378860 726426773 726429214 726450195
2468.8 726450195 726281967 725998840 725577850 725468750 725198593 724892120 724953690 725277252 725500641 725282516
2478.5 725282516 725104065 724817352 724661331 724661865 724609680 724388428 723903503 724132156 724522018 724578018
2488.1 724578018 724779053 724914322 724724274 724019470 723342819 723072662 723118515 723147583 722921753 722767944
2497.7 722767944 722919922 723132324 723136597 723325958 723334656 722860413 722433624 722210770 722184067 721980896
$$ packed form
2429.3G29093704m94842j84632K50626L38592K44599L5629j3962l65066n21622l63617
2438.9G28019409l90625j5945L80783L82843J7013q3541K30255Q1100k14920n26886
2448.6G27879486m36630j56098j36947M8752P4386R6359L2654J09177J44958r460j51367
2459.2G27495270n70069l15322j69220k91443j29624L3341L25927M7913K441K0981
2468.8G26450195j68228k83127m20990j09100k70157l06473O1570L23562K23389k18125
2478.5G25282516j78451k86713j56021N34n2185k21252m84925K28653L89862N6000
2488.1G24578018K01035J35269j90048p04804o76651k70157M5853K9068k25830j53809
2497.7G22767944J51978K12402M273J89361Q698m74243m26789k22854k6703k03171
$$ plain form
2507.4 721980896 721800766 721926041 722005920 722005310 721942444 721882477 721695023 721305695 721201401 721248245 721029205
2518 721029205 721077118 721242905 721041870 721023331 721173325 721237335 721293869 721227493 721019211 720594635 720015411
2528.6 720015411 719891129 720201416 720113525 719936142 720020065 719972305 720079117 720326767 720324020 720143890
2538.2 720143890 719875107 719472351 719046021 718691254 718456726 718677216 719033508 718921356 718732300 718782883
2547.9 718782883 718967743 718961182 718603592 718486557 718431320 718178253 718163147 718163452 717872314 717447433 717542572
2558.5 717542572 717863617 717661438 717444916 717206879 716913223 716899414 717006226 716918640 716616898 716706085
2568.1 716706085 716928329 716775589 716440353 716166077 716178665 716116409 715873489 715645523 715656967 716100540
2577.8 716100540 716012726 715461426 715342712 715083237 714864960 714943237 714676743 714443436 714542389 714476166
$$ packed form
2507.4G21980896j80130J25275P9879o10o2866n9967j87454l89328j04294M6844k19040
2518G21029205M7913J65787k01035j8539J49994O4010N6534o6376k08282m24576n79224
2528.6G20015411j24282L10287q7891j77383Q3923m7760J06812K47650k747j80130
2538.2G20143890k68783m02756m26330l54767k34528K20490L56292j12152j89056N0583
2547.9G18782883J84860o561l57590j17035n5237k53067j5106L05k91138m24881R5139
2558.5G17542572L21045k02179k16522k38037k93656j3809J06812q7586l01742Q9187
2568.1G16706085K22244j52740l35236k74276J2588o2256k42920k27966J1444M43573
2577.8G16100540q7814n51300j18714k59475k18277P8277k66494k33307R8953o6223
$$ plain form
2587.4 714476166 713967285 713670731 713998795 714206619 713901291 713533478 713342590 713003235 712786713 712870560
2597.1 712870560 712942429 712676392 712114410 712192535 712496262 712411270 712223511 711904755 711587296 711306534
2606.7 711306534 711129837 710734253 710531540 710693130 710688629 710868607 710666046 710224762 710042419 709845428
2616.4 709845428 709864120 709607849 709122391 709271088 709440308 708873215 708636246 708573914 707816849 707322235
2626 707322235 707234421 707221146 707482529 707590179 707262344 707173538 707115250 706827316 706788330 706423569 705997086
2636.6 705997086 705626602 705443344 705616302 705164413 704858932 705036240 705047760 704580536 704198837 704541245
2646.3 704541245 704362183 703861465 703627701 703416519 703251343 702968292 702846069 702679443 702481003 702519608
2655.9 702519608 702439346 702116928 702134018 702345810 702064896 701850128 701799393 701580811 701068268 700254059
$$ packed form
2587.4G14476166n08881k96554L28064K07824l05328l67813j90888l39355k16522Q3847
2597.1G12870560P1869k66037n61982P8125L03727q4992j87759l18756l17459k80762
2606.7G11306534j76697l95584k02713J61590m501J79978k02561m41284j82343j96991
2616.4G09845428J8692k56271m85458J48697J69220n67093k36969o2332p57065m94614
2626G07322235q7814j3275K61383J07650l27835q8806n8288k87934l8986l64761m26483
2636.6G05997086l70484j83258J72958m51889l05481J77308J1520m67224l81699L42408
2646.3G04541245j79062n00718k33764k11182j65176k83051j22223j66626j98440L8605
2655.9G02519608q0262l22418J7090K11792k80914k14768n0735k18582n12543q14209
$$ plain form
2665.5 700254059 699839783 699958038 700180130 700314026 700233612 699905930 699701157 699480820 698956451 698629532
2675.2 698629532 698588409 698699951 699004745 699098740 698740387 698326187 697696533 697247543 697539368 697524567
2684.8 697524567 697222443 696856689 696247482 695956116 695920944 696017914 696033707 695880508 695930176 695920944 695340271
2695.4 695340271 695100098 695358734 694761887 693942413 693641434 693964844 694588089 694526443 694176559 693689804
2705.1 693689804 693425827 693657455 693379745 692814636 692671661 692715912 692620621 692236710 691813507 691589203
2714.7 691589203 691167984 690899200 690989227 690668106 690187454 690174255 690339890 690079269 689876709 689904251
2724.4 689904251 689703674 689791946 689708023 689030228 688452530 688137360 687983017 687640381 687071457 686808548
2734 686808548 686759033 686889191 687264709 686933136 686297150 686276932 686035080 685586014 685500946 685386810
$$ packed form
2665.5G00254059m14276J18255K22092J33896q0414l27682k04773k20337n24369l26919
2675.2F98629532m1123J11542L04794R3995l58353m14200o29654m48990K91825j4801
2684.8F97524567l02124l65754o09207k91366l5172R6970J5793j53199M9668r232n80673
2695.4F95340271k40173K58636n96847q19474l00979L23410O23245o1646l49884m86755
2705.1F93689804k63977K31628k77710n65109j42975M4251r5291l83911m23203k24304
2714.7F91589203m21219k68784R0027l21121m80652j3199J65635k60621k02560K7542
2724.4F89904251k00577Q8272q3923o77795n77698l15170j54343l42636n68924k62909
2734F86808548m9515J30158L75518l31573o35986k0218k41852m49066q5068j14136
$$ plain form
2743.7 685386810 685072250 685138931 685440292 685170517 684587631 684294357 684148407 683779526 683682022 683784790
2753.3 683784790 683546371 683342972 683100586 682773743 682543640 682674179 682903595 682328262 681565933 681484604
2762.9 681484604 681413345 680864944 680718155 680849686 680590363 680588150 680581970 680081100 679536362 679085312
2772.6 679085312 678767090 678657227 678581085 678269043 677655029 677223282 677118835 676985168 677009354 676741486
2782.2 676741486 676192169 676159515 675955811 675354004 675025940 675018082 674824142 674339905 674227524 674339294
2791.9 674339294 674110184 673779602 673451462 672936325 672776871 672696304 672086334 671451950 670696335 670105057
2801.5 670105057 670009537 669714432 669123383 668826218 668948822 668745041 668018265 667475357 667358093 666998291
2811.2 666998291 666499786 666366348 666068115 665589294 665313873 665225754 664743347 664115067 663713150 662736969
$$ packed form
2743.7F85386810l14560O6681L01361k69775n82886k93274j45950l68881r7504J02768
2753.3F83784790k38419k03399k42386l26843k30103J30539K29416n75333p62329q1329
2762.9F81484604p1259n48401j46789J31531k59323k213o180n00870n44738m51050
2772.6F79085312l18222j09863p6142l12042o14014m31747j04447j33667K4186k67868
2782.2F76741486n49317l2654k03704o01807l28064p858j93940m84237j12381J11770
2791.9F74339294k29110l30582l28140n15137j59454q0567o09970o34384p55615n91278
2801.5F70105057r5520k95105n91049k97165J22604k03781p26776n42908j17264l59802
2811.2F66998291m98505j33438k98233m78821k75421q8119m82407o28280m01917r76181
$$ plain form
2820.8 662736969 662243729 662585449 662388535 661717224 660779114 659914474 659557419 659249420 658655930 658265381
2830.4 658265381 658168030 657845154 657199631 656373291 655703125 655242386 654896545 654662476 653904800 652531891
2840.1 652531891 651300354 650212860 649063797 647779617 646358261 645268707 644141846 642634811
2847.8 642634811 641135483 639585419 638075905 637202110 637200699 637059860 636171341 635291443 635126228
2856.5 635126228 635524750 635886459 636084900 635741158 635210342 635227051 635105362 634510841 634145508 633865509
2866.1 633865509 633089104 632452698 631939392 631501312 631343460 631004715 630790596 630361557 629698906 629058800
2875.8 629058800 628611412 628631973 628341675 628022537 627767601 627313194 627066727 627049103 626940308 626563950
2885.4 626563950 626164169 625232468 624335976 624218102 624133644 623847122 623105965 622047958 621325188 620867424
$$ packed form
2820.8F62736969m93240L41720j96914o71311r38110q64640l57055l07999n93490l90549
2830.4F58265381r7351l22876o45523q26340o70166m60739l45841k34069p57676j372909
2840.1F52531891j231537j087494j149063j284180j421356j089554j126861j507035
2847.8F42634811j499328j550064j509514q73795j411j40839q88519q79898j65215
2856.5F35126228L98522L61709J98441l43742n30816J6709j21689n94521l65333k79999
2866.1F33865509p76405o36406n13306m38080j57852l38745k14119m29039o62651o40106
2875.8F29058800m47388K0561k90298l19138k54936m54407k46467j7624j08795l76358
2885.4F26563950l99781r31701q96492j17874q4458k86522p41157j058007p22770m57764
$$ plain form
2895.1 620867424 620141487 619260674 618581390 618322678 618333244 617915077 617326050 617008972 616789055 616252670
2904.7 616252670 615725632 615235291 614367065 613695145 613058243 612598343 612089615 611373596 610837936 609937401
2914.3 609937401 609125366 608261719 607120018 606389961 606098289 605091362 603638382 602869720 602158852
2923 602158852 602496910 602842712 602305603 601963959 601596832 602307854 602602196 602132263 602371445 602778702
2932.7 602778702 602967949 602812881 603514099 604249725 604346809 604976807 605372391 605120125 605277748 605925331
2942.3 605925331 606367455 606614494 606497459 606583633 606528397 606047897 605837631 605403328 605626793 605666313
2952 605666313 604778519 604124222 603581734 603588142 603378716 602894478 602949867 602779617 602467270 602590294
2961.6 602590294 602738686 602586784 602648926 602954140 603240623 603173752 602950554 603291321 604191246 604895630
$$ packed form
2895.1F20867424p25937q80813o79284k58712J0566m18167n89027l17078k19917n36385
2904.7F16252670n27038m90341q68226o71920o36902m59900n08728p16019n35660r00535
2914.3F09937401q12035q63647j141701p30057k91672j006927j452980p68662p10868
2923F02158852L38058L45802n37109l41644l67127P11022K94342m69933K39182M07257
2932.7F02778702J89247j55068P01218P35626R7084O29998L95584k52266J57623O47583
2942.3F05925331M42124K47039j17035Q6174n5236m80500k10266m34303K23465L9520
2952F05666313q87794o54297n42488O408k09426m84238N5389j70250l12347J23024
2961.6F02590294J48392j51902O2142L05214K86483o6871k23198L40767Q99925P04384
$$ plain form
2971.2 604895630 605184174 605908775 606708450 606915359 606691666 606945724 607693329 608174133 609089890 609689445
2980.9 609689445 609652176 609825592 610230789 610770187 610917168 610738449 610448189 610864792 611758041 612114372
2990.5 612114372 612298241 612569962 612729187 612234764 612009697 612257919 612362404 612706184 612711258 612456818
3000.2 612456818 612258949 612085991 612066727 612155151 611911049 611232071 610672913 610376358 610837593 610870857
3009.8 610870857 610278130 610697403 610980606 610540085 609881363 609116516 608532333 608221245 608290176 608005562
3019.5 608005562 607528610 607536201 606979561 605838928 605480080 605214958 604430580 604197617 604290924 604141922
3029.1 604141922 603928413 603284836 602392159 602256126 602456932 601869431 600734177 600252380 600170822 599769325
3038.7 599769325 599735527 599475441 598644676 598071556 597302704 596568489 596312943 595860291 595193596 594991379
$$ packed form
2971.2F04895630K88544P24601P99675K06909k23693K54058P47605M80804R15757N99555
2980.9F09689445l7269J73416M05197N39398J46981j78719k90260M16603Q93249L56331
2990.5F12114372J83869K71721J59225m94423k25067K48222J04485L43780N074k54440
3000.2F12456818j97869j72958j9264Q8424k44102o78978n59158k96555M61235L3264
3009.8F10870857n92727M19273K83203m40521o58722p64847n84183l11088O8931k84614
3019.5F08005562m76952P591n56640j140633l58848k65122p84378k32963R3307j49002
3029.1F04141922k13509o43577q92677j36033K00806n87501j135254m81797q1558m01497
3038.7E99769325l3798k60086q30765n73120p68852p34215k55546m52652o66695k02217
$$ plain form
3048.4 594991379 594707375 593902664 593216476 592738075 592497101 591938248 591248779 591095314 590486183 589546127
3058 589546127 589302750 589347076 588984146 588258591 587423096 586982269 586826172 586520767 585976715 584933014
3067.7 584933014 584433517 584474220 583872871 582995987 582376175 582027740 581887817 582032852 582068138 581739998
3077.3 581739998 581405754 581020737 580586586 580165215 579416084 578525238 578202171 577825050 577129517 576720543
3087 576720543 576508751 576403503 576017570 575214195 574180222 573628578 573672867 573595886 573577499 572854347
3096.6 572854347 571683121 571426811 571441269 570940819 570452003 570369110 569870949 568792801 568235626 568279381
3106.2 568279381 567953568 567259445 566546478 565824471 565153046 564768639 564872437 564384003 563513908 562888298
3115.9 562888298 562211685 562162971 561860619 560790367 560070381 559869919 559784012 559186363 558187370 557678070
$$ packed form
3048.4E94991379k84004q04711o86188m78401k40974n58853o89469j53465o09131r40056
3058E89546127k43377M4326l62930p25555q35495m40827j56097l05405n44052j043701
3067.7E84933014m99497M0703o01349q76884o19812l48435j39923J45035L5286l28140
3077.3E81739998l34244l85017m34151m21371p49131q90846l23067l77121o95533m08974
3087E76720543k11792j05248l85933q03375j033973n51644M4289p6981j8387p23152
3096.6E72854347j171226k56310J4458n00450m88816q2893m98161j078148n57175M3755
3106.2E68279381l25813o94123p12967p22007o71425l84407J03798m88434q70095o25610
3115.9E62888298o76613m8714l02352j070252p19986k00462q5907n97649r98993n09300
$$ plain form
3125.5 557678070 557699547 557151985 556600723 556662521 555999565 554802818 554195786 553361053 552401237 552055168
3135.2 552055168 551214180 550691872 550597153 549994926 549649239 548857307 547910805 547104988 546329346 545988770
3144.8 545988770 545427284 544822311 544285202 543901367 543212624 542386742 542055702 541414948 540560684 539759560
3154.5 539759560 539403648 539286270 538607712 537706337 537169533 536803932 535942879 535056190 534533958 533856049
3164.1 533856049 532881279 532464485 532266846 531394577 530665398 530218353 529489517 528313828 527614479
3172.8 527614479 527076988 526257362 526033974 525379257 524670067 524247856 523660355 523147621 522139626
3181.5 522139626 521234131 520761032 520433846 519686470 518777657 518091698 517180405 516914101 516856575 516149521
3191.1 516149521 515434532 514952164 514142494 513066597 512371674 511999741 511363144 510189285 509486237
$$ packed form
3125.5E57678070K1477n47562n51262O1798o62956j196747o07032q34733r59816l46069
3135.2E52055168q40988n22308r4719o02227l45687p91932r46502q05817p75642l40576
3144.8E45988770n61486o04973n37109l83835o88743q25882l31040o40754q54264q01124
3154.5E39759560l55912j17378o78558r01375n36804l65601q61053q86689n22232o77909
3164.1E33856049r74770m16794j97639q72269p29179m47045p28836j175689o99349
3172.8E27614479n37491q19626k23388o54717p09190m22211n87501n12734j007995
3181.5E22139626r05495m73099l27186p47376r08813o85959r11293k66304n7526p07054
3191.1E16149521p14989m82368q09670j075897o94923l71933o36597j173859p03048
$$ plain form
3199.8 509486237 509401398 509224281 508616142 507767754 507219505 506777458 506119385 505056343 504257050 503431473
3209.4 503431473 502655067 502358704 501739006 501432800 500741882 499992142 499679222 498924980 498742828 498285713
3219.1 498285713 497233849 496551857 496164017 495842819 495291061 494819908 494464302 494064674 493256912
3227.8 493256912 492522354 492137375 491414566 490658226 490222015 489913025 489634552 489281502 488517723 487876358
3237.4 487876358 487497482 486960945 486228180 485502892 485009308 484358864 484093208 483635941 482692871 482406807
3247 482406807 482247429 481728020 481137238 480962715 480364113 479581108 479422302 479351082 479291115 478691826
3256.7 478691826 478168945 478024979 477597427 476552353 475739746 475767021 475325470 474945335 474528770 473855667
3266.3 473855667 473189583 472782745 473184891 473033066 472845459 472535515 471380844 470398865 470366325 470686226
$$ packed form
3199.8E09486237q4839j77117o08139q48388n48249m42047o58073j063042p99293q25577
3209.4E03431473p76406k96363o19698l06206o90918p49740l12920p54242j82152m57115
3219.1D98285713j051864o81992l87840l21198n51758m71153l55606l99628q07762
3227.8D93256912p34558l84979p22809p56340m36211l08990k78473l53050p63779o41365
3237.4D87876358l78876n36537p32765p25288m93584o50444k65656m57267r43070k86064
3247D82406807j59378n19409n90782j74523n98602p83005j58806p1220n9967n99289
3256.7D78691826n22881j43966m27552j045074q12607K7275m41551l80135m16565o73103
3266.3D73855667o66084m06838M02146j51825j87607l09944j154671r81979l2540L19901
$$ plain form
3276 470686226 469828644 468930130 468521118 468214569 467880554 467541389 467459030 466729774 466246414 465703773
3285.6 465703773 464718781 464417915 464290352 464218407 464075584 463344193 462305527 461799164 461381683 460813789
3295.3 460813789 460551109 460309906 460008774 459221954 458401871 458152885 458233070 457973099 457227859 456879005
3304.9 456879005 456407013 455370865 454642258 454399834 453832779 453193550 452757607 452061424 451537628
3313.6 451537628 451307487 450831985 449663391 448653870 448318253 448183899 448046799 447539787 446658630
3322.3 446658630 445576401 445452080 445643311 444912720 444083977 443327408 442682228 441960983 441467514
3330.9 441467514 440784760 439976807 439833145 439330788 438601074 437793388 436951942 436494141 436413422 436109467
3340.6 436109467 435214844 434500656 433449097 432510529 432176132 431979599 431818810 431187973 430479507
$$ packed form
3276D70686226q57582q98514m09012l06549l34015l39165q2359p29256m83360n42641
3285.6D65703773r84992l00866j27563p1945j42823p31391j038666n06363m17481n67894
3295.3D60813789k62680k41203l01132p86820q20083k48986Q0185k59971p45240l48854
3304.9D56879005m71992j036148p28607k42424n67055o39229m35943o96183n23796
3313.6D51537628k30141m75502j168594j009521l35617j34354j37100n07012q81157
3322.3D46658630j082229j24321J91231p30591q28743p56569o45180p21245m93469
3330.9D41467514o82754q07953j43662n02357p29714q07686q41446m57801q0719l03955
3340.6D36109467q94623p14188j051559r38568l34397j96533j60789o30837p08466
$$ plain form
3349.3 430479507 430037613 429391327 428291664 427759895 427327309 426593475 426506348 426093216 425594063 425086784
3358.9 425086784 424362640 423664398 422760315 422322044 421875954 421234779 420377426 419449921 419229012 419339027
3368.6 419339027 419201736 418324127 417271652 416747360 416244125 415625610 415321503 415116386 414498329
3377.2 414498329 413728256 413325119 412815361 412040634 411789284 411596947 411431770 411406517 411030884 410541878
3386.9 410541878 410080414 409699860 408678436 408157349 408810272 408471107 407486763 407040443 406698608
3395.6 406698608 406364937 406098480 405752983 405851555 406150436 405936852 405583687 404879112 404319000 404247780
3405.2 404247780 404395714 404490738 404011650 403390160 403162155 403263817 402788963 402366867 402687225 402966347
3414.8 402966347 402909698 402262878 401741180 401917305 402458839 402349663 401798706 401793289 401937065 401820946
$$ packed form
3349.3D30479507m41894o46286j099663n31769m32586p33834q7127m13132m99153n07279
3358.9D25086784p24144o98242r04083m38271m46090o41175q57353r27505k20909J10015
3368.6D19339027j37291q77609j052475n24292n03235o18515l04107k05117o18057
3377.2D14498329p70073m03137n09758p74727k51350j92337j65177k5253l75633m89006
3386.9D10541878m61464l80554j021424n21087O52923l39165r84344m46320l41835
3395.6D06698608l33671k66457l45497R8572K98881k13584l53165p04575n60112p1220
3405.2D04247780J47934R5024m79088o21490k28005J01662m74854m22096L20358K79122
3414.8D02966347n6649o46820n21698J76125N41534j09176n50957n417J43776j16119
$$ plain form
3424.5 401820946 401351318 401587486 401956253 401802292 401918259 402190361 402200394 401702881 401636200 401762276
3434.1 401762276 401944733 401962585 401734238 402048149 402066689 402226219 402392578 402430267 402769089 403088608
3443.8 403088608 403157959 402960281 403491783 403478050 403298874 403714523 404024620 404619484 405034180 405603638
3453.4 405603638 405955391 406004791 405734444 405366478 406043510 406990242 407471123 407665062 408087044 407865944
3463.1 407865944 407854729 408705597 409136696 409425278 409392014 410097885 411183548 411554985 411662254 411791649
3472.7 411791649 412580986 413186684 413318176 413392105 413527336 413813820 414535599 415342674 415565834 415679665
3482.3 415679665 415705528 416426353 417338371 418357086 419085464 418735046 418919678 419427872 420236053 420683517
3492 420683517 420972519 421569557 421798439 422562103 422993355 423223648 423406067 423881912 425012360 426164246
$$ packed form
3424.5D01820946m69628K36168L68767j53961J15967K72102J0033m97513o6681J26076
3434.1D01762276J82457J7852k28347L13911J8540J59530J66359L7689L38822L19519
3443.8D03088608O9351j97678N31502j3733j79176M15649L10097N94864M14696N69458
3453.4D05603638L51753M9400k70347l67966O77032R46732M80881J93939M21982k21100
3463.1D07865944j1215Q50868M31099K88582l3264P05871J085663L71437J07269J29395
3472.7D11791649P89337O05698J31492P3929J35231K86484P21779Q07075K23160J13831
3482.3D15679665K5863P20825R12018J018715P28378l50418J84632N08194Q08181M47464
3492D20683517K89002N97038K28882P63664M31252K30293J82419M75845J130448J151886
$$ plain form
3501.6 426164246 427403717 426906548 426437798 427559586 428622475 429272308 429996109 429956932 429667511
3510.3 429667511 430883827 431583595 432348137 433330154 433716087 434112358 434123993 434729691 435382156 435808449
3520 435808449 436473503 437579422 438911018 439452477 439657364 439951897 440833168 440998383 441358604 442311745
3529.6 442311745 443258896 444239273 444199409 444850082 445525970 446725960 448067017 447741737 448245888
3538.3 448245888 449127426 449709740 450067215 451417961 452313499 452851295 453964767 453647156 454898872
3547 454898872 455364723 455894890 456841888 457860031 459872322 458793449 459187202 460120125 460713387
3555.6 460713387 462303047 462481689 463500443 464695435 465906525 466178017 466880493 468543663 469271202
3564.3 469271202 472380714 473015938 471273880 471192741 470773697 473370705 474735870 475347176 476818199
$$ packed form
3501.6D26164246J239471m97169m68750J121788J062889O49833P23801l9177k89421
3510.3D29667511J216316O99768P64542R82017L85933L96271J1635O05698O52465M26293
3520D35808449O65054J105919J331596N41459K04887K94533Q81271J65215L60221R53141
3529.6D42311745R47151R80377l9864O50673O75888J199990J341057l25280N04151
3538.3D48245888Q81538N82314L57475J350746Q95538N37796J113472l17611J251716
3547D54898872M65851N30167R46998J018143K012291j078873L93753R32923N93262
3555.6D60713387J589660J78642J018754J194992J211090K71492P02476J663170P27539
3564.3D69271202L109512O35224j742058q1139m19044K597008J365165O11306J471023
$$ plain form
3573 476818199 477941666 478104897 478834114 480467644 480180931 480795326 482533531 483566551 484580116
3581.7 484580116 486194305 487456627 487550087 490142365 491795540 490337639 491111984 490098610 491681137
3590.4 491681137 494025955 496133919 497152786 497232437 499917145 499287148 499568100 501867332 502899055
3599 502899055 505643616 505976906 505336914 506596947 507790794 509257545 511623535 514036407 512934532
3607.7 512934532 515147018 515387077 513186569 518124504 520330200 518720932 521675720 521078224 522847061
3616.4 522847061 525960999 525867271 526900177 527074623 527711983 530178413 532115936 533309174 535248184
3625.1 535248184 537346992 538568535 542705345 544323845 536552696 539032059 541954803 545927238
3632.8 545927238 548577042 547545547 549117813 552124138 554242249 554466057 555322990 557145691 559417839
$$ packed form
3573D76818199J123467J63231P29217J633530k86713O14395J738205J033020J013565
3581.7D84580116J614189J262322R3460K592278J653175j457901P74345j013374J582527
3590.4D91681137K344818K107964J018867P9651K684708o29997K80952K299232J031723
3599E02899055K744561L33290o39992J260033J193847J466751K365990K412872j101875
3607.7E12934532K212486K40059k200508M937935K205696j609268K954788n97496J768837
3616.4E22847061L113938r3728J032906J74446O37360K466430J937523J193238J939010
3625.1E35248184K098808J221543M136810J618500p771149K479363K922744L972435
3632.8E45927238K649804j031495J572266L006325K118111K23808Q56933J822701K272148
$$ plain form
3641.5 559417839 560651703 560309029 562123413 565848427 570963440 569722481 566573105 571641579
3649.2 571641579 570940361 570081367 570171394 573249702 575953865 578732491 583231392 578886681 580046539
3657.9 580046539 583712769 584640999 585439186 585909691 587673645 588622169 590199509 591930542 592575226
3666.5 592575226 595569801 597573547 597378387 598256149 594568825 595678329 601403503 607408257 607251663
3675.2 607251663 594249153 595868340 602707710 607100906 606148491 605614052 607179146 609076538
3682.9 609076538 610606918 610973434 610992508 614137039 618918266 611084366 607087059 614346733 612983208
3691.6 612983208 611646080 614223137 613838005 614666557 615171013 614588890 615000267 615468674 617872810
3700.3 617872810 620612068 617574577 615402260 618841629 620541306 620740700 621498070 623024483 626282768
$$ packed form
3641.5E59417839J233864l42674J814384L725014N115013j240959l149376N068474
3649.2E71641579p01218q58994R0027L078308K704163K778626M498901m344711J159858
3657.9E80046539L666230R28230P98187M70505J763954R48524J577340J731033O44684
3666.5E92575226K994575K003746j95160Q77762l687324J109504N725174O004754j56594
3675.2F07251663j3002510J619187O839370M393196r52415n34439J565094J897392
3682.9F09076538J530380L66516J9074L144531M781227p833900l997307P259674j363525
3691.6F12983208j337128K577057l85132Q28552N04456n82123M11377M68407K404136
3700.3F17872810K739258l037491k172317L439369J699677J99394P57370J526413L258285
$$ plain form
3709 626282768 621709099 623508224 626772156 617114372 620934372 624383507 624584694 624974518 626744385
3717.7 626744385 628267479 626022644 626152306 629920616 628534241 624949608 629194374 630928802
3725.4 630928802 630147629 628217354 627188416 629767494 630243835 634296188 633421097 626550369 633448677
3734 633448677 634485130 626541672 627044716 628599205 628473511 630532570 633407593 630136681 631962891
3742.7 631962891 640391846 635275993 622826004 628928719 633291817 638069611 634950371 624815292
3750.4 624815292 633255424 630574341 625789566 629923401 633148651 636373405 632744827 633427925
3758.2 633427925 636982880 631542435 630478745 633293762 633842430 633567314 636214256 634999352 632243195
3766.8 632243195 634195404 636713448 636936455 630719414 631683540 634011841 634204292 634953690 635153809
$$ packed form
3709F26282768m573669J799125L263932r657784L820000L449135K01187L89824J769867
3717.7F26744385J523094k244835J29662L768310j386375l584633M244766J734428
3725.4F30928802p81173j930275j028938K579078M76341M052353q75091o870728O898308
3734F33448677J036453p943458N03044J554489j25694K059059K875023l270912J826210
3742.7F31962891Q428955n115853j2449989O102715M363098M777794l119240j0135079
3750.4F24815292Q440132k681083m784775M133835L225250L224754l628578O83098
3758.2F33427925L554955n440445j063690K815017N48668k75116K646942j214904k756157
3766.8F32243195J952209K518044K23007o217041R64126K328301J92451P49398K00119
$$ plain form
3775.5 635153809 635144768 634656906 636915398 637263145 631297112 632530098 633836212 634511986 636522980
3784.2 636522980 634402008 633436890 634739876 635063972 635457993 635217247 635290146 635224342 635131645 635033913
3793.8 635033913 635867844 638854408 635909004 632331619 634046326 636076775 640302963 635961075
3801.5 635961075 628149223 631603203 633944244 636754723 639583969 632588463 629802284 634018478
3809.3 634018478 636343842 636526375 636464691 636355591 637306786 640933914 639979706 629523544 632448311
3817.9 632448311 636531258 639732399 640182724 627795753 630190392 633807449 634961510 636717720
3825.7 636717720 637496414 634932556 634017868 634946365 637902107 640539322 633602486 634504089 640510178
3834.3 640510178 635971260 634085693 639972343 633501816 628657761 635687256 633134460 631893387
$$ packed form
3775.5F35153809r041m87862K258492L47747n966033J232986J306114O75774K010994
3784.2F36522980k120972r65118J302986L24096L94021k40746P2899o5804r2697r7732
3793.8F35033913Q33931K986564k945404l577385J714707K030449M226188m341888
3801.5F35961075p811852L453980K341041K810479K829246o995506k786179M216194
3809.3F34018478K325364J82533o1684j09100R51195L627128r54208j0456162K924767
3817.9F32448311M082947L201141M50325j2386971K394639L617057J154061J756210
3825.7F36717720P78694k563858r14688R28497K955742K637215o936836R01603O006089
3834.3F40510178m538918j885567N886650o470527m844055P029495k552796j241073
$$ plain form
3842.1 631893387 637096863 636443481 633663559 634985161 635796890 635933571 637272682 636289673 636780548
3850.7 636780548 642205963 639729691 638916588 625659561 624832115 633127823 634064255 632737503 633832169
3859.4 633832169 635047798 636971741 633455009 633102875 637937851 633329277 630109596 633361549
3867.1 633361549 636348763 641329956 635712471 626864471 629678955 634240608 637215614 630675926
3874.8 630675926 631644020 634440613 633722610 634539566 638151894 636263885 629875717 633691483 634564896
3883.5 634564896 635009155 639383583 630042076 629922066 633063278 633746147 636838150 636855354 630607033
3892.2 630607033 631788254 634558945 632493668 632337761 633016663 634987946 636944389 629161568 632373009
3900.9 632373009 634042206 629201851 632847099 631065521 629678726 630719223 631501732 632612228
$$ packed form
3842.1F31893387N203476o53382k779922J321602Q11729J36681J339111r83009M90875
3850.7F36780548N425415k476272q13103j3257027q27446Q295708R36432j326752J094666
3859.4F33832169J215629J923943l516732l52134M834976m608574l219681L251953
3867.1F33361549K987214M981193n617485q848000K814484M561653K975006o539688
3874.8F30675926R68094K796593p18003Q16956L612328j888009o388168L815766Q73413
3883.5F34564896M44259M374428r341507j20010L141212O82869L092003J7204o248321
3892.2F30607033J181221K770691k065277j55907O78902J971283J956443p782821L211441
3900.9F32373009J669197m840355L645248j781578j386795J040497P82509J110496
$$ plain form
3908.6 632612228 631854820 632006645 632363739 632872009 633144722 632149277 632664146 633914642 631085472
3917.3 631085472 628484993 631931229 633126068 630114784 631155739 632363052 633527412 632686539
3925 632686539 629594765 630761528 632698059 633715096 632852058 632435875 634094810 631803703 630023842
3933.7 630023842 631080093 630884323 630509300 631240273 631804962 631299095 630577850 631568184 633127136
3942.3 633127136 630097122 628278160 629346046 630860634 631966934 629622955 629952202 630822754 629341927
3951 629341927 630526428 630403366 629611855 629906120 630196800 630279846 629883614 630394020 630413780 630906143
3960.7 630906143 631347504 629998817 629781914 629990120 629995232 630208206 629684486 629533691 629460487 628605919
3970.3 628605919 628902664 629552269 629827194 630292625 629946785 629106522 628568611 629289474 629912262 629080086
$$ packed form
3908.6F32612228p57408J51825L57094N08270K72713r95445N14869J250496k829170
3917.3F31085472k600479L446236J194839l011284J040955J207313J164360q40873
3925F32686539l091774J166763J936531J017037q63038m16183J658935k291107j779861
3933.7F30023842J056251j95770l75023P30973N64689n05867p21245R90334J558952
3942.3F33127136l030014j818962J067886J514588J106300k343979L29247Q70552j480827
3951F29341927J184501j23062p91511K94265K90680Q3046l96232N10406J9760M92363
3960.7F30906143M41361j348687k16903K08206N112K12974n23720j50795p3204q54568
3970.3F28605919K96745O49605K74925M65431l45840q40263n37911P20863O22788q32176
$$ plain form
3980 629080086 628564148 629027100 629676819 629996719 630053940 629469032 629114685 629092636 629154854 630073318
3989.6 630073318 630059090 629060287 628692970 629200554 629540977 628759193 628245354 628595161 628717575 628098755
3999.2 628098755 628089447
4000.2 628089447
$$ packed form
3980F29080086n15938M62952O49719L19900N7221n84908l54347k2049O2218R18464
3989.6F30073318j4228r98803l67317N07584L40423p81784n13839L49807J22414o18820
3999.2F28098755r308
4000.2F28089447
##END=$$ End of the data block
