##TITLE=$$ Begin of the data block
##JCAMP-DX=5.00 $$ ACD/SpecManager v 10.08
##SPECTROMETER/DATA SYSTEM=Varian
##DATE=18 Dec 2012 13:49:12
##DATA TYPE=INFRARED SPECTRUM
##DATA CLASS=XYDATA
##ORIGIN=
##OWNER=
##NPOINTS=3735
##FIRSTX=399.26403809
##LASTX=4000.35498047
##MAXX=4000.35498047
##MINX=399.26403809
##MAXY=83.13577271
##MINY=33.33050919
##XFACTOR=1.0000000000
##YFACTOR=0.000000100000000
##FIRSTY=72.27630615
##DELTAX=0.96440572
##XUNITS=1/CM
##YUNITS=TRANSMITTANCE
##XYDATA=(X++(Y..Y))
399.3 722763062 729026871 714583206 694985352 691001205 703767700 714012299 713660507 714963226
407 714963226 718751221 719155884 714326477 712918777 720936584 729311142 722258606 709487000 708031616
415.7 708031616 707262726 707438431 712996902 711274033 713055115 713202972 709104767 703847809 709308853
424.3 709308853 713000565 710469589 710046539 709082031 706432571 700874786 700847092 706335144 706670074
433 706670074 708860779 711886215 707434921 702728729 703521118 704435349 705257111 701876526 695155869
441.7 695155869 695917511 697465820 695061646 695121765 695829697 697457123 702582245 704335251 704033661
450.4 704033661 706155624 703136978 701124268 705658340 706119461 698692322 689189453 687020493 691173401
459.1 691173401 693241272 691277771 688524628 687596588 686994095 689956436 691171875 688669586 687204819
467.7 687204819 684741364 685005951 690876617 691546631 685635910 690727692 694240417 691745224 691796494
476.4 691796494 694213486 690269241 688595734 693569794 695358200 699095306 701042786 697985916
484.1 697985916 694163055 688364410 687653656 690561447 693929138 694324036 692567520 694370880 694181595
492.8 694181595 694816742 694397049 692117157 692283783 691731873 691417007 692538528 695079422 695000763
501.5 695000763 691104050 690898132 693194427 693291168 689619675 687444611 686100006 683113174 682342834
510.2 682342834 683056488 684855118 686120605 683692322 681187515 680573349 678177567 678881760 681178589
518.9 681178589 678745270 676786804 676038208 676061249 676647491 677266541 677076492 675550079 676645279
527.5 676645279 676077652 677236938 678995819 675524826 673506317 673901215 674410248 673434677 673608017
536.2 673608017 675040894 673983841 674424515 675983887 676700287 676021194 674565201 673778839 673580933
544.9 673580933 673718567 674004211 676751785 678474045 677700500 677415771 678316116 679292526 678770752
553.6 678770752 678097305 676524200 675664062 675339203 674281387 675597000 677304077 678623123 679889069
562.3 679889069 681194534 681307755 678984451 678699722 678865891 676583023 674667511 674823685 676041489
570.9 676041489 676392670 675926132 676883011 678782501 678046722 675217743 673095474 671273499 669949799
579.6 669949799 670653229 673148346 674711227 675362625 675090103 675493546 675878983 675211868 674905624
588.3 674905624 674557953 674717331 674323502 673283234 672857971 673582230 675427399 675826340 675582886
597 675582886 674869919 673048782 670729065 668710403 666369476 662690811 659816513 657436142 654990692
605.6 654990692 650787506 645188370 640362167 634339409 625585594 613449974 601871872 591394997
613.4 591394997 582926064 577021904 572259483 569925575 569709778 570531654 566753502 562422562 558417549
622 558417549 552646408 549100761 548711357 555413170 565723801 578692513 592596970 604598007
629.8 604598007 614102135 619749146 622034416 620481987 616864700 611380882 606044807 600425758
637.5 600425758 595056953 594570808 597342415 605219307 616417694 628126678 640307541 653526230
645.2 653526230 665449295 673800125 679613724 683210754 685104446 687536011 689870834 690506516
652.9 690506516 689977188 691443939 694859238 697216873 698638611 698874893 699722900 700638351 700224228
661.6 700224228 700810165 701053238 701344452 702961426 704795151 702982712 691501770 697944412 703516922
670.3 703516922 706092834 706849213 706673126 706738052 706893463 707362518 707740936 708473282 709588165 711377716
679.9 711377716 713058929 712757339 712626724 712820892 711883774 710313187 708538666 707817154 707766571
688.6 707766571 706504135 705137939 704710007 703928299 702954407 702359695 701217575 699509583 698762512
697.3 698762512 698702393 696751633 694813309 694796677 694074860 693996811 695097275 695386353 696442490 698571930
706.9 698571930 699681931 700037155 701907883 703645248 704695892 706181793 706924591 708278122 710216904
715.6 710216904 712480087 714217148 714366989 715753021 717174225 717898178 718764343 719384918 720430908
724.3 720430908 720425720 720546646 720304031 719395370 720028687 719784775 718117599 716872025 716456146 716202621
733.9 716202621 716477585 716533890 715656433 715390625 715153732 714836426 714757919 715315552 715954514 716662521
743.6 716662521 718256989 719400864 721108017 723156204 724736252 726343155 728319092 731035385
751.3 731035385 732956848 735110703 737278214 739275131 742557983 745024872 745548096 745968094 747631149
760 747631149 749122543 750424347 750234680 749474640 749986115 749424362 748780670 747641983 746899033 747020721
769.6 747020721 746939774 747017288 746719208 747615204 748430710 749661865 751377792 752492905 754251175
778.3 754251175 755187149 756159973 757551498 759544373 761324463 762515030 764012527 764554138 765136337
787 765136337 765400772 765474091 765429687 766148148 767494125 767327271 767378922 768353424 769646530 769289246
796.6 769289246 768398972 768621597 769062805 769620590 769115219 768196106 767369080 767667007 768045578 767305603
806.2 767305603 766815338 767289352 768409882 768765869 770116196 770707016 770053940 770109634 769620972 769826431
815.9 769826431 770555038 771450500 770829391 769562073 769991608 770340118 770318375 770210419 770007401 768642426
825.5 768642426 767467117 766591568 764801331 763582916 762493591 760919037 758672104 756337967 753981094
834.2 753981094 751558533 748648376 745403595 742159958 738885269 736898575 734105759 730977325
841.9 730977325 728852463 726388931 724539108 723661880 723734131 723745575 723328629 723862152 725285187
850.6 725285187 727670517 730544968 732392426 733655014 736523361 740266724 743210068 745603409
858.3 745603409 748137131 751009140 752919006 754373245 755598450 756578751 757430038 758664169 760264816
867 760264816 760922852 761763916 762350388 763062210 763047562 763272858 764809113 764148407 764247589 765052490
876.7 765052490 765240250 765836411 765174713 764062881 762413483 760602951 759026871 757317352 755398254
885.3 755398254 753539429 752004242 750441742 748887482 747504425 747757111 748949432 749315796 749093246
894 749093246 748494492 748212433 748845520 749763412 750515442 751620941 751733475 750748749 750029984 749709091
903.7 749709091 749873962 749109955 747280045 745144653 742947311 740533905 738417435 736694183 734032669
912.3 734032669 731290359 729184723 726762619 723555679 720520477 717565689 715150528 713428421
920 713428421 710938339 709056015 707591858 704626694 701054535 699362564 699132004 697755966 695821533
928.7 695821533 694654999 694401855 695055008 695631332 696041641 697323151 698819580 700752411 704064789
937.4 704064789 707531357 710621872 714153061 717655106 720321503 722680893 725424728 728341675
945.1 728341675 731367645 733893585 736137314 739045486 740905533 741932449 742789612 743090591 743504868
953.8 743504868 743237228 742255249 741226578 739829407 737956238 736790009 735599213 733242493 730788193
962.5 730788193 728763351 726644897 723938980 721265869 718765488 716767273 715215836 713832321
970.2 713832321 712881470 712136688 711434784 710924301 710589371 709455643 708670349 708502655 707415237
978.9 707415237 705881882 704347687 703173904 701563034 700264130 699752350 698300247 695984192 693049164
987.6 693049164 690009842 687003860 684173737 680695496 675122147 667574692 658302002 647307663
995.3 647307663 638442841 639178848 647781448 656641693 662284851 665239258 665622406 664398575 663423767
1004 663423767 662779083 662182388 661500778 661896973 661783371 659623032 658127136 657172318 656133957
1012.6 656133957 654622726 651987610 649059906 646499863 644517441 642745361 640352020 637298737
1020.3 637298737 635204506 633335419 631637192 629916458 627774124 625911407 622821465 619635887
1028.1 619635887 617174759 614923363 612264404 610217552 608492012 605942574 605141411 604298248 603107376
1036.7 603107376 602140503 600842896 599155159 597227325 596522293 596137581 596344337 595663528 595183945
1045.4 595183945 595229912 595335159 596745148 596974411 597765579 598371201 598085289 597935219 597500114 597610283
1055.1 597610283 597859383 598427582 597680626 597115364 597168961 596260567 595076904 594270935 594013939 593182716
1064.7 593182716 592264328 589945183 589044914 589450607 588931084 589432831 588786125 588263092 586764908
1073.4 586764908 584858322 584592285 583962975 583191948 582412682 582106667 581033211 580546379 580778084
1082.1 580778084 580936356 580208282 578969345 578633499 576452065 574317474 571134415 567042732 563658142
1090.7 563658142 559532013 554580612 547415886 540661545 532714081 524417763 516013031 507551842
1098.5 507551842 500111885 489910202 480849190 471603966 463317413 454563370 445695686 438127899
1106.2 438127899 428278122 420917664 412043571 404491806 397384758 390482635 385341835 379512749
1113.9 379512749 376661835 372352448 370970421 369960136 370142250 371417732 370937309 373189583 373684082
1122.6 373684082 375751076 377009468 378546371 379236717 378922729 380564079 379718399 380596695 379496269
1131.2 379496269 377964516 375644112 372529984 370212631 366805649 365816193 363032608 362215576 360238686
1139.9 360238686 358137398 356663933 352822380 351809196 348698349 346053886 342220993 339653091
1147.6 339653091 338387299 336293373 335834351 333501358 333915825 333305092 334269753 335347977 335872459
1156.3 335872459 338255386 338956337 341666489 342400475 345359802 348672066 352509995 357439003 360810242
1165 360810242 366849670 371376534 377663231 383317108 390160561 397610512 403930283 412114639 418590584
1173.7 418590584 427172775 434329262 442196922 449945488 456469612 464206238 469988899 477549591
1181.4 477549591 484151497 490590210 495964317 501070023 507676430 512351303 517227440 521312981
1189.1 521312981 525969391 529338722 532741127 537400017 541232529 545788460 549215469 553393898
1196.8 553393898 557262115 561522026 566633644 571360283 576107368 579539566 583689728 587421532
1204.5 587421532 590995102 594080849 597012100 600379181 602683067 606119766 609042053 610983505
1212.3 610983505 612851791 615164528 617488365 619035378 620625992 621296272 622663269 624292221
1220 624292221 625494041 626387329 626876259 627554245 627726479 628478661 628958855 629332809 629616508 630130119
1229.6 630130119 631241646 631556931 632016792 632098427 633021393 634103508 634617882 635425644 635850143
1238.3 635850143 636599083 636683693 637100716 637928696 638731079 639165268 639364281 640398254 640437164 640770264
1247.9 640770264 641085434 641171722 641432190 641306686 641999969 642451553 642829132 642819214 643305054 644190292
1257.6 644190292 644409943 644994049 645325089 645935593 646344452 646845551 647489929 647862320 648559113 649412231
1267.2 649412231 650607071 651570206 652953949 654335632 655632324 657054443 658425293 659991379
1274.9 659991379 661512527 663533096 665081863 666199799 667182999 668922653 671409760 673576813
1282.7 673576813 675929260 677489700 678900909 680321503 681832809 683555527 685011520 686757507
1290.4 686757507 688158340 690019226 692119446 694291458 696580429 698121490 699246140 699786530
1298.1 699786530 700401993 701367950 702448883 703743286 704706573 705222626 705946121 707214813 708124313
1306.8 708124313 709124832 710342865 710864563 711259918 711581345 711496735 711363068 711882706 712601318
1315.4 712601318 713191986 714459839 715514984 716008224 716723862 717480927 718082199 718468170 718695908
1324.1 718695908 718668976 718958282 719845200 720710449 721471863 722101746 722658920 723219147 723536682 723303909
1333.8 723303909 722860413 722421875 721991043 721819229 721059189 720341034 720373688 721229248 722388611 723083801
1343.4 723083801 723567429 723688049 723450470 722562866 721769867 721367722 720667191 720652161 720590210 720371323
1353.1 720371323 720088043 720043945 720447006 720311050 719949799 719608383 719571533 718364487 717233047 716955566
1362.7 716955566 715296555 715643997 716108856 716180649 716436768 715624237 714812088 714340286 713369293 712436600
1372.3 712436600 711414337 709151001 707560425 707962646 708711777 708877487 709287033 709687195 709296951
1381 709296951 709172897 708360291 706898270 706349640 707232590 707888870 706473923 707652664 709575653
1389.7 709575653 710416718 710902100 711338654 711974335 710726013 708323059 708017044 708070602 707525864
1398.4 707525864 704714661 704293671 705393906 705524521 705693207 705921402 704703827 704068069 704309158
1407.1 704309158 703831329 703092957 702014618 701093292 700744247 701098709 701756287 701815796 701976318 701513596
1416.7 701513596 701205215 701804962 697751007 698527374 701399612 702440338 702256317 700948639 701398468
1425.4 701398468 702805252 703911514 705283203 705900574 705393600 705799255 707046890 707545700 707404099
1434.1 707404099 708649139 709626312 706005936 707012024 709764709 710898972 711743622 712590408 712660370
1442.7 712660370 712883453 713037109 713235474 713442459 713140564 712173920 713007431 714400940 714598770
1451.4 714598770 715336151 716650772 717736435 718152466 717989349 716237946 713506699 715418243 717644196
1460.1 717644196 720605850 722424088 723474121 724984436 722276917 722671432 725562744 727552032
1467.8 727552032 728641586 729573975 731680145 731703720 728831100 728763504 733464813 737747040 737680893
1476.5 737680893 739467697 742183685 743588562 744804077 744821396 745466232 746701431 747353210 747884521
1485.2 747884521 748211136 747254715 746834030 748159409 745415878 743537750 745858612 747546844 747851944
1493.8 747851944 747941513 747455521 742154694 743628235 742716904 740705643 742764664 742784958 742323990
1502.5 742323990 742266998 743110504 742889938 734533691 726197357 728205719 731081619 730416718 731898041
1511.2 731898041 730555115 728268814 729357986 728918076 728578949 723823776 719974670 723798065 726384735
1519.9 726384735 722561951 716408081 717666245 720772476 723354645 720496979 719708328 719719238 717838593
1528.6 717838593 717770081 718285828 718601837 717872696 715173721 711192703 713748169 715228653 715822601
1537.2 715822601 717522583 709996872 701402054 705476456 706421509 705990067 709016190 709275818 706649475
1545.9 706649475 710101089 712227554 713316803 711024780 708679886 712191467 714007721 714868164
1553.6 714868164 711069336 711996002 716522217 719203644 713370285 699242401 710372925 716558456
1561.4 716558456 719809341 720910339 720806732 719649811 720172043 722105255 723143539 723185501 716580353
1570 716580353 718179626 720700455 721223221 722112961 722498474 720909958 712433853 715536575 717195282
1578.7 717195282 716566849 716033401 714299622 713644485 712351532 711642838 710850983 709556046 708104706
1587.4 708104706 706031952 704938507 702655029 701255112 699022827 697324524 695707703 693271484
1595.1 693271484 692539902 690531464 689513626 687870026 686626053 684708405 682088470 680214081
1602.8 680214081 677201385 676193848 674118195 672428360 670232544 668519974 666800385 664235382
1610.5 664235382 663966751 661449432 659766769 657650223 657060471 655747833 645404510 647283478
1618.2 647283478 647310562 647165680 645388870 644968338 642725449 635939331 636517677 636124954 636890450
1626.9 636890450 633333168 630322952 629796066 628813934 628340607 626663551 627551117 627806587 622231865
1635.6 622231865 618314400 618909225 619122581 619676933 620462570 618765144 619430008 618854713 620180550
1644.3 620180550 621557922 617342224 616801987 615224800 618970490 620522423 623400230 627330971
1652 627330971 622038460 612353745 617142868 622632790 624656563 626942291 628309135 630008011 631944809
1660.7 631944809 633378487 634325790 633141937 636941872 639292336 641329498 643563156 644900360
1668.4 644900360 644969635 645612488 649210587 650062714 654114761 658432236 659028091 658327866 661399155
1677.1 661399155 665214310 667180176 669588470 670375061 674019928 678786469 677167358 674819412
1684.8 674819412 678282242 684833984 688870087 690970612 693122101 694507370 697630310 700328140
1692.5 700328140 703304138 706883545 710551758 708246918 711776810 717870483 723547592 726125870
1700.2 726125870 719373245 726495438 731334686 734004745 736132278 738052216 739351578 742374268
1707.9 742374268 746869202 748658676 749454422 752146759 754519958 756665192 755863266 755486298 758901062
1716.6 758901062 759878922 754708023 759032135 763556671 765774460 767219925 767622223 767501755 768792953
1725.3 768792953 769898682 770590820 771202850 771983032 770583725 770558548 774179001 776618271 773097610
1734 773097610 768097000 772968369 776693039 777978210 780589523 779469452 775796738 779634323 782199554
1742.7 782199554 781194000 782130432 784731827 786222839 787341309 787474747 787596970 791343689 791250458
1751.3 791250458 790936508 794815216 796693192 798606873 800457993 798926926 799980698 802059555
1759 802059555 804098816 806598892 803343582 802278824 805391846 806601715 806885071 808054581 808869324
1767.7 808869324 806008148 808034058 811620636 810720825 806523743 805612411 810316315 811866455 809925842
1776.4 809925842 811746826 812766342 813382950 813188324 811790771 813136978 814997482 815708771 814471741
1785.1 814471741 814260330 815802155 816603622 817011871 817994080 817355652 816399231 813749771 813892746
1793.8 813892746 817936096 818480606 817027588 818425522 820122986 819444199 817652206 818945084 818391800
1802.4 818391800 818522949 820011597 820005646 820606461 820983124 820797653 821510925 821945496 820573883 820641708
1812.1 820641708 821685104 822097626 822389145 822246857 822755890 822726212 823051453 823913803 823809052 824092026
1821.7 824092026 823806763 824502792 825105438 821796341 822036438 824357986 825656815 824938583 820879135
1830.4 820879135 822382507 825277176 825559082 825562744 825705032 826026688 826163025 825522232 825804291 825723190
1840.1 825723190 825976334 825929794 826865005 827131882 822136307 824357452 826983795 826721573 826071320
1848.7 826071320 826817551 827666855 827433548 827447433 827408218 827837906 827963409 828034515 828346024 827819290
1858.4 827819290 827895203 828015213 828102112 827953033 828338394 828720474 828301163 828512878 828399124 828753891
1868 828753891 827388763 825661774 827262192 828698425 829054642 828896408 829045029 829006348 829138184
1876.7 829138184 829238892 829266891 829606476 829707336 829743271 829204407 829420395 829761353 829729156 830023117
1886.3 830023117 830099030 830937500 830093994 827763672 828641205 829866333 829992218 830039673 829227524 828278580
1896 828278580 829188995 829653625 829816513 830036774 829865265 829972458 829904709 829921875 829917984 830274200 830357361
1906.6 830357361 829789886 829447250 829282227 828907089 828587341 828946686 829237823 830066833 830181732 830300369
1916.2 830300369 831357727 828690872 827614441 829169312 829998779 830497971 828989868 828131943 829156036
1924.9 829156036 829851608 829756775 829819336 829920731 829750061 829784851 829625626 829425201 829193726 829352493
1934.6 829352493 829305191 829076843 829138260 829123383 829460297 829520493 830101929 829564896 827454529 828294220
1944.2 828294220 828831940 828115692 828272781 828913956 829205017 829058533 829006195 829167023 829170151 829077377
1953.8 829077377 828663177 828297195 828855057 828975906 828715973 828873367 828772430 828583832 828245239 828105164
1963.5 828105164 828058167 828010864 827863617 827201843 827306976 827934952 828284760 828183746 827874756 827696838
1973.1 827696838 827706757 827840500 828031464 828192215 827878113 827821274 827928467 827682037 827550964 827328262
1982.8 827328262 827217331 827303925 827291718 827097473 826804352 826320496 825996780 826487808 826817169 825837936
1992.4 825837936 825576172 826661453 826821594 826292572 826381760 826544189 826386261 825880127 825979996 826225510
2002.1 826225510 825817795 825622101 825784531 825944214 825995560 825908966 825558395 825193100 824886093 824759293
2011.7 824759293 824885406 825031204 825025253 824794235 824600220 824351807 824763870 825207748 824843979 824581757
2021.3 824581757 824367905 824289093 824128418 823994827 824037628 823958817 823937073 823830643 823797226 823769073 823968735
2032 823968735 823836212 823227310 822997055 822880859 822731094 822595673 822829132 823149414 823428192 823338470
2041.6 823338470 822983322 823127899 822961884 822723236 822243881 821675797 821640472 821853180 822018433 821688004
2051.2 821688004 821800461 822079544 822248535 822379684 822243347 822209930 821692429 821160660 820671692 820166092
2060.9 820166092 819910583 820014114 820408325 820320663 820307312 820515671 820739288 820698395 820332870 819667664
2070.5 819667664 818652420 818021622 817542725 817524643 817772369 817869797 818149338 818196716 817881546 817341690
2080.2 817341690 817035980 816839523 816397095 815818253 815796280 816122971 816113663 816381912 816869888 817214203
2089.8 817214203 816947250 816579971 816231461 815923462 815979996 815623169 815807877 815738983 815373764 816177673
2099.5 816177673 817033081 817475586 817515106 817596436 817699661 817736969 817259903 816409378 816362915 816474152
2109.1 816474152 816768417 817112961 817632065 818166656 818174057 818154221 818124771 818277740 818013611 817733536
2118.7 817733536 817424850 817153854 817187729 816917114 817548981 818062439 817931976 817809677 817531204 817317810
2128.4 817317810 816719284 816559067 816491470 816160583 816154175 816429062 816948471 817171249 817433243 817721176
2138 817721176 817641907 817325974 817118759 816926422 816629639 816858063 817221985 817259979 817586441 818143921
2147.7 818143921 818191376 818413391 818845367 818880539 818748779 818300552 817951279 817424545 817099380 817491684
2157.3 817491684 818069916 818604660 818810425 819193039 819440002 819336243 818997040 818715134 818517990 817859421
2167 817859421 817666855 817646332 817777634 818087463 818183823 818453217 818463974 818408661 818158722 817788162 817298813
2177.6 817298813 816920853 817115936 817165909 817208405 817440643 817849045 818047180 818061295 818207855 818214111
2187.2 818214111 818290405 818361359 818059082 817409668 817372971 817694397 818090057 818759766 819149475 819483871
2196.9 819483871 819789429 820502396 820744247 820121002 819596863 819085236 819164810 819391785 819570007 819889832
2206.5 819889832 820327911 820708389 820839844 821278381 821237259 820695267 820021973 819646072 819743652 819714203
2216.1 819714203 819786530 819940491 820241547 820369110 820612488 820870819 820885315 820966797 820402374 819897461
2225.8 819897461 819790192 819776993 819678040 819442520 819528580 819927902 820590591 820708237 820354462 820182037
2235.4 820182037 820524139 820656738 820029602 819964600 819983673 819742203 819710007 819635849 819573288 819528503 819531250
2246 819531250 819613037 819787827 819898758 819981232 819650345 819141541 818948059 818858109 818800278 818871613 819501953
2256.7 819501953 819744415 819806213 819941101 819368439 819119186 819221268 819355087 819297333 819379120 819608917
2266.3 819608917 819227371 819146347 819576569 820079117 820307999 819996719 819410934 819195099 819243469 819011002
2275.9 819011002 818564758 818199463 818700638 819136047 819096985 819090805 819492493 820293884 820177231 819822769
2285.6 819822769 819366760 819150925 819362869 819001541 818656235 818276825 818551788 819107208 819431610 819657669
2295.2 819657669 819303131 818640823 817767868 817515182 817297745 817166748 817131653 816955185 817211151 817267609
2304.9 817267609 817733688 817934570 817769012 817170486 816668243 816625443 815450287 815376587 815030899 814470673
2314.5 814470673 815146255 815047607 815057602 814570618 814088821 813836594 813648682 813503418 812716980 812463074
2324.2 812463074 811985626 812018204 811327972 810383911 810964661 811008911 810863571 810422974 809605103 809505692
2333.8 809505692 810694580 810645828 809278946 809528351 809719696 809277267 809358215 810355530 810476990 810277481
2343.4 810277481 810854187 811028671 811491165 811885376 813229523 814832764 815003891 813883514 811839294
2352.1 811839294 810486603 810508041 810456696 809414444 806937332 805995255 806472855 806154785 807032547
2360.8 807032547 808222656 808093338 807313080 807228394 808707275 809961548 810900803 811388931 810586090
2369.5 810586090 809977112 810807571 812271042 813399887 814279404 814617157 815288239 816093292 816675034
2378.2 816675034 817652283 818221817 818781128 819111557 819203796 819735565 819959106 819821091 819745865 819977951
2387.8 819977951 820025864 820045929 820499878 820926056 820981750 820369492 820027618 819975586 819524307 819204865
2397.4 819204865 819135666 819309158 819747391 820035706 819973526 820208511 820360107 820099945 820168839 820043640
2407.1 820043640 819374008 818827591 818763733 818889389 819039154 819014359 818852386 818851242 819069824 819492645
2416.7 819492645 819367371 818827057 818287277 818292923 818809357 818497772 818185043 818282700 818279953 818483047
2426.4 818483047 818548508 818186417 817768860 817787476 817887802 817798080 817729340 817770615 817574539 817289505
2436 817289505 817156677 816954803 817114716 817114868 816892166 816772232 816734238 816763916 816404037 816350021 816530075
2446.6 816530075 816734390 816721649 816320724 816268539 816339035 816430206 816270981 816105804 815839157 815519791
2456.3 815519791 815690536 815571899 815224609 814778061 814926453 815386505 815049286 814736633 814790573 815011368
2465.9 815011368 814811401 814495239 814429169 814227142 814235306 814408035 814599380 814551468 814405212 814406738 814266281
2476.5 814266281 813828278 813360825 813233337 813437576 813642654 813487473 813501205 813294296 812813721 812812042
2486.2 812812042 812656784 812428284 812302780 812195053 812065659 812010498 812034073 811890106 811975479 811946259
2495.8 811946259 811613770 811035233 810665512 810818024 811003189 811308670 811480713 811639099 811398315 810866623
2505.5 810866623 810935898 810751343 810327148 810099182 809773483 809773636 810098953 810158920 810111313 809964142 809606323
2516.1 809606323 809451523 809542999 809642105 809294281 808881531 808750610 808820343 809228287 809329453 809022827
2525.7 809022827 808783188 809042435 809472351 809369812 808759842 808262253 808233337 807976608 807886810 807892456
2535.4 807892456 807485046 807359238 807788391 808327408 807950363 807385101 807454834 807542419 807150574 806505661
2545 806505661 806564560 806883316 806905212 806756744 806708908 806679077 806645889 806733475 806487427 806780243 806972809
2555.6 806972809 806291656 805996246 805931931 805658035 805278168 805301895 805613327 805424423 805092392 805205841
2565.2 805205841 805130310 804737167 804786148 804794846 804660721 804547195 804536285 804688950 804732742 804824753 804468460
2575.9 804468460 804079666 804052200 804048615 804028931 803649292 803493347 803718872 803655243 803341217 803268356 803103180
2586.5 803103180 802583466 802294846 802404251 802784119 802821121 802733765 802874298 802750320 802262115 801669464
2596.1 801669464 801739807 802058640 801755447 801258163 801018143 800813522 800847092 801032028 800699310 800772400
2605.7 800772400 801013489 800424423 799886017 799871063 799981384 799895477 799840088 799575424 799008713 798743973
2615.4 798743973 798887711 799036331 798838730 798780289 798752518 798309250 797851486 797719193 797612000 797307358
2625 797307358 797272949 797307129 797106323 796892776 796825333 797167816 797580414 797075577 795945740 795515289
2634.7 795515289 795765152 796286087 796613770 796293716 795779724 795392914 795278854 795396271 795265198 794543762
2644.3 794543762 793982544 794060898 794279327 794407120 794226913 793677216 792846298 792597580 793241959 793722839
2654 793722839 793369675 792507477 792416840 792766495 792463684 791940231 791809769 791796494 791470871 791313095
2663.6 791313095 791350784 791433182 791302185 790873108 790881729 790976791 790585632 790136337 790185089 790227051 789736481
2674.2 789736481 789314499 789499054 789880371 789792404 789802246 789808884 789123535 788409119 788157120 788117523 788040619
2684.8 788040619 787782822 787399673 787447433 787629318 787633820 787883682 787694321 786991043 786789474 786907349
2694.5 786907349 786239548 785518036 785721512 785790710 785775146 785850525 785186691 784631271 784873199 784941330
2704.1 784941330 784597397 784230804 784108734 784345322 784391556 784316788 783964157 783190231 782936172 782958755
2713.8 782958755 782838058 782817764 782644882 782636795 782941513 782712021 782206268 782214966 782322922 781915817
2723.4 781915817 781643448 782024231 781740799 780679169 779949341 779746933 779747086 779779434 779846268 779196091
2733 779196091 778820953 779338913 779442062 779172440 778676605 778328018 778240128 778144302 777846985 777476730
2742.7 777476730 777567749 777585449 777740250 777919617 777538986 776983109 776544113 776242752 775776215 775374985
2752.3 775374985 775177460 775334015 775586166 775100861 774357605 774337692 774682846 774527893 774125977 773531494
2762 773531494 773262024 773733826 774125595 773967743 773597870 773566437 773127670 772582855 772488632 772516785
2771.6 772516785 772228317 771352844 771285553 770942383 770039291 770148087 770374985 770353012 769951477 769506760
2781.3 769506760 769342880 769084625 768601456 768203049 768328323 768471603 768374252 768157654 767981873 767300339
2790.9 767300339 766584702 766339569 765979538 765948715 765668640 765291138 764982758 764368515 763739929 763219452
2800.5 763219452 763436356 763362579 762704697 762255630 761979294 761592178 761013718 761001587 761197433 760931549
2810.2 760931549 760148544 759710999 759678574 759381027 758906021 758324738 757995834 756987839 756348038 756731110
2819.8 756731110 756537933 756043777 755260544 754817200 754671173 754476547 754368591 753917694 753235016 752310638
2829.5 752310638 752142639 751922684 751037903 750753937 750598145 750043869 749164886 748475571 747890854 747338028
2839.1 747338028 746824112 745677109 744133301 742681732 741551895 740773392 740079803 738923874 737234497
2847.8 737234497 735368729 733887405 732716827 731685867 731267471 730772858 730259933 729746780 729515305
2856.5 729515305 729583130 729151306 729270935 729331360 729287109 729019928 728043976 727666702 727281113 726767654
2866.1 726767654 726086960 725324020 724524155 723832932 723755035 722867432 722001648 721607132 721166382 721002426
2875.8 721002426 720768661 720551300 719853668 719307098 719246368 719319229 718948669 717883301 717635574 717453613
2885.4 717453613 716988373 716703415 715792313 714913025 714443893 713865509 713213272 712782440 712162933 711525650
2895.1 711525650 711669998 711769714 711064453 710022812 709120560 708544312 708150558 707744141 707251968 706487732
2904.7 706487732 705827560 705655060 705427246 705119400 705142136 705028152 704317627 703143387 701753922
2913.4 701753922 700988007 700785370 700062714 699023361 697996826 696969070 696570511 696561356 695653687
2922.1 695653687 694430237 693845978 693643646 693742981 693437958 693166199 693453903 694026871 694739075 694985733
2931.7 694985733 695221481 695347900 695163422 695112534 695583191 696006546 695887909 696450806 696621399 696499939
2941.3 696499939 697494431 698293304 698503799 698491058 698308640 698104706 698395844 698590851 697994461 697345963
2951 697345963 697031097 697115173 696800766 696195374 695843964 695899048 696292648 696048431 695515366 695255814
2960.6 695255814 695446548 695522079 695186157 695422668 696119690 696605530 696767807 697283249 698313293 699402008
2970.3 699402008 700128479 700657120 701202164 701774063 702639847 702667923 702711487 703912277 704835510 705040665
2979.9 705040665 705389709 706350250 706762314 707077484 707772217 708130722 708679428 709313965 710198364 710661850
2989.6 710661850 710648270 711350327 711963120 711817169 711587067 711708069 711876678 712199326 712423096 712419205
2999.2 712419205 712574005 712776413 712668152 711922531 711833878 712244873 712129745 712306061 712545700 712621155
3008.8 712621155 712452469 711930237 711653748 711636810 711563110 711539001 711410370 711017685 711132736 711304016
3018.5 711304016 710776672 709997253 709354019 709152527 709074860 709029312 708801956 708004227 707344894 707000732
3028.1 707000732 706912613 706866150 706342621 706125946 706453476 706516037 706183929 705372238 704318466 703815384
3037.8 703815384 703725281 703345566 703209610 703309631 702809525 702368546 702182846 701606979 700966949 700622177
3047.4 700622177 700280762 700222015 700273514 699364014 698016739 697110062 697310028 698044891 697731705 696772690
3057.1 696772690 695827866 695440292 695352936 694879837 694488449 694400787 694066162 693296509 693448868 693247681
3066.7 693247681 692092361 691838379 691377411 690805359 690580750 690097351 690009918 690113220 689778442 689506683
3076.4 689506683 689402695 688845673 688454056 688249893 687821808 687198944 686859894 687180481 686866379 686193314
3086 686193314 685560379 684849167 684696579 684944000 685040894 684419785 683722000 683144531 682800522 682580643
3095.6 682580643 681853104 681212921 680779953 680635910 680166168 679541321 679144821 678616028 678723297 678731689
3105.3 678731689 678346863 678107224 677656937 676855850 676155243 675719147 675102234 674538498 674033203 673731613
3114.9 673731613 673198395 672405396 672168655 671842422 671334457 670676270 669953918 669392929 668798828 668089523
3124.6 668089523 667309494 666833420 666524048 666307602 665584488 664342804 663539886 663176575 662989197
3133.3 662989197 662719650 662286682 661574936 660833817 660070496 659715881 659702072 658892899 658097458 657548447
3142.9 657548447 657088165 656444778 655179520 654535904 654448013 653991318 653139725 652500458 652088470 651548080
3152.5 651548080 650946732 649936142 648752289 647867279 647249374 646681442 646222839 645865173 645500259
3161.2 645500259 644827347 643943100 643541183 642840500 642052002 641514130 640283203 639145317 638683777
3169.9 638683777 638249779 637490196 636748352 636309624 635786362 634873161 634284668 633769569 632987328 632878265
3179.5 632878265 632263260 631278381 630452499 629291077 628772011 628221397 627479553 627212410 626947403
3188.2 626947403 626076431 625289345 624994240 623795738 622647095 622242317 621617584 620880852 620437775
3196.9 620437775 619740753 618553772 617975693 617571869 617245483 616830826 616052551 615469284 614877586
3205.6 614877586 614627266 614109497 613490829 612792282 611514740 610804825 610177231 609449425 608691101
3214.3 608691101 607996864 607758255 607124901 606382713 606180611 605742493 604803352 604210052 603769608 603097496
3223.9 603097496 602564201 602239647 601618576 600636826 600354004 600401611 599467850 598397560 598292007 597959366
3233.5 597959366 597252502 596687622 595794792 595183754 594814644 594606705 594010582 593248596 593114815 592441521
3243.2 592441521 591820107 591361237 590574875 589866333 589424324 589138145 588378830 587922211 587378769 586541862
3252.8 586541862 585987167 585740814 585645943 584868660 584156799 583608589 583233948 582810516 581890907 581712456
3262.5 581712456 581741104 581104050 579943199 579315186 579409714 579026566 578476295 578123474 577680016 577302361
3272.1 577302361 577244148 576826019 576059189 575228386 574238892 573656273 573353310 573341026 573050842 572228546
3281.8 572228546 571511421 570909920 570523720 570577888 570570526 569786758 569304695 569393082 569102554 568460464
3291.4 568460464 567870102 567330360 566565742 566247787 566022720 566132965 566598854 565994492 565192299 564852028
3301 564852028 564627686 563877068 562853165 562736588 562879562 562410088 561861839 561531219 560823593 560104790
3310.7 560104790 559471893 559125137 559175949 558566971 557637367 557126503 556927452 556387215 555933571 555805664
3320.3 555805664 555232201 554320793 553523483 553170815 552627449 552135849 551595345 550905762 550676727 550185242
3330 550185242 549704895 549189262 549012833 548570328 547226524 546802444 546593666 545856361 545003891 544523735
3339.6 544523735 544480782 544270515 544097557 543739624 542976570 541941185 541315041 540646286 539768944 539411240
3349.3 539411240 538986130 538427696 538002586 537843933 537225227 536401520 535847015 535021744 534567223 534267731
3358.9 534267731 533981514 533643532 532832794 531644821 531039810 531075134 530466232 530139580 529950600 529342346
3368.6 529342346 528884430 528079567 527271042 527185097 527312737 526689949 525603752 524588318 524161415
3377.2 524161415 523739929 523148155 523318634 523227005 522842712 522324142 521769676 521159744 520735893 521017227
3386.9 521017227 520386200 519777298 519553108 519043007 518573608 517728653 517524261 517619286 517562408 517051163
3396.5 517051163 516530952 516654930 516139679 515548439 514957390 514691925 514813042 514191933 513999557 513923302
3406.2 513923302 513612328 513675728 513031960 512723694 513318329 513171539 512825050 512546120 511979485 511772575
3415.8 511772575 511822929 511795807 511911316 511683540 510793037 510703583 510929832 510848961 510908852 510988693 511307335
3426.4 511307335 511131821 510893478 510950470 510974541 510807686 510333595 510368881 510403366 510413170 510592384 511055756
3437 511055756 511109657 510833511 511133385 511188622 511855164 511576653 510922737 511207199 511445312 512933388
3446.7 512933388 512521667 511862831 512893753 512691650 512439270 512975044 513665924 513697662 514010963 514244385
3456.3 514244385 514105568 514708405 515148811 515504913 515315819 515619850 516862068 517670555 518052864
3465 518052864 518300667 518520012 517949486 518147278 518779793 518788452 519534340 520636864 521420403 521637726
3474.6 521637726 521476402 521775322 522685280 523106537 523430862 523739548 523939934 524693108 524881401 525987587
3484.3 525987587 526932602 527176208 527953796 527309952 527125702 528174400 528853683 529262848 529925117
3493 529925117 530540924 530973473 532037697 532507286 532141838 532015915 532784538 533765945 534739799 535664406
3502.6 535664406 535258255 535650749 536815262 537458305 537923622 539169235 539882545 539263191 540354767
3511.3 540354767 541448975 541912308 541994705 541960564 542887154 543804131 544814301 545179596 545314636 546225700
3520.9 546225700 547704659 548586197 548298416 548464890 548884926 549919891 550567474 551131210 552193832
3529.6 552193832 553445320 553973885 553329506 554125137 555789261 558195801 558691635 557505722 558892822
3538.3 558892822 559830322 560460625 560741615 561363220 562674370 563754807 564434738 564084053 565198097
3547 565198097 565286179 566435013 568017807 568873215 570189629 569437485 570750351 571689987 572596474
3555.6 572596474 573995819 574127998 576186371 577316895 577563400 577808609 579432602 580395355 580476952
3564.3 580476952 584155502 583804779 583385925 582981911 582368240 586665840 588392296 589583397 591185684
3573 591185684 592200623 592572365 593283081 595004501 595308723 597818985 599174919 598691673 600182037
3581.7 600182037 601665421 602610855 603588676 607628479 608781815 605707054 605797462 604833984 608108444
3590.4 608108444 611709518 615167351 615791588 614579582 617064476 615639877 618003998 621952858
3598.1 621952858 621927948 623652115 624374428 625708160 627773132 629044037 630881538 633460388 634763336
3606.8 634763336 632523232 635831528 635464211 634597282 641962509 643146133 640378571 643554993 642945023
3615.4 642945023 647043839 651898880 651191177 650997849 649373474 649883575 653407745 656507950 658517303
3624.1 658517303 660970764 663119888 664561081 669839020 668542328 658452835 663503799 668643875
3631.8 668643875 674614792 676592941 674407883 676350708 679564819 682175980 682142868 682983475 685464706
3640.5 685464706 687691116 688784409 689235840 691195602 694458084 699252853 695101395 691213303
3648.2 691213303 698905487 700242615 697177353 695116806 700322952 705140457 709511719 714184494
3655.9 714184494 704288254 706186447 712287827 713414764 714505005 714946823 716114807 716415558 717753525
3664.6 717753525 719445343 719839401 723664322 725679779 723518295 722658234 717293930 720421906 729114685
3673.3 729114685 737598190 732936325 712829895 718144073 726658325 731224518 728610382 728829651
3681 728829651 731986771 734002151 735351639 735300751 735220718 738964767 744598236 733776627 730346832
3689.7 730346832 739236221 731795654 731211624 737364273 738230286 739005814 738549576 738166733 739757767
3698.4 739757767 740013275 741954346 745144043 739701080 736208801 740772781 742732315 742607346 742704544
3707 742704544 745665741 749392014 741410980 746234741 751788635 737005539 740930634 745515442
3714.8 745515442 746301727 747816315 750124130 750919189 747843170 748418579 753133850 747965317 743234863
3723.4 743234863 749588699 750428619 748907242 745558777 746006393 750896072 752443085 757479172 752418976
3732.1 752418976 744225388 753972321 754521790 742987366 743104782 746434479 747358932 751221390 754790726
3740.8 754790726 750239792 753430710 765294266 753569717 735436630 747229004 753448105 758524704
3748.5 758524704 754227524 742541504 754467087 749938812 743477631 749726715 754324875 756732788
3756.2 756732788 750439072 753093491 759231415 750932770 748977966 753651962 754923782 755009613 758835602
3764.9 758835602 755718231 750480194 754117203 759570847 759959869 750181580 751419754 754501495
3772.6 754501495 754987335 755634537 755207443 755930710 756426620 759412384 758923569 750761642 753971252
3781.3 753971252 756974106 757601089 759313354 755396652 753413620 755288391 756488953 756774368 755965424
3790 755965424 756271973 756472702 756888733 757219620 758614426 762311859 757121048 751120911 754251709
3798.7 754251709 759106445 764534454 755147629 744669342 750167465 754156265 759825897 764892807
3806.4 764892807 752040710 747847595 754286041 756864777 756990585 757605209 757521286 758494034 764384842
3815.1 764384842 763427429 747518845 752057953 757919235 761386261 760414124 742988663 747202301
3822.8 747202301 752966461 755127411 758277512 758066330 753126526 753788834 756933670 760998306 760696640
3831.4 760696640 750202103 754146500 762488861 756199188 754021912 763012238 755769577 750001297
3839.2 750001297 757695389 750975876 751704865 758776245 754308472 750919037 754878464 756679687
3846.9 756679687 756421432 757849274 756676636 758842468 764908981 757043076 758493195 743264008
3854.6 743264008 744478836 755628586 754545212 752569809 755240326 757681351 759607391 754490891
3862.3 754490891 755288315 761788177 754024353 748107529 753006058 758931656 764739075 754673843
3870 754673843 746342316 751353836 757979355 761040497 750074005 751592484 755600281 755911102 758681030
3878.7 758681030 762904053 756346283 748412170 754467697 754586487 756105957 761913910 747742920
3886.4 747742920 749465332 754252014 755729599 761025772 759969482 749827042 751205063 755234604
3894.1 755234604 753822327 754972839 756646118 758079529 758416290 749588699 755747147 757767639
3901.8 757767639 751398239 756448593 752228851 749657059 751273880 752907181 755389023 754890518
3909.6 754890518 755356064 755455933 754839401 754998169 754893112 756637802 759152222 755335999 751752396
3918.2 751752396 756166306 755241852 750493469 753331604 755762253 757030716 754914627 751832581
3926 751832581 753314743 754477692 755299530 754085541 754381104 756687012 753183441 751814957 753073654
3934.6 753073654 752685471 753714447 754570999 754392014 754553146 753958893 755733795 758076553 753250046
3943.3 753250046 751296692 752351685 752738876 754112167 752947693 753387985 753062363 750908585 752791595
3952 752791595 753734283 753658066 753618698 753558502 753828506 753122635 753327637 753720551 754470367 754036179
3961.6 754036179 752228775 753319931 754311523 754058304 753985672 753759537 753909836 752728348 751396790
3970.3 751396790 751918945 752499237 753084106 752781143 752240753 752566605 752313766 752976837 753598175 753102646
3980 753102646 752939835 752603760 752159653 752819138 753789520 753211899 753135834 753454056 752880020 752902145
3989.6 752902145 752841644 752956161 752915421 752848129 753076477 752679749 752328720 752055130 752310638 752803574
3999.2 752803574 753018646
4000.2 753018646
##END=$$ End of the data block
