##TITLE=$$ Begin of the data block
##JCAMP-DX=5.00 $$ ACD/SpecManager v 10.08
##SPECTROMETER/DATA SYSTEM=Varian
##DATE=18 Dec 2012 13:49:08
##DATA TYPE=INFRARED SPECTRUM
##DATA CLASS=XYDATA
##ORIGIN=
##OWNER=
##NPOINTS=3735
##FIRSTX=399.26403809
##LASTX=4000.35498047
##MAXX=4000.35498047
##MINX=399.26403809
##MAXY=83.30428314
##MINY=33.27767181
##XFACTOR=1.0000000000
##YFACTOR=0.000000100000000
##FIRSTY=70.85501099
##DELTAX=0.96440572
##XUNITS=1/CM
##YUNITS=TRANSMITTANCE
##XYDATA=(X++(Y..Y))
$$ plain form
399.3 708550110 717106857 706736755 702249985 699209518 707303314 714961929 717052536 716165085
407 716165085 707353287 709560471 707695694 703332901 707636261 708281708 708796997 709165192 711570587
415.7 711570587 712023392 712443771 706755295 685369949 699749985 708730545 709037552 708141327 706156082
424.3 706156082 700707474 702624741 706699982 703812256 702269821 700508041 700032959 701470108 699461517
433 699461517 698541641 700259705 701421738 701586990 699471130 698023987 703360062 702011261 696439362
441.7 696439362 702716751 701759872 695683517 696787415 703074112 704794083 699892578 695619736 693175735
450.4 693175735 696991425 697756271 694141312 696934433 696133804 691258316 685778732 684470367 688584213
459.1 688584213 687341385 684600601 685882111 689085770 688096237 686870956 689784698 688217316 682811203
$$ packed form
399.3G08550110Q556747j0370102m486770l040467Q093796P658615K090607q87451
407G16165085q811798K207184j864777m362793M303360O45447N15289L68195K405395
415.7G11570587M52805M20379n688476k1385346J4380036Q980560L07007q96225j985245
424.3G06156082n448608J917267M075241k887726j542435j761780m75082J437149k008591
433F99461517r19876J718064J162033J65252k115860j447143N336075j348801n571899
441.7F96439362O277389r56879o076355J103898O286697J719971m901505m272842k444001
450.4F93175735L815690P64846l614959K793121q00629m875488n479584j308365M113846
459.1F88584213j242828k740784J281510L203659r89533j225281K913742j567382n406113
$$ plain form
467.7 682811203 681465454 683567963 690338593 695674210 685746002 677163467 684424210 691264954
475.5 691264954 686921692 683425140 683889618 685443344 690439148 693811340 696635818 695717392 691032181
484.1 691032181 687484207 686312256 687069092 685583572 686311188 686788712 688373032 691632385 689119034
492.8 689119034 690703278 692134933 689299469 687015610 685391617 686896591 689878540 692012405
500.5 692012405 692829819 691686401 688578949 688278351 688778992 685605316 685712280 688055649 685516510
509.2 685516510 683059387 683363266 681970215 682551193 683135834 679762955 679690857 678820038 676466217
517.9 676466217 676623383 675761719 675838852 675322723 675531540 674467163 672892227 674233932 673345337
526.6 673345337 672196198 672473526 674293671 674279556 671963120 672232513 672706146 672728577 672320786 671569748
$$ packed form
467.7F82811203j345749K102509O770630N335617r928208q582535P260743O840744
475.5F91264954m343262l496552M64478J553726M995804L372192K824478r18426m685211
484.1F91032181l547974j171951P56836j485520P27616M77524J584320L259353k513351
492.8F89119034J584244J431655k835464k283859j623993J504974K981949K133865
500.5F92012405Q17414j143418l107452l00598N00641l173676J06964K343369k539139
509.2F85516510k457123L03879j393051N80978N84641l372879p2098q70819k353821
517.9F76466217J57166q61664P7133n16129K08817j064377j574936J341705q88595
526.6F73345337j149139K77328J820145j4115k316436K69393M73633K2431m07791p51038
$$ plain form
536.2 671569748 671092148 671325226 673190384 674037399 673430405 673279343 672786331 669986496 668620071
544.9 668620071 671017914 673570251 674635849 674944077 676792831 678016663 677485657 676221619 675347977
553.6 675347977 675159531 673320465 672493896 672741165 673572693 674976501 676634521 678122635 676863556
562.3 676863556 676772003 676517715 674801254 675906677 676121979 674437714 673548889 673755035 675041885
570.9 675041885 676306610 675986023 676327820 677342987 675788651 673132019 670345612 669042740 669633255
579.6 669633255 669827805 669788132 670217972 672721252 673880768 674415894 676124725 675909958 674442673
588.3 674442673 672562637 671958466 672238007 672372284 672300186 672434082 673280258 672669220 672059326 672476349
597.9 672476349 672385406 669510040 665916519 664809875 662940826 660168228 656668091 653462830 649594498
$$ packed form
536.2F71569748m77600K33078J865158Q47015o06994j51062m93012k799835j366425
544.9F68620071K397843K552337J065598L08228J848754J223832n31006j264038q73642
553.6F75347977j88446j839066q26569K47269Q31528J403808J658020J488114j259079
562.3F76863556r1553k54288j716461J105423K15302j684265q88825K06146J286850
570.9F75041885J264725l20587L41797J015167j554336k656632k786407j302872N90515
579.6F69633255J94550l9673M29840K503280J159516N35126J708831k14767j467285
588.3F74442673j880036o04171K79541J34277p2098J33896Q46176o11038o09894M17023
597.9F72476349r0943k875366l593521j106644j869049k772598l500137l205261l868332
$$ plain form
606.6 649594498 644500809 640015488 633126945 624538803 614474297 603321304 590761604 579972839
614.3 579972839 574926834 571929741 569969254 569673119 569800491 566387215 561280174 555781136 550053673
623 550053673 546874924 547818489 554780350 564151382 576399117 589718285 603153343 614189224
630.7 614189224 618861427 619590225 618488960 616486244 611593552 606025772 600110435 594175949 593249397
639.4 593249397 596019440 604025841 615911446 628890152 641523743 653375854 663971252 671818008
647.1 671818008 677696533 683225555 685509338 686118546 687828445 688999023 689597473 691144943 694136887
655.8 694136887 696327438 698233261 699962540 699646683 698599548 698252563 699293289 700246735 700771255
664.5 700771255 702199249 704045563 701681976 689238358 697601547 704027863 706281967 707091751
$$ packed form
606.6F49594498n093689m485321o888543q588142j0064506j1152993j2559700j0788765
614.3E79972839n046005k997093j960487k96135J27372l413276n107041n499038n727463
623E50053673l178749R43565O961861R371032J2247735J3319168J3435058J1035881
630.7F14189224M672203P28798j101265k002716m892692n567780n915337n934486r26552
639.4E93249397K770043Q006401J1885605J2978706J2633591J1852111J0595398P846756
647.1F71818008N878525N529022K283783O09208J709899J170578N98450J547470K991944
655.8F94136887K190551J905823J729279l15857j047135l46985J040726R53446N24520
664.5G00771255J427994J846314k363587j2443618Q363189O426316K254104Q09784
$$ plain form
672.2 707091751 707616501 707672653 707769470 708433228 708564758 709438553 709970856 710133209 711509781 711726456
681.8 711726456 712159576 712113876 711177597 711396408 710056763 708552246 708282776 706973190 705303574
690.5 705303574 704042511 703590622 702860794 701513214 700377731 699242935 698831100 698050842 696276093
699.2 696276093 694985657 695061264 695639801 695447006 695447998 695710220 696711502 698997421 700018387 700441971
708.8 700441971 702613220 704541321 705087814 705448380 705768585 707091827 709699631 711738739 713461914
717.5 713461914 715325012 716294479 716875229 718514786 720173721 720638428 720537872 719794388 719316406
726.2 719316406 719290314 719564743 719861221 719414749 719166794 718244705 717511520 717311859 716875763 716424713
735.8 716424713 715287247 715373917 715674591 714709625 713978806 714165726 715839996 718080597 719667282
$$ packed form
672.2G07091751N24750N6152R6817O63758J31530Q73795N32303J62353J376572K16675
681.8G11726456M33120m5700r36279K18811j339645j504517k69470j309586j669616
690.5G05303574j261063m51889p29828j347580j135483j134796m11835p80258j774749
699.2F96276093j290436P5607N78537j92795R92K62222J001282K285919J020966M23584
708.8G00441971K171249J928101N46493L60566L20205J323242K607804K039108J723175
717.5G13461914J863098R69467N80750J639557J658935M64707j00556p43484m77982
726.2G19316406k6092K74429K96478m46472k47955r22089p33185j99661m36096m51050
735.8G16424713j137466Q6670L00674r64966p30819J86920J674270K240601J586685
$$ plain form
744.5 719667282 720441208 721556931 723356018 725495148 727258987 728903580 732514191 735498199 737000961
753.2 737000961 738910217 740784760 743059158 744862366 745369110 746728363 749409561 750072174 750224228
761.9 750224228 750619431 750073166 750075912 749173050 748651733 748334503 747412720 746986084 746633759 747085342
771.5 747085342 747397232 748037033 749003448 750310974 752652740 754223785 755577316 756423569 756772308
780.2 756772308 758521576 760464249 761407623 763042908 764800262 766025925 767082291 766945267 766881104
788.9 766881104 766415939 766402512 767988892 769001465 768905334 768767319 769232559 768545074 767966461 768498840
798.5 768498840 769394608 770514832 770373917 769644089 769472427 770054321 769915771 768951263 768186569 768610306
808.2 768610306 769296646 769223022 770376663 770417709 769758606 769427490 769407806 770303802 770307159 770819397
$$ packed form
744.5G19667282P73926J115723J799087K139130J763839J644593L610611K984008J502762
753.2G37000961J909256J874543K274398J803208N06744J359253K681198O62613J52054
761.9G50224228L95203n46265K746r02862n21317l17230r21783m26636l52325M51583
771.5G47085342L11890O39801R66415J307526K341766J571045J353531Q46253L48739
780.2G56772308J749268J942673R43374J635285J757354J225663J056366j37024o4163
788.9G66881104m65165j3427J586380J012573r6131j38015M65240o87485n78613N32379
798.5G68498840Q95768J120224j40915p29828j71662N81894j38550r64508p64694M23737
808.2G68610306O86340p3624J153641M1046o59103l31116j9684Q95996L357N12238
$$ plain form
817.8 770819397 770789490 771030197 771518097 771213226 771112137 770201416 770544815 770270767 768875732 766932755
827.5 766932755 764468155 763869629 763108902 760984879 758241272 756006851 753482208 750661011 748010788
836.1 748010788 745376892 742599258 738630219 735983810 733638611 730509567 728286972 726829071
843.9 726829071 726192551 725454483 724971161 724908600 725043411 725522003 726216507 727685318 729832306 732037964
853.5 732037964 733674393 736763382 740713501 743790665 747245331 749765167 751418839 752922897
861.2 752922897 754739456 756721268 758118668 759040146 759451141 760237961 761400604 762327652 762736969
869.9 762736969 763543167 764266815 765047150 765697021 765346909 765408630 764872284 765054626 766050186 766127777
879.5 766127777 764960480 762567444 760979004 759549637 757784271 755145264 752937851 752051086 750851593
$$ packed form
817.8G70819397k9907K40707M87900l04871j01089r10721L43399k74048j395035j942977
827.5G66932755k464600n98526p60727k124023k743607k234421k524643k821197k650223
836.1G48010788k633896k777634l969039k646409k345199l129044k222595j457901
843.9G26829071o36520p38068m83322o2561J34811M78592O94504J468811K146988K205658
853.5G32037964J636429L088989L950119L077164L454666K519836J653672J504058
861.2G52922897J816559J981812J397400R21478M10995P86820J162643R27048M09317
869.9G62736969Q06198P23648P80335O49871l50112O1721n36346J82342R95560P7591
879.5G66127777j167297k393036j588440j429367j765366k639007k207413q86765j199493
$$ plain form
888.2 750851593 749703827 748727341 748612900 748497162 748243713 748202438 748034897 748437500 748538666 749203796
897.9 749203796 750503311 751178665 751403961 751407166 750700684 750012207 750063095 748697052 746811676 745615845
907.5 745615845 744017715 741453476 738692780 736270065 733829269 731737213 729445801 727483673
915.2 727483673 724961700 720896988 716942368 714776611 713662643 711193924 708882141 707318726
922.9 707318726 704785156 701700058 699858856 699131927 697577438 695953979 695020142 694714813 695094910
931.6 695094910 695491104 696088333 696950912 698142319 700256348 703209686 706919403 710810547 713660431
940.3 713660431 716386566 720356903 723618393 725800858 728427887 731289139 733744888 735371933
948 735371933 737298431 739993820 742313156 743205719 743329849 742923355 742141037 741430817 740113297
$$ packed form
888.2G50851593j147766r76486j14441j15738k53449m1275j67541M02603J01166O65130
897.9G49203796J299515O75354K25296L205p06482o88477N0888j366043j885376j195831
907.5G45615845j598130k564239k760696k422715k440796k092056k291412j962128
915.2G27483673k521973m064712l954620k165757j113968k468719k311783j563415
922.9G07318726k533570l085098j841202p26929j554489j623459r33837l05329L80097
931.6F95094910L96194N97229Q62579J191407K114029K953338L709717L891144K849884
940.3G13660431K726135L970337L261490K182465K627029K861252K455749J627045
948G35371933J926498K695389K319336Q92563J24130m06494p82318p10220j317520
$$ plain form
956.7 740113297 739068985 737469406 736053391 735043716 732736511 730339279 728230667 726014938
964.4 726014938 723233948 721133423 718911896 715949860 714289169 712969360 712200470 712284317 711961975
973.1 711961975 711091156 710222473 709193878 707686615 707194977 707012558 705598145 703963699 702762222
981.8 702762222 701393738 700264206 699386063 697663498 695690460 693394623 690195160 686867371 683606567
990.5 683606567 679867172 675127487 667749329 657454224 646152725 637800064 639011612 647753677
998.2 647753677 656268768 662227783 665585632 666050262 665578079 664733047 663872604 663249054 662451019
1006.8 662451019 662670059 662098007 659937592 658381195 656801529 654952164 653227005 651655197 649656372
1015.5 649656372 647034149 644773026 642794571 640412521 637656250 635437660 633178787 630640526
$$ packed form
956.7G40113297j044312j599579j416015j009675k307205k397232k108612k215729
964.4G26014938k780990k100525k221527k962036j660691j319809p68890Q3847l22342
973.1G11961975q70819q68683j028595j507263m91638j82419j414413j634446j201477
981.8G02762222j368484j129532q78143j722565j973038k295837l199463l327789l260804
990.5F83606567l739395m739685p378158j0295105j1301499q352661J211548Q742065
998.2F47753677Q515091N959015L357849M64630m72183q45032q60443o23550p98035
1006.8F62451019K19040n72052k160415j556397j579666j849365j725159j571808j998825
1015.5F49656372k622223k261123j978455k382050k756271k218590k258873k538261
$$ plain form
1023.2 630640526 628713608 627728119 625356445 621512527 619369736 617372093 614867821 612191582
1031 612191582 610239830 608778763 606879463 605910568 604085922 602550774 601462364 600198059 599300423
1039.6 599300423 597878647 596478844 595584259 595884018 595396347 594907265 594829826 595330467 597044792
1048.3 597044792 597908630 598766403 598619766 597730942 597237625 597660027 597515717 597060013 598027687 597459335
1058 597459335 597162552 596831818 596309090 595745773 594359245 593658752 592628212 592607651 591429062 590428925
1067.6 590428925 590003510 589273911 589869804 588711205 587649498 585960655 585197144 585704994 584642715
1076.3 584642715 583658562 583050117 583507919 582124672 580594597 580056229 579677658 579513893 578612709
1085 578612709 577948380 575312233 572753143 569926300 566692963 563055992 558358574 553851204 546258011
$$ packed form
1023.2F30640526j926918r85489k371674l843918k142791j997643k504272k676239
1031F12191582j951752j461067j899300r68895j824646j535148j088410j264305q97636
1039.6E99300423j421776j399803q94585K99759m87671m89082p7439N00641J714325
1048.3E97044792Q63838Q57773j46637q88824m93317M22402j44310m55704R67674n68352
1058E97459335k96783l30734n22728n63317j386528p00493j030540k0561j178589j000137
1067.6E90428925m25415p29599N95893j158599j061707j688843p63511N07850j062279
1076.3E84642715r84153o08445M57802j383247j530075n38368l78571j63765r01184
1085E78612709o64329k636147k559090k826843l233337l636971m697418m507370p593193
$$ plain form
1093.6 546258011 539221306 531999741 523840218 515489998 507026672 499987984 490360641 481211128
1101.4 481211128 471687660 462776146 454139900 445690460 437711639 427987747 420599670 411466370
1109.1 411466370 404448128 397121849 389422722 383791313 377710762 375613708 371967697 370883636
1116.8 370883636 370460129 370421371 371583519 371365089 373145332 373568726 376018486 377166252 378507805
1125.5 378507805 379423141 379041176 380362053 379572029 380151176 379290619 378239288 374976959 371480789
1134.1 371480789 369781303 366297722 365106468 362151833 360933495 358884239 356570740 355384178
1141.9 355384178 352513962 351153030 347509079 345097351 341441765 339317207 338185730 336067772
1149.6 336067772 335594482 333271599 333711281 332776718 333687592 334694786 335475655 337981529 338152237
$$ packed form
1093.6E46258011p036705p221565q159523q350220q463326p038688r627343r149513
1101.4D81211128r523468q911514q636246q449440p978821r723892p388077r133300
1109.1D11466370p018242p326279p699127n631409o080551k097054l646011j084061
1116.8C70883636m23507l8758J162148k18430J780243M23394K449760J147766J341553
1125.5C78507805R15336l81965J320877p90024N79147q60557j051331l262329l496170
1134.1C71480789j699486l483581j191254k954635j218338k049256k313499j186562
1141.9C55384178k870216j360932l643951k411728l655586k124558j131477k117958
1149.6C36067772m73290k322883M39682r34563R10874J007194P80869K505874J70708
$$ plain form
1158.3 338152237 341540565 343325539 346704521 349973106 352922478 357527771 361310425 367491493
1166 367491493 371797943 377673874 383418694 390433388 397921181 404359589 412433357 418846092 427204666
1174.6 427204666 434424591 442457695 450025482 456646461 464382477 470685158 478728104 485037689
1182.4 485037689 491550865 497010193 502033882 508428040 512894630 517816277 522188644 527272186
1190.1 527272186 530770073 534207420 538393669 541899605 546611404 549811172 554370079 559267426
1197.8 559267426 563915291 568286629 572336121 577262650 580618896 584195480 587587166 591207581
1205.5 591207581 594647675 598185425 601680031 603839378 606911430 609594307 612440071 614504890
1213.2 614504890 616492462 618837471 620049057 621781044 622681885 624121742 625530090 626465874 627641830
$$ packed form
1158.3C38152237L388328J784974L378982L268585K949372M605293L782654O181068
1166C67491493M306450N875931N744820P014694P487793O438408Q073768O412735Q358574
1174.6D27204666P219925Q033104P567787O620979P736016O302681Q042946O309585
1182.4D85037689O513176N459328N023689O394158M466590M921647M372367N083542
1190.1E27272186L497887L437347M186249L505936M711799L199768M558907M897347
1197.8E59267426M647865M371338M049492M926529L356246L576584L391686L620415
1205.5E91207581L440094L537750L494606K159347L072052K682877K845764K064819
1213.2F14504890J987572K345009J211586J731987R00841J439857J408348R35784J175956
$$ plain form
1221.9 627641830 628222466 628686943 628424759 629271164 629929924 629998627 630348473 630795898 631631432 631947823
1231.5 631947823 632874603 633235588 633792000 634512062 634785118 635654526 636315804 637405396 637787552
1240.2 637787552 638088188 638485069 638907738 639665985 640176086 641149139 641176147 641204224 641425247 641770935
1249.9 641770935 642280426 642360916 643007584 643246841 643222809 643259354 644166946 644777222 645062637 646076279
1259.5 646076279 646326675 647173233 647869492 648129120 647994614 648026123 649151840 650196991 651730957
1268.2 651730957 652726364 653470078 654475784 656206436 658215866 659417419 660630341 661753311 663809357
1276.9 663809357 665379181 666454086 668308945 670201263 672472076 674387589 676089478 677976532
1284.6 677976532 679943466 681265488 682262115 683879166 685542374 687362595 688924484 690749435
$$ packed form
1221.9F27641830N80636M64477k62184Q46405O58760O8703L49846M47425Q35534L16391
1231.5F31947823R26780L60985N56412P20062K73056Q69408O61278J089592L82156
1240.2F37787552L00636L96881M22669P58247N10101R73053K7008K8077K21023L45688
1249.9F41770935N09491Q0490O46668K39257k4032L6545R07592O10276K85415J013642
1259.5F46076279K50396Q46558O96259K59628j34506L1509J125717J045151J533966
1268.2F51730957R95407P43714J005706J730652K009430J201553J212922J122970K056046
1276.9F63809357J569824J074905J854859J892318K270813J915513J701889J887054
1284.6F77976532J966934J322022R96627J617051J663208J820221J561889J824951
$$ plain form
1292.3 690749435 692992172 695109634 697043839 698377304 699708328 700924072 701722183 702640305 703756027
1301 703756027 704832687 705422363 705818100 706858597 708614655 709834213 710449829 711337585 711835709
1309.7 711835709 711991348 712161560 712729187 713276367 712846222 713240509 714144897 714808884 715816803
1318.3 715816803 716597824 717632217 718441086 718986282 719529266 719614029 719835129 720140305 720744781 721595383
1328 721595383 722243805 723055725 723752213 724046173 724011307 723828583 723867264 723533401 722868118 722880783
1337.6 722880783 722252121 721036301 721016464 722244949 723501740 724140015 724477234 724229965 723858871
1346.3 723858871 723416977 722648392 722107391 721652832 721604156 721699524 721987000 722068176 721694031 721155930
1355.9 721155930 720885315 721092377 720858383 720848312 719915161 718620529 718103027 716572113 717013397
$$ packed form
1292.3F90749435K242737K117462J934205J333465J331024J215744P98111R18122J115722
1301G03756027J076660N89676L95737J040497J756058J219558O15616Q87756M98124
1309.7G11835709J55639J70212N67627N47180m30145L94287R04388O63987J007919
1318.3G15816803P81021J034393Q08869N45196N42984Q4763K21100L05176O04476Q50602
1328G21595383O48422Q11920O96488K93960l4866j82724L8681l33863o65283J2665
1337.6G22880783o28662j215820j9837J228485J256791O38275L37219k47269l71094
1346.3G23858871m41894p68585n41001m54559m8676R5368K87476Q1176l74145n38101
1355.9G21155930k70615K07062k33994j0071r33151j294632n17502j530914M41284
$$ plain form
1364.6 717013397 717357330 717251816 717787704 717309570 716138306 715305481 714321442 713176880 711475067
1373.3 711475067 709232407 708924026 709609985 709714584 709431076 709880219 710550461 710420914 710520325 709718781
1382.9 709718781 708040695 707721710 708843918 709416351 707965012 708778534 710440216 711378784 711851425
1391.6 711851425 712152252 712737885 711401443 709517365 709473801 709117203 708438721 705693893 705193558
1400.3 705193558 706408997 706689072 706995697 707104568 705576859 705252075 705767593 705097885 704237671
1409 704237671 703353882 702668304 702075577 701957092 702687225 702712173 703047562 703290024 703258133 704325943
1418.6 704325943 700099945 699906998 702444153 703300247 702891922 701068268 701990509 703803635 704553375
1427.3 704553375 705720062 706297073 705735779 706345673 707629242 707778549 707551956 709133911 710223236
$$ packed form
1364.6G17013397L43933j05514N35888m78134j171264q32825r84039j144562j701813
1373.3G11475067k242660l08381O85959J04599k83508M49143O70242j29547R9411q01544
1382.9G09718781j678086l18985J122208N72433j451339Q13522J661682R38568M72641
1391.6G11851425L00827N85633j336442j884078m3564l56598o78482k744828n00335
1400.3G05193558J215439K80075L06625J08871j527709l24784N15518o69708q60214
1409G04237671q83789o85578n92727j18485P30133K4948L35389K42462l1891J067810
1418.6G04325943m225998j92947K537155Q56094m08325j823654R22241J813126P49740
1427.3G04553375J166687N77011n61294O09894J283569J49307k26593J581955J089325
$$ plain form
1436 710223236 706173248 707175903 710286484 711885910 712879562 713405151 713299637 713821487 714183350
1444.7 714183350 714538879 714987488 714424667 712896881 714036560 715855865 716124039 716323166 717043228
1453.3 717043228 718480759 719490433 719298553 717573624 713327637 715480347 718652267 721858826
1461.1 721858826 723644257 724493866 726222687 724052048 724217911 726847229 728760605 730050354 730733490
1469.7 730733490 732434082 732505493 729971313 729848785 734130249 738123703 738161545 740535812 743581314
1478.4 743581314 745139923 746337433 745906601 746207962 747548981 748437729 749076080 749451370 748517609
1487.1 748517609 747693558 748701935 746183243 745027618 747275314 749073792 749562912 749076996 747368393
1495.8 747368393 741331863 743795013 743817520 741896439 743758392 743474121 742904892 743020477 743975983
$$ packed form
1436G10223236m049988J002655L110581J599426R93652N25589j05514N21850L61863
1444.7G14183350L55529M48609n62821j527786J139679J819305K68174J99127P20062
1453.3G17043228J437531J009674j91880j724929m245987K152710L171920L206559
1461.1G21858826J785431Q49609J728821k170639J65863K629318J913376J289749O83136
1469.7G30733490J700592P1411k534180j22528M281464L993454L7842K374267L045502
1478.4G43581314J558609J197510m30832L01361J341019Q88748O38351L75290r33761
1487.1G48517609q24051J008377k518692j155625K247696J798478M89120m85916j708603
1495.8G47368393o036530K463150K2507j921081J861953k84271n69229J15585R55506
$$ plain form
1504.5 743975983 743157654 731126556 722921600 726849289 730903091 731115952 733128052 731831131
1512.2 731831131 729322052 730680084 729955750 728947830 724908905 721708450 725131989 727682114
1519.9 727682114 724343491 717569962 718787308 722054443 724435043 721309204 721152344 721425247 718751831
1528.6 718751831 718969955 719582596 719215088 718452988 716406708 712791290 715093536 716533127 717400055
1537.2 717400055 719613037 713349762 704411392 708237915 708531036 707133713 709639664 710253220 708583374
1545.9 708583374 711670456 713294601 714357300 713220139 711333466 713925095 715546875 716691742
1553.6 716691742 713190842 714090500 718505630 720991287 714719772 702398834 711718826 716900482
1561.4 716900482 720568085 722668152 722635880 720946503 721525879 723171082 723845596 723966599 718368683
$$ packed form
1504.5G43975983q18329j2031098q204956L927689M053802K12861K012100j296921
1512.2G31831131k509079J358032p24334j007920m038925l200455L423539K550125
1519.9G27682114l338623o773529J217346L267135K380600l125839j56860K72903k673416
1528.6G18751831K18124O12641l67508p62100k046280l615418K302246J439591Q66928
1537.2G17400055K212982o263275q938370L826523K93121j397323K505951O13556j669846
1545.9G08583374L087082J624145J062699j137161j886673K591629J621780J144867
1553.6G16691742l500900Q99658M415130K485657o271515j2320938R319992N181656
1561.4G16900482L667603K100067l2272j689377N79376J645203O74514J21003n597916
$$ plain form
1570 718368683 720158081 722574463 722698669 723084488 723593597 722766953 714288254 716809387 718519745
1578.7 718519745 717949142 717023621 715154266 714749908 713654480 712760162 711509857 710164185 708953323
1587.4 708953323 707091751 706121292 703737717 702119980 700129623 698811798 697172318 694698181
1595.1 694698181 693538132 691305466 690781631 689045105 687361526 685257568 682426529 680363846
1602.8 680363846 677205582 676202316 674247055 672548218 670223694 668612289 666795654 663867722
1610.5 663867722 663610535 661472931 659699249 656981506 656646423 655869522 644821472 646543045 646399307
1619.2 646399307 646414795 644654083 644115143 641744003 635458794 636800346 635905800 635600090 631418076
1627.9 631418076 628958130 629044075 628015709 627437401 625618858 625961761 625627403 620154037 617169304
$$ packed form
1570G18368683J789398K416382J24206L85819N09109q26644q478699K521133J710358
1578.7G18519745n70603r25521j869355m04358j095428q94318j250305j345672j210862
1587.4G08953323j861572r70459k383575j617737j990357j317825j639480k474137
1595.1F94698181j160049k232666n23835j736526j683579k103958k831039k062683
1602.8F80363846l158264j003266j955261j698837k324524j611405j816635k927932
1610.5F63867722k57187k137604j773682k717743l35083p76901j1048050J721573j43738
1619.2F46399307J5488j760712n38940k371140o285209J341552q94546l05710m182014
1627.9F31418076k459946Q5945j028366n78308j818543L42903l34358n473366k984733
$$ plain form
1636.6 617169304 618240967 618597984 618882866 619591370 618409538 619177017 618308868 619652596 621268387
1645.3 621268387 617785645 616642609 614487991 618871422 620962448 623891525 626878967 624068298
1653 624068298 614554482 617072945 623189583 625550156 628005981 629233932 630494576 632439461 634158707
1661.6 634158707 635467644 634525528 638216629 640472717 642546844 644696732 645940247 645831223 646149368
1670.3 646149368 650086746 651360016 655430679 659420929 659322815 659457703 663108292 667367401 669560013
1679 669560013 671467972 671646042 675143204 679873962 677329254 674077682 679428101 686500015 690455322
1687.7 690455322 692585144 695202713 696505737 699557037 702295685 705065308 708962021 712483521
1695.4 712483521 708487625 712699432 719160385 724815521 724911804 719407043 727891006 733019791 735797195
$$ packed form
1636.6F17169304J071663L57017K84882P08504j181832P67479q68149J343728J615791
1645.3F21268387l482742j143036k154618M383431K091026K929077K987442k810669
1653F24068298r513816K518463O116638K360573K455825J227951J260644J944885J719246
1661.6F34158707J308937r42116L691101K256088K074127K149888J243515j09024L18145
1670.3F46149368L937378J273270M070663L990250r8114J34888L650589M259109K192612
1679F69560013J907959J78070L497162M730758k544708l251572N350419P071914L955307
1687.7F90455322K129822K617569J303024L051300K738648K769623L896713L521500
1695.4G12483521l995896M211807O460953N655136R6283n504761Q483963N128785K777404
$$ plain form
1704.1 735797195 737509842 739436951 741198273 744090576 748367310 750078506 751184387 754083557
1711.8 754083557 756364517 758395386 757470932 757028351 760860977 762592163 756922302 761055756 765401230
1720.5 765401230 767384415 768899231 769486160 769721832 771071243 771908188 772468872 773159637 774130402
1729.1 774130402 772368469 771886444 775900421 778919373 774052124 768447037 774395981 778108826
1736.9 778108826 779336395 781807404 780230408 777603912 781655121 783970261 783138962 784190292
1744.6 784190292 787165451 788694839 789254227 789337845 789426117 793380508 793480453 792916641 796911316
1753.3 796911316 798638916 800493546 802349014 800221786 801412811 803724442 805667953 808006744
1761 808006744 804904099 804323120 807066193 808045654 808693237 809881973 810661316 808072128 809998322
$$ packed form
1704.1G35797195J712647J927109J761322K892303M276734J711196J105881K899170
1711.8G54083557K280960K030869r24454m42581L832626J731186n669861M133454M345474
1720.5G65401230J983185J514816N86929K35672J349411Q36945N60684O90765R70765
1729.1G74130402j761933m82025M013977L018952m867249n605087N948944L712845
1736.9G78108826J227569K471009j576996k626496M051209K315140q31299J051330
1744.6G84190292K975159J529388N59388Q3618Q8272L954391R9945n63812L994675
1753.3G96911316J727600J854630J855468k127228J191025K311631J943511K338791
1761H08006744l102645n80979K743073R79461O47583J188736P79343k589188J926194
$$ plain form
1769.7 809998322 813428345 812312164 807740097 807474518 812352066 813582230 811806488 813660583
1777.4 813660583 814575119 815411606 815275345 814021912 815444717 817104568 817627258 816288147 816192169
1786 816192169 817842255 818696518 819171524 819994202 819004822 817720871 814834900 815235062 819259720
1794.7 819259720 820114746 819300766 820429077 822147446 822045135 820107269 820988159 820211487 820360870
1803.4 820360870 821894684 822122650 822824783 822953186 822798080 823823547 824111633 822111740 822370529
1812.1 822370529 823589249 823994827 824601669 824435349 824691544 824629593 825204849 826186523 826117096 826387558
1821.7 826387558 825785446 826507492 827133942 823937073 824332581 826501999 827985382 827157288 822720718
1830.4 822720718 824129105 826809921 827308884 827495728 827764511 828005142 827583160 827232971 828254700
$$ packed form
1769.7H09998322L430023j116181m572067k65579M877548J230164j775742J854095
1777.4H13660583R14536Q36487j36261j253433J422805J659851N22690j339111r5978
1786H16192169J650086Q54263M75006Q22678r89380j283951k885971M00162M024658
1794.7H19259720Q55026q13980J128311J718369j02311j937866Q80890p76672J49383
1803.4H20360870J533814K27966P02133J28403j55106J025467K88086j999893K58789
1812.1H22370529J218720M05578O06842j66320K56195o1951N75256R81674o9427K70462
1821.7H26387558o02112P22046O26450l196869L95508K169418J483383q28094m436570
1830.4H22720718J408387K680816M98963J86844K68783K40631m21982l50189J021729
$$ plain form
1839.1 828254700 828339920 828355255 828018951 829006729 829291992 824182587 826782608 829144897 828354645
1847.8 828354645 827816238 828741074 829621048 829345398 829488678 829410095 829717484 829961090 829932861 830237656
1857.4 830237656 829922333 830224991 830522766 830539322 830085754 830208359 830692520 830513306 830987473 830989456
1867.1 830989456 830757599 828706818 827453842 829371872 830693512 831295929 831345367 831372910 831120911
1875.7 831120911 831117096 831370697 831414185 831595993 831548157 831692963 831520691 831698303 831542587 831261063
1885.4 831261063 831852722 832046509 832811661 831998825 829552536 830503159 831969528 832365799 832743530
1894.1 832743530 832127991 830742722 831309204 831722107 831781921 832253799 831989594 831668472 831682205 831951599
1903.7 831951599 832114105 832285156 832194519 831767273 831686096 831782227 831309586 831017151 831695938 831833496
$$ packed form
1839.1H28254700Q5220J5335l36304R87778K85263n109405K600021K362289p90252
1847.8H28354645n38407R24836Q79974k75650J43280p8583L07389K43606k8229L04795
1857.4H30237656l15323L02658K97775J6556m53568J22605M84161j79214M74167J983
1867.1H30989456k31857k050781j252976J918030J321640O02417M9438K7543k51999
1875.7H31120911l815K53601M3488J81808m7836J44806j72272J77612j55716k81524
1885.4H31261063N91659J93787P65152q12836k446289R50623J466369L96271L77731
1894.1H32743530o15539j385269N66482M12903N9814M71878k64205l21122J3733K69394
1903.7H31951599J62506J71051r0637m27246q1177R6131m72641k92435O78787J37558
$$ plain form
1913.3 831833496 831981354 831721954 831922684 833042831 830700150 830052795 831616211 832197495 832302094
1922 832302094 830478439 829831390 831158829 832108459 832088318 831899643 832066193 832010498 831909866 831919250
1931.7 831919250 831827621 831346817 831222687 831296310 831327972 831252289 831185532 831446838 831318512 832181015
1941.3 832181015 831830673 829435806 830348434 831094894 830328369 830044327 830497971 831158371 831151962 830967560
1951 830967560 831104279 831195831 831436005 831489410 830910873 830770569 831083603 831192398 831073303 830996246
1960.6 830996246 830878830 830308456 830173721 830408020 830608978 830501328 829699478 829599915 830083313 830406189
1970.2 830406189 830467682 830303192 830242386 830271835 829980392 829920044 830109024 829582214 829528427 829735947
1979.9 829735947 829538422 829755325 829750748 829651413 829546204 829263611 829158783 828888397 828355560 828260269
$$ packed form
1913.3H31833496J47858k59400K00730J120147k342681o47355J563416N81284J04599
1922H32302094j823655o47049J327439R49630k0141j88675J66550n5695j00632R384
1931.7H31919250r1629m80804j24130P3623L1662p5683o6757K61306j28326Q62503
1941.3H32181015l50342k394867R12628P46460p66525k84042M53644O60400o409j84402
1951H30967560J36719R1552K40174N3405n78537j40304L13034J08795j19095p7057
1960.6H30996246j17416n70374j34735K34299K00958j07650q01850r9563M83398L22876
1970.2H30406189O1493j64490o0806K9449k91443o0348J88980n26810n3787K07520
1979.9H29735947j97525K16903m577r9335j05209k82593j04828k70386n32837r5291
$$ plain form
1989.5 828260269 829062576 829237213 827734909 827744293 828950577 829111786 828995590 828796539 828557205 828628845
1999.2 828628845 828392410 828353806 828133850 827820129 827896500 827987061 828226242 828364334 828204803 827655945
2008.8 827655945 827308731 827239380 827061996 826853943 826716919 827062531 827352219 827102127 826470947 826558762
2018.5 826558762 827037277 826883850 826707230 826209183 825947800 826222229 826377945 826447754 826311417 826637878
2028.1 826637878 826831512 826365051 826099396 825961761 825824661 825715027 825622025 825617142 825181656 824641342
2037.7 824641342 824550552 824562454 825012589 825473099 825661621 825705872 825257416 824926224 824647141 824390259
2047.4 824390259 824037170 824046478 824332275 824166718 824549332 824764938 824472733 824303436 824331131 824445114
2057 824445114 824081879 823692474 823208771 822768097 822461243 822527924 823048859 823105621 822980347 823034058
$$ packed form
1989.5H28260269Q02307J74637j502304R384J206284J61209j16196j99051k39334P1640
1999.2H28628845k36435l8604k19956l13721P6371R0561K39181J38092j59531n48858
2008.8H27655945l47214o9351j77384k08053j37024L45612K89688k50092o31180Q7815
2018.5H26558762M78515j53427j76620m98047k61383K74429J55716O9809j36337L26461
2028.1H26637878J93634m66461k65655j37635j37100j09634r3002m883m35486n40314
2037.7H24641342r0790J1902M50135M60510J88522M4251m48456l31192k79083k56882
2047.4H24390259l53089R308K85797j65557L82614K15606k92205j69297K7695J13983
2057H24445114l63235l89405m83703m40674l06854O6681N20935N6762j25274N3711
$$ plain form
2066.7 823034058 823186035 822990112 822621918 821912689 820828476 820346527 820031128 820016861 820152969 820060120
2076.3 820060120 820222549 820496445 820342178 820049057 820118408 819653549 819036942 818599396 818388748 818753662
2086 818753662 818902359 819187088 819674911 819694595 819092026 818724823 818847351 818743668 818231964 817796478
2095.6 817796478 818169708 818130722 817967834 818505020 818943176 819536362 819724884 819501114 819547272 819752731
2105.2 819752731 819534760 819213486 819342270 819208832 819109650 819457397 820069046 820424118 820654831 820811462
2114.9 820811462 820630341 820720215 820654984 820374908 819850388 819324799 819238968 819506073 820215836 820667496
2124.5 820667496 820642242 820276794 820214157 820016174 819401703 819422455 819334030 818719025 818241425 818740082
2134.2 818740082 819476471 819794464 820169601 820339584 820432510 820111923 819851379 819769363 819341736 819045944
$$ packed form
2066.7H23034058J51977j95923l68194p09229j084213m81949l15399j4267J36108r2849
2076.3H20060120J62429K73896j54267k93121O9351m64859o16607m37546k10648L64914
2086H18753662J48697K84729M87823J9684o02569l67203J22528j03683n11704m35486
2095.6H17796478L73230l8986j62888N37186M38156N93186J88522k23770M6158K05459
2105.2H19752731k17971l21274J28784j33438r9182L47747O11649L55072K30713J56631
2114.9H20811462j81121Q9874o5231k80076n24520n25589q5831K67105P09763M51660
2124.5H20667496k5254l65448o2637j97983o14471K0752q8425o15005m77600M98657
2134.2H18740082P36389L17993L75137J69983R2926l20587k60544q2016m27627k95792
$$ plain form
2143.8 819045944 819238205 819583817 819704437 820464172 821235123 821359711 821257706 821113281 821205978 821318130
2153.5 821318130 821093521 820054550 819742279 820186996 820502853 821035309 821123047 821434250 821835861 822142410
2163.1 822142410 822201157 821707230 821086578 820599060 820882187 820690613 820473709 820838089 820974655 821200638
2172.8 821200638 821061859 820719299 820389938 820185699 819870224 819700089 819812775 819561920 819598465 819869461
2182.4 819869461 820273361 820650940 820910034 821099396 820965042 820970612 821327820 821514740 820918274 820656815
2192 820656815 820765305 820835266 821279373 821655350 822157516 822507553 822778091 822831039 822706604 822415009
2201.7 822415009 821956406 822281876 822325897 822257843 822559814 822778091 823132172 823500214 823924255 823912811
2211.3 823912811 823501892 822806625 822572098 822864838 822915268 822819977 822560196 822856827 823039627 823170547
$$ packed form
2143.8H19045944J92261L45612J20620P59735P70951J24588j02005j44425R2697J12152
2153.5H21318130k24609j038971l12271M44717L15857N32456Q7738L11203M01611L06549
2163.1H22142410N8747m93927o20652m87518K83127j91574k16904L64380J36566K25983
2172.8H21200638j38779l42560l29361k04239l15475j70135J12686k50855L6545K70996
2182.4H19869461M03900L77579K59094J89362j34354N570L57208J86920n96466k61459
2192H20656815J08490O9961M44107L75977N02166L50037K70538N2948j24435k91595
2201.7H22415009m58603L25470M4021o8054L01971K18277L54081L68042M24041j1444
2211.3H23912811m10919o95267k34527K92740N0430r5291k59781K96631J82800J30920
$$ plain form
2221 823170547 823690720 823786316 823807526 823443832 822974396 822723999 822366943 822241592 822391052 822424316
2230.6 822424316 822497635 822835999 823002777 823068924 823173981 823455048 823107529 822278366 822202759 822207031
2240.3 822207031 822132797 822002106 822017670 822309494 822388229 822391891 822575455 822866287 822704697 822406921
2249.9 822406921 822244415 822243271 822040634 821811218 822092209 822118301 822376556 822750244 822965317 822975616
2259.5 822975616 822472076 822130890 821909637 821920013 821733704 821659164 822164612 822354279 821982880 821981735
2269.2 821981735 822828522 823152084 822961884 822658539 822493362 822321014 821692886 821453247 821193466 821106262
2278.8 821106262 821453094 822068100 822231369 822148972 822775345 822687531 822369003 822129517 821799240 821707458
2288.5 821707458 821653519 821799774 821466980 821487961 821679840 821791534 822085342 822208252 821996918 821153259
$$ packed form
2221H23170547N20173R5596K1210l63694m69436k50397l57056j25351J49460L3264
2230.6H22424316P3319L38364J66778O6147J05057K81067l47519q29163p5607M272
2240.3H22207031p4234j30691J5564K91824P8735L662J83564K90832j61590k97776
2249.9H22406921j62506j144k02637k29416K80991K6092K58255L73688K15073J0299
2259.5H22975616n03540l41186k21253J0376j86309p4540N05448J89667l71399j145
2269.2H21981735Q46787L23562j90200l03345j65177j72348o28128k39639k59781q7204
2278.8H21106262L46832O15006J63269q2397O26373q7814l18528k39486l30277r1782
2288.5H21707458n3939J46255l32794K0981J91879J11694K93808J22910k11334q43659
$$ plain form
2298.1 821153259 820891037 820391541 819995956 820275650 820172501 820116119 820039444 820295410 820122299 819756622
2307.8 819756622 819482040 819382553 819045792 817990494 818413162 817844009 816855316 817193527 817213211 817486420
2317.4 817486420 817192841 817026978 816803589 816423721 815574341 814446793 814396286 813964767 814494858 814398727
2327.1 814398727 813180161 812826614 813196640 813438187 812407455 812326584 812458267 812405014 812087326 811030350
2336.7 811030350 810956726 811548309 811834030 811450043 812161560 812502518 812435303 812852783 812545242 813087692
2346.3 813087692 814285812 816290283 817860794 817664719 816493530 814992218 813668747 812837830 811900101
2355 811900101 810835495 809785767 809572296 810205002 809248276 807416000 807839737 809499512 810425720
2363.7 810425720 809630508 809247208 811274872 813561630 814275665 813486328 813004990 814309616 816140594
$$ packed form
2298.1H21153259k62222m99496l95585K79694j03149n6382p6675K55966j73111l65677
2307.8H19756622k74582r9487l36761j055298M22668n69153r88693L38211J9684K73209
2317.4H17486420k93579j65863k23389l79868q49380j127548n0507m31519N30091r6131
2327.1H14398727j218566l53547L70026K41547j030732q0871J31683n3253l17688j056976
2336.7H11030350p3624N91583K85721l83987P11517L40958o7215M17480l07541N42450
2346.3H13087692J198120K004471J570511j96075j171189j501312j323471q30917r37729
2355H11900101j064606j049728k13471O32706r56726j832276M23737J659775R26208
2363.7H10425720p95212l83300K027664K286758P14035p89337m81338J304626J830978
$$ plain form
2372.4 816140594 816838303 816887283 817085953 817980423 819036865 819841919 820477295 820529938 821004944 821666718
2382 821666718 822025299 822556686 822868881 822915268 822670212 822768326 823318176 823411484 823495483 823879852 823721542
2392.6 823721542 823372269 823500290 823280106 822823868 822453918 822303619 822568436 822701721 822873535 822955627
2402.3 822955627 822982407 823114624 823113022 823123932 822981720 822572479 822174759 822123795 822063370 821957092 822045135
2412.9 822045135 822131119 822123718 822256317 822720108 822678452 822114639 821659927 821655197 821575470 821010056 821188889
2423.5 821188889 821492233 821389008 821643448 821738281 821318741 820954742 821069107 821253510 821163559 820825882
2433.1 820825882 820771103 820755310 820455475 820298004 820355453 820647964 820526657 820624695 820856781 820322418
2442.8 820322418 819894333 819707184 819796677 819807358 819720459 819676132 819391251 819375687 819552231 819757919
$$ packed form
2372.4H16140594O97709M8980J98670Q94470J056442Q05054O35376N2643M75006O61774
2382H21666718L58581N31387L12195M6387k45056R8114N49850R3308Q3999L84369j58310
2392.6H23721542l49273J28021k20184m56238l69950j50299K64817J33285J71814Q2092
2402.3H22955627K6780J32217j602J0910j42212m09241l97720n0964o0425j06278Q8043
2412.9H22045135Q5984p401J32599M63791m1656n63813m54712m730p9727n65414J78833
2423.5H21188889L03344j03225K54440R4833m19540l63999J14365J84403q9951l37677
2433.1H20825882n4779j5793k99835j57471N7449K92511j21307R8038K32086n34363
2442.8H20322418m28085j87149Q9493J0681q6899m4327k84881j5564J76544K05688
$$ plain form
2452.4 819757919 819636154 819228745 818939819 818899231 818893661 818639526 818377457 818040314 818130341 818329697
2462.1 818329697 818161316 818009491 818003922 818167572 817986603 817725830 817382812 817135391 817493744 817964554
2471.7 817964554 818062134 817570801 817217407 817114182 816890640 816719055 816825256 816895065 816492386 816179733
2481.3 816179733 816070328 816122513 816269302 816334305 816068344 815764084 815717392 815386581 815404205 815482635
2491 815482635 815267563 815219955 815443344 815723267 815112686 814306793 813820038 813753357 814254913 814695282
2500.6 814695282 814857101 814757233 814660873 814180756 813889771 814024429 813840485 813374863 812859268 812969284
2510.3 812969284 813155212 813176498 813243179 813370667 813514938 813120346 812929840 812947769 812882538 812892380 812680206
2520.9 812680206 812322845 812237854 812426910 812253647 811887817 811638260 812006912 812532883 812403030 812253113
$$ packed form
2452.4H19757919j21765m07409k88926m0588n570k54135k62069l37143R0027J99356
2462.1H18329697j68381j51825n569J63650j80969k60773l43018k47421L58353M70810
2471.7H17964554R7580m91333l53394j03225k23542j71585J06201O9809m02679l12653
2481.3H16179733j09405N2185J46789O5003k65961l04260m6692l30811J7624P8430
2491H15482635k15072m7608K23389K79923o10581q05893m86755o6681N01556M40369
2500.6H14695282J61819r9868r6360m80117k90985J34658j83944m65622n15595J10016
2510.3H12969284J85928K1286O6681J27488J44271l94592j90506J7929o5231R842k12174
2520.9H12680206l57361q4991J89056j73263l65830k49557L68652N25971j29853j49917
$$ plain form
2530.5 812253113 811972198 811556854 811218567 811157761 811238632 811015549 810860672 810914917 810979385 810959778
2540.2 810959778 810936508 810679016 810733566 810851135 810334320 810214691 810256348 810157623 810148163 810167313 810136185
2550.8 810136185 810062714 810141830 809981079 810158005 810280762 809688263 809275742 808990021 808761597 808817291
2560.4 808817291 808841629 808655777 808509216 808577576 808777542 808689423 808453598 808367538 808351822 808577576
2570.1 808577576 808383713 807924805 807649536 807743835 808198471 807998047 807694550 807697906 807617416 807318573
2579.7 807318573 806851349 806569824 806714401 807106323 806747055 806134644 805850601 805867233 805873032 805707855
2589.4 805707855 806181870 806268692 806092148 806110001 805783615 805609818 805507812 805617294 805492935 805169220
2599 805169220 805165024 804943161 804507370 804298782 804447327 804534149 804481735 804247055 803727417 803245621 803072205
$$ packed form
2530.5H12253113k80915m15344l38287o0806Q0871k23083j54877N4245O4468j9607
2540.2H10959778k3270k57492N4550J17569n16815j19629M1657r8725r460J9150l1128
2550.8H10136185p3471P9116j60751J76926J22757n92499m12521k85721k28424N5694
2560.4H08817291K4338j85852j46561O8360J99966q8119k35825q6060j5716K25754
2570.1H08577576j93863m58908k75269R4299M54636k00424l03497L356q0490k98843
2579.7H07318573m67224k81525J44577L91922l59268o12411k84043J6632N799j65177
2589.4H05707855M74015Q6822j76544J7853l26386j73797j02006J09482j24359l23715
2599H05169220m196k21863m35791k08588J48545Q6822n2414k34680n19638m81796j73416
$$ plain form
2609.6 803072205 803060989 802976837 802761154 802518234 802461319 802305832 802504654 802647171 802263031 802073364
2619.3 802073364 801803818 801803436 801612549 801094894 800942841 800850830 800891342 800856018 800816574 800675201 800611191
2629.9 800611191 800615158 800413132 800098267 799454880 799117966 798972778 799218521 799722519 799610291 799212189
2639.5 799212189 798842621 798926620 798953247 798438034 797711029 797550430 797727814 797419739 797196426 797095337
2649.1 797095337 797177200 796898880 796500015 796673355 796855240 796805954 796082916 795651855 795547028 795418777
2658.8 795418777 795785141 795901871 795487061 794878693 794851837 794932175 794755630 794493637 794249115 794407425
2668.4 794407425 794088058 793834457 793920517 793751144 793583984 793301239 793016357 793099594 793538818 793533096
2678.1 793533096 793196793 792922745 792713165 792305222 791619263 791444550 791528320 791703491 791653442 791304169
$$ packed form
2609.6H03072205j1216q4152k15683k42920n6915j55487J98822J42517l84140j89667
2619.3H02073364k69546l82j90887n17655j52053r2011M0512l5324l9444j41373o4010
2629.9H00611191L967k02026l14865o43387l36914j45188K45743N03998j12228l98102
2639.5G99212189l69568Q3999K6627n15213p27005j60599J77384l08075k23313j01089
2649.1G97095337Q1863k78320l98865J73340J81885m9286p23038m31061j04827j28251
2658.8G95418777L66364J16730m14810o08368k6856Q0338j76545k61993k44522J58310
2668.4G94407425l19367k53601Q6060j69373j67160k82745k84882Q3237M39224n722
2678.1G93533096l36303k74048k09580m07943o85959j74713Q3770J75171n0049l49273
$$ plain form
2687.7 791304169 790966797 790750656 790870285 790552292 790161285 790156021 790450516 790566788 790164337 789934464
2697.4 789934464 789726715 789661942 789342804 788905182 788802032 788527145 788255615 788083801 788177490 788196869
2707 788196869 788207855 787841644 787235489 787419434 787245712 786949158 787037811 786951828 786781082 786324768
2716.6 786324768 785745544 785459900 785638809 785586624 785343170 785270233 784924850 784725342 784993820 785023422
2726.3 785023422 783976135 782931442 783154755 783511581 783484039 783632050 783435364 783139420 783175049 782853470
2735.9 782853470 782478790 782100449 781801071 781799698 781696930 781724777 781435776 781169510 781289291 781128693
2745.6 781128693 781139603 781328583 781353607 781006393 780238419 779542313 778984375 778647003 778794785 779315796
2755.2 779315796 779265747 778536453 778592148 778776550 778126450 777593460 777240829 777146606 777119293 777282944
$$ packed form
2687.7G91304169l37372k16141J19629l17993l91007n264K94495J16272m02451k29873
2697.4G89934464k07749o4773l19138m37622j03150k74887k71530j71814R3689J9379
2707G88196869J0986l66211o06155J83945j73722k96554Q8653q5983j70746m56314
2716.6G86324768n79224k85644J78909n2185k43454p2937l45383j99508K68478K9602
2726.3G85023422j047287j044693K23313L56826k7542J48011j96686k95944L5629l21579
2735.9G82853470l74680l78341k99378j373j02768K7847k89001k66266J19781j60598
2745.6G81128693J0910J88980K5024l47214p67974o96106n57938l37372J47782N21011
2755.2G79315796n0049p29294N5695J84402o50100n32990l52631r4223k7313J63651
$$ plain form
2764.9 777282944 777619324 777001495 776489563 776340561 776118546 776249008 776226807 776059036 775682907 775299149
2774.5 775299149 774891739 774458923 774199829 773857803 773785095 773866501 773809662 773246155 772403107 771763000
2784.2 771763000 771622696 771940842 771707687 771418915 771294861 771127701 770808487 770020599 769671173 769639816
2793.8 769639816 769500809 769229584 768937759 768529510 767967300 767863846 767736969 767677078 767601471 766746063
2803.4 766746063 766068802 766095810 765672760 764854965 764688187 764843979 764584579 763841629 763334198 763067780
2813.1 763067780 762863998 762720337 762058334 761156082 760321274 760336227 760456924 759774094 759530182 759168243
2822.7 759168243 758529816 758362045 758716125 758754120 757850037 756996231 756269302 755744629 755400238 754916382
2832.4 754916382 754594727 754367218 753748016 752726135 752059326 751389389 750571060 749731979 748614807
$$ packed form
2764.9G77282944L36380o17829n11932j49002k22015J30462k2201j67771l76129l83758
2774.5G75299149m07410m32816k59094l42026p2708Q1406n6839n63507q43048o40107
2784.2G71763000j40304L18146k33155k88772j24054j67160l19214p87888l49426l1357
2793.8G69639816j39007k71225k91825m08249n62210j03454j26877n9891p5607q55408
2803.4G66746063o77261K7008m23050q17795j66778J55792k59400p42950n07431k66418
2813.1G63067780k03782j43661o62003r02252q34808J4953J20697o82830k43912l61939
2822.7G59168243o38427j67771L54080L7995r04083q53806p26929n24673l44391m83856
2832.4G54916382l21655k27509o19202j021881o66809o69937q18329q39081j117172
$$ plain form
2841.1 748614807 747444687 746150894 745449905 745102081 743959732 742617111 741221161 739303207 737636719
2849.7 737636719 736508102 735563049 734531555 733434906 733252640 733622284 733914795 733856049 733239975
2858.4 733239975 732888489 732695618 732636795 732171555 731476517 731310501 730979996 730487747 729530487 728793259
2868.1 728793259 728348999 727558594 727170944 726654892 726086655 725575256 724964981 724606476 724197693 723740463
2877.7 723740463 723232422 722751083 722501526 722564011 722616577 722506866 722120514 721347046 720712204 720081635
2887.3 720081635 719239197 718603592 718397980 718020172 717602921 717087479 715924835 715240097 714935608
2896 714935608 714750900 714528809 713738632 713120041 712476578 712016296 711693420 710917892 710215759 709982147
2905.7 709982147 709798965 708862000 708301620 708496094 708125610 707413483 706605530 705657272 704631729
$$ packed form
2841.1G48614807j170120j293793p00989l47824j142349j342621j395950j917954j666488
2849.7G37636719j128617r45053j031494j096649j82266L69644K92511n8746o16074
2858.4G33239975l51486j92871n8823m65240o95038j66016l30505m92249r57260p37228
2868.1G28793259m44260p90405l87650n16052n68237n11399o10275l58505m08783m57230
2877.7G23740463n08041m81339k49557O2485N2566j09711l86352p73468o34842o30569
2887.3G20081635q42438o35605k05612l77808m17251n15442j162644o84738l04489
2896G14935608j84708k22091p90177o18591o43463m60282l22876p75528p02133k33612
2905.7G09982147j83182r36965n60380J94474l70484p12127q07953r48258j025543
$$ plain form
2914.3 704631729 703625336 703279724 703061523 701906204 700699081 700361023 700163727 699397659 698116684
2923 698116684 697111359 697174377 697478333 697185364 697039337 697275238 697904663 698608932 698841705 698963013
2932.7 698963013 698766022 698458786 698504257 698974152 699417267 699540482 699892578 700239410 700806580 701495667
2942.3 701495667 702066193 702242355 701921005 702147827 702217636 702003403 701880722 701967621 702293625 701840973
2952 701840973 701164093 700530624 699985352 699690933 699664383 699891281 699581451 699066467 698825150 699263687
2961.6 699263687 699707413 699740372 700185013 700571518 700754089 701064758 701758652 702464066 703106232 703889008
2971.2 703889008 704321442 704806137 705690918 706511459 706769638 707244263 708260498 709224167 709851608
2979.9 709851608 709890900 710167084 710678329 711374893 712309418 712771835 712959824 713181152 713657303 713975830
$$ packed form
2914.3G04631729j006393l45612k18201j155319j207123l38058j97296p66068j280975
2923F98116684j005325O3018L03956k92969j46027K35901O29425P04269K32773J21308
2932.7F98963013j96991l07236M5471M69895M43115J23215L52096L46832N67170O89087
2942.3G01495667N70526J76162l21350K26822O9809k14233j22681Q6899L26004m52652
2952G01840973o76880o33469n45272k94419k6550K26898l09830n14984k41317M38537
2961.6F99263687M43726L2959M44641L86505J82571L10669O93894P05414O42166P82776
2971.2G03889008M32434M84695Q84781Q20541K58179M74625J016235R63669O27441
2979.9G09851608L9292K76184N11245O96564R34525M62417J87989K21328M76151L18527
$$ plain form
2989.6 713975830 714485397 715538330 716089554 716041107 715780182 715830612 716330261 716616440 716639404 716758499
2999.2 716758499 716708298 716716919 716902542 716481934 716180038 716221542 716163635 716558228 716914215 717054291
3008.8 717054291 717120819 716800461 716409683 715826645 715419693 715703201 715619659 715051346 714849625 714837189
3018.5 714837189 714540710 714123917 713776779 713191299 712933502 712916946 712350082 711874847 711909714 711880722
3028.1 711880722 711632385 711591568 711105499 710368881 710570297 710810013 710345001 709587555 708923111 708283844
3037.8 708283844 707865601 707678986 707475815 707178955 706591949 706332932 706100693 705738754 705430527 704736633
3047.4 704736633 704385223 704460373 704249191 703417435 702521973 701873779 701527710 701571655 701244888 700883942
3057.1 700883942 700448761 699967651 699639587 699124451 698978882 699033661 698638000 697844315 697783203 697866974
$$ packed form
2989.6G13975830N09567J052933N51224m8447k60925N0430M99649K86179K2964J19095
2999.2G16758499n0201Q621J85623m20608l01896M1504n7907L94593L55987J40076
3008.8G17054291O6528l20358l90778n83038m06952K83508q3542n68313k01721j2436
3018.5G14837189k96479m16793l47138n85480k57797j6556n66864m75235L4867k8992
3028.1G11880722k48337m0817m86069p36618K01416K39716m65012p57446o64444o39267
3037.8G08283844m18243j86615k03171k96860n87006k59017k32239l61939l08227o93894
3047.4G04736633l51410P5150k11182q31756q95462o48194l46069M3945l26767l60946
3057.1G00883942m35181m81110l28064n15136j45569N4779l95661p93685o1112Q3771
$$ plain form
3066.7 697866974 697341080 697028427 696441422 695867310 695459518 694813766 694274368 694100418 694188461 694092560
3076.4 694092560 693715210 693187332 692829742 692376022 692086258 691890182 691578140 691673279 691496048 690933838
3086 690933838 690090027 689640808 689750977 689511566 688956451 688307800 688017578 687685394 687409592 687016983
3095.6 687016983 686471100 686172333 685670166 685529633 685072403 684513855 684139938 683492584 683139572 682792206
3105.3 682792206 682462006 681851120 681663361 681405945 680624924 680446854 680020523 679431000 678850479 678304214
3114.9 678304214 677532501 676874161 676807938 675973206 675252838 675191879 674646912 673611832 673307495 673408585
3124.6 673408585 672786636 671700439 670635757 670398483 669983597 669140701 668448410 667685318 667226562
3133.3 667226562 666676941 666181793 665501328 664894791 664549561 664217758 663838196 662919922 662205887 661525726
$$ packed form
3066.7F97866974n25894l12653n87005n74112m07792o45752n39398j73950Q8043r5901
3076.4F94092560l77350n27878l57590m53720k89764j96076l12042R5139j77231n62210
3086F90933838q43811m49219J10169k39411n55115o48651k90222l32184k75802l92609
3095.6F87016983n45883k98767n02167j40533m57230n58548l73917o47354l53012l47366
3105.3F82792206l30200o10886j87759k57416p81021j78070m26331n89523n80521n46265
3114.9F78304214p71713o58340o6223q34732p20368o0959n44967j035080l04337J01090
3124.6F73408585o21949j086197j064682k37274m14886q42896o92291p63092m58756
3133.3F67226562n49621m95148o80465o06537l45230l31803l79562r18274p14035o80161
$$ plain form
3142.9 661525726 661097870 660622559 659700699 658832550 658149872 658124771 657482376 656827927 656228867 655307846
3152.5 655307846 654972229 654051895 653222656 652664948 651927109 651042480 650234299 649765472 648903503 648358307
3162.2 648358307 647875214 647497406 647179794 646410599 645776062 644822311 644064941 643591461 642541351
3170.9 642541351 641415939 640914383 640504379 639879761 639324722 638866234 638432999 637475471 636611977
3179.5 636611977 635603523 634458008 634061089 633654060 633071518 632092667 630911369 630405006 630546379
3188.2 630546379 630057411 629119644 628622513 627590103 626791801 626349487 625532494 624764404 624516983
3196.9 624516983 624173241 623115387 622738686 622242622 621383820 620637131 619817276 619261513 618343925
3205.6 618343925 617632103 617027016 616922760 616595688 615345154 615117073 614732895 613663559 612601662
$$ packed form
3142.9F61525726m27856m75311r21860q68149o82678k5101o42395o54449n99060r21021
3152.5F55307846l35617r20334q29239n57708p37839q84629q08181m68827q61969n45196
3162.2F48358307m83093l77808l17612p69195o34537r53751p57370m73480j050110
3170.9F42541351j125412n01556m10004o24618n55039m58488m33235r57528q63494
3179.5F36611977j008454j145515l96919m07029n82542r78851j181298n06363J41373
3188.2F30546379m88968r37767m97131j032410p98302m42314q16993p68090k47421
3196.9F24516983l43742j057854l76701m96064q58802p46689q19855n55763r17588
3205.6F18343925p11822o05087j04256l27072j250534k28081l84178j069336j061897
$$ plain form
3214.3 612601662 611727219 611156311 610708313 610542183 609918213 608810654 608001823 607750778 607252579
3222.9 607252579 606759300 606618500 606069603 605328217 604525833 604145584 603469276 602544518 602384644 601984673
3232.6 601984673 601093979 600400848 600151215 599526443 598646965 598272324 598001480 597178345 596087723
3241.3 596087723 595645790 595526047 595401039 594627724 593789635 593517952 592817383 591832008 590918312 590410004
3250.9 590410004 589987755 589952049 589767075 588933182 588574638 587759552 586853104 586538162 586469498 586136551
3260.5 586136551 585595551 585320549 584339600 583594551 583150864 582398300 581922607 581481133 581185875 580912399
3270.2 580912399 580572548 580165062 579655342 579012222 578592987 577832298 576933975 576701889 575968590 575498848
3279.8 575498848 575329132 575243988 575045280 573944130 573388023 573051605 572718582 572440109 572086220 571829987
$$ packed form
3214.3F12601662q74443n70908m47998j66130o23970j107559q08831k51045m98199
3222.9F07252579m93279j40800n48897p41386q02384l80249o76308r24758j59874l99971
3232.6F01984673q90694o93131k49633o24772q79478l74641k70844q23135j090622
3241.3E96087723m41933j19743j25008p73315q38089k71683p00569r85375r13696n08308
3250.9E90410004m22249l5706j84974q33893l58544q15086r06448l14942o8664l32947
3260.5E86136551n41000k75002r80949p45049m43687p52564m75693m41474k95258k73476
3270.2E80912399l39851m07486n09720o43120m19235p60689q98323k32086p33299m69742
3279.8E75498848j69716q5144j98708j101150n56107l36418l33023k78473l53889k56233
$$ plain form
3289.5 571829987 571307487 571128693 570837669 570209770 569753952 569808273 569520836 568674393 568286819 567973404
3299.1 567973404 567686844 566901550 566382446 566299324 565685692 565574417 565525208 564852638 564002228 563460617
3308.8 563460617 562859993 562418518 562365494 561733780 560784950 559705467 559058380 558863907 558635025 558259964
3318.4 558259964 557556190 557219315 556954346 556352425 555871696 555725479 554851303 553587036 553040352
3327.1 553040352 552539215 552269135 551580620 550748024 550394707 549909859 549458046 548823242 548355789 547471542
3336.7 547471542 546649704 546716385 546393051 545710182 544997635 544610672 544464111 543956337 542957191 541709900
3346.4 541709900 540869102 540564461 540495033 539932251 538905220 538151131 537650452 537215500 537066612 536700401
3356 536700401 535585899 534582443 534137840 533951530 533421059 532493134 531745148 531426888 530991745 529956856
$$ packed form
3289.5E71829987n22500j78794k91024o27899m55818N4321k87437q46443l87574l13415
3299.1E67973404k86560p85294n19104q3122o13632j11275m9209o72570q50410n41611
3308.8E63460617o00624m41475n3024o31714r48830j079483o47087j94473k28882l75061
3318.4E58259964p03774l36875k64969o01921m80729j46217q74176j264267n46684
3327.1E53040352n01137k70080o88515q32596l53317m84848m51813o34804m67453q84247
3336.7E47471542q21838O6681l23334o82869p12547l86963j46561n07774r99146j247291
3346.4E41709900q40798l04641o9428n62782j027031p54089n00679m34952j48888l66211
3356E36700401j114502j003456m44603j86310n30471r27925p47986l18260m35143j034889
$$ plain form
3365.7 529956856 529412231 529422836 529183273 528454742 527565346 526976662 526304779 525530396 524512024 523855019
3375.3 523855019 524168854 524069672 523035240 522391052 522175751 521614075 521344490 521085434 520466118 519560242
3384.9 519560242 518568459 518038826 517859917 518314514 518124008 517502747 517660980 516973152 515736008
3393.6 515736008 515237732 515350342 515164528 514255943 514120445 514106026 513290100 513186951 513201218 512395363
3403.3 512395363 512007828 511884995 511868095 512002716 511936913 511671371 511133308 510688057 510111580 509629860
3412.9 509629860 509497223 509460564 509430580 509257812 509033012 508896141 508897629 508388481 508095474 508329391
3422.6 508329391 508457909 508383942 507988968 507959404 507760735 507641945 507648163 507476578 507484055 507124023 507309380
3433.2 507309380 507746620 508114471 508297882 508082886 508115463 507906532 507810974 508244057 508702927 508153954
$$ packed form
3365.7E29956856n44625J0605k39563p28531q89396n88684o71883p74383j018372o57005
3375.3E23855019L13835r9182j034432o44188k15301n61676k69585k59056o19316r05876
3384.9E19560242r91783n29633j78909M54597j90506o21261J58233o87828j237144
3393.6E15736008m98276J12610j85814r08585j35498j4419q15926j03149J4267q05855
3403.3E12395363l87535j22833j6900J34621o5803k65542n38063m45251n76477m81720
3412.9E09629860j32637l6659k9984j72768k24800j36871J488n09148k93007K33917
3422.6E08329391J28518p3967l94974k9564j98669j18790O218j71585P477l60032J85357
3433.2E07309380M37240L67851J83411k14996L2577k08931r5558M33083M58870n48973
$$ plain form
3442.8 508153954 508001099 508508720 508952332 509842072 509177246 508836136 509482841 510195656 510971184 510925560
3452.5 510925560 510775795 510681877 511479034 511983261 512224121 512703590 512549782 512868004 513046379 514056435
3462.1 514056435 514505730 514374161 515259399 515921211 516768799 516240005 515967865 516719437 517027817 517332306
3471.7 517332306 517564621 518547173 519059029 519127655 519785690 520998421 521981163 521965065 521782608 521906929
3481.4 521906929 522568321 523137817 524544983 525048332 524421692 525382423 525928612 526122055 526682968
3490.1 526682968 527451859 527922478 528047104 528812943 529797745 530973778 530829887 530470505 531037178
3498.7 531037178 531984634 533351479 534127808 534207764 533505898 534231911 535956345 536754684 537478714
3507.4 537478714 538825264 539640503 539129715 539461403 539857407 540774727 542064323 542283058 542735672
$$ packed form
3442.8E08153954j52855N07621M43612Q89740o64826l41110O46705P12815P75528m5624
3452.5E10925560j49765r3918P97157N04227K40860M79469j53808L18222J78375J010056
3462.1E14056435M49295j31569Q85238O61812Q47588n28794k72140P51572L08380L04489
3471.7E17332306K32315R82552N11856O8626O58035J212731R82742j6098j82457J24321
3481.4E21906929O61392N69496J407166N03349o26640R60731N46189J93443N60913
3490.1E26682968P68891M70619J24626P65839R84802J176033j43891l59382N66673
3498.7E31037178R47456J366845P76329P9956p01866P26013J724434P98339P24030
3507.4E37478714J346550Q15239n10788L31688L96004R17320J289596K18735M52614
$$ plain form
3516.1 542735672 543200493 544065056 545051193 545217743 545975227 547813568 548378601 547663345 548654594
3524.8 548654594 549902382 550730743 551139526 551655540 552347832 553059959 553725739 554039650 554900169
3533.5 554900169 555972557 558192673 559069176 558315277 559198799 559966240 561042633 561296425 561765175
3542.1 561765175 563247604 564947472 565928841 565698738 567005424 566461525 567206078 568927155 570563736
3550.8 570563736 572680473 571556091 572867546 573880882 574678345 576619148 576665916 577866096 578892174
3559.5 578892174 579788666 580052261 581457634 582383537 582410431 586694069 586731949 585497971 585488243 584860916
3569.1 584860916 588305206 589949913 591597328 593312263 594481010 595337181 596263351 597787132 598001633
3577.8 598001633 599713593 600820503 601755486 603692703 605457115 606875992 607447624 611050453 612002525
$$ packed form
3516.1E42735672M64821Q64563R86137J66550P57484J838341N65033p15256R91249
3524.8E48654594J247788Q28361M08783N16014O92292P12127O65780L13911Q60519
3533.5E54900169J072388K220116Q76503p53899Q83522P67441J076393K53792M68750
3542.1E61765175J482429J699868R81369k30103J306686n43899P44553J721077J636581
3550.8E70563736K116737j124382J311455J013336P97463J940803M6768J200180J026078
3559.5E78892174Q96492K63595J405373R25903K6894M283638L7880j233978r728o27327
3569.1E84860916L444290J644707J647415J714935J168747Q56171R26170J523781K14501
3577.8E98001633J711960J106910R34983J937217J764412J418877N71632L602829R52072
$$ plain form
3586.5 612002525 609944229 611087570 609929390 612811432 615806770 618531265 619148903 618772850 622039604
3595.2 622039604 621052284 623410873 627120743 626485329 628168144 628363724 628680649 631499367 633750191
3603.9 633750191 635817184 638759308 640322495 638321075 642086487 641287766 640129700 648315506
3611.6 648315506 649386444 646074524 649576187 648559494 652611847 657055130 656569214 657212524 655188293
3620.3 655188293 655850143 659293671 662446213 664535675 667031403 669847717 671984482 677966614
3628 677966614 674905777 662532501 669859543 675950699 680945511 681814346 680738297 683762817 687095718
3636.6 687095718 689093552 688602600 690125732 692962494 694704285 695250168 695591736 698044739 701843491
3645.3 701843491 707185745 704010086 699386597 706167145 706588669 703025665 702234650 707487564 711658249
$$ packed form
3586.5F12002525k058296J143341j158180K882042K995338K724495O17638l76053L266754
3595.2F22039604r87320K358589L709870o35414J682815J95580L16925K818718K250824
3603.9F33750191K066993K942124J563187k001420L765412p98721j158066Q185806
3611.6F48315506J070938l311920L501663j016693M052353M443283m85916O43310k024231
3620.3F55188293O61850L443528L152542K089462K495728K816314K136765N982132
3628F77966614l060837j2373276P327042O091156M994812Q68835j076049L024520L332901
3636.6F87095718J997834m90952J523132K836762J741791N45883L41568K453003L798752
3645.3G01843491N342254l175659m623489O780548M21524l563004p91015N252914M170685
$$ plain form
3654 711658249 715878372 721368713 712809601 713568192 718569717 720328827 722084427 722148285 723585434
3662.7 723585434 724484634 725291061 726538010 727557831 731598282 733639908 732658691 730588837 722608566
3671.4 722608566 726480408 735978775 745957184 745554123 721785431 724496231 734118042 739884796
3679.1 739884796 737313538 736863708 739254913 740887375 742391891 742640915 742812653 746691589 752819214
3687.8 752819214 742107468 736489182 743968124 738183823 738666000 744175110 744988327 746117783
3695.5 746117783 745894089 746008377 747758026 747521057 749226227 752790222 747391434 743930969 748245392
3704.1 748245392 749271698 749573288 750833435 754111404 758014603 748720779 752587662 758252182
3711.9 758252182 743705597 748617783 753920212 754434738 755173035 757308350 757763901 753664017 754679794
$$ packed form
3654G11658249M220123N490341q559112P58591N001525J759110J755600O3858J437149
3662.7G23585434Q99200Q06427J246949J019821M040451K041626r81217k069854p980271
3671.4G22608566L871842R498367R978409m03061k3768692K710800R621811N766754
3679.1G39884796k571258m49830K391205J632462J504516K49024J71738L878936O127625
3687.8G52819214j0711746n618286P478942n784301M82177N509110Q13217J129456
3695.5G46117783k23694J14288J749649k36969J705170L563995n398788l460465M314423
3704.1G48245392J026306L01590J260147L277969L903199r293824L866883N664520
3711.9G58252182j4546585M912186N302429N14526P38297K135315M55551m099884J015777
$$ plain form
3720.5 754679794 760265198 755490189 750169144 756074677 757509537 756599045 753231277 753357544 758145523
3729.2 758145523 759841385 765209274 760638580 752774963 763402786 763783188 750972290 750947571
3736.9 750947571 754133911 754683151 758267670 762822723 758395996 761125870 774497910 765238953
3744.7 765238953 742403488 753247147 761063843 767767944 763687744 751737061 764851074 759842911
3752.4 759842911 750249100 756816483 761779251 764408569 758463898 760809708 766875610 757547913
3760.1 757547913 755486603 760978699 762829742 762981415 766753082 764056854 758709641 761992264
3767.8 761992264 767171478 767476044 757349548 758785400 762553864 762789993 763286972 763233795 764018936
3776.5 764018936 763790588 765450516 764876022 757513199 760679855 763655243 764371262 766036530 762141571
$$ packed form
3720.5G54679794N585404m775009n321045N905533J434860r10492l367768J26267M787979
3729.2G58145523J695862N367889m570694p863617J0627823L80402j2810898k4719
3736.9G50947571L186340N49240L584519M555053m426727K729874J3372040r258957
3744.7G65238953k2835465J0843659P816696O704101m080200j1950683J3114013n008163
3752.4G59842911r593811O567383M962768K629318n944671K345810O065902r327697
3760.1G57547913k061310N492096J851043J51673L771667k696228n347213L282623
3767.8G61992264N179214L04566j0126496J435852L768464K36129M96979n3177P85141
3776.5G64018936k28348J659928n74494p362823L166656K975388P16019J665268l894959
$$ plain form
3785.2 762141571 760953445 763294220 764031601 764055481 763152618 763281097 764046173 764628601 764331131
3793.8 764331131 765590744 769415817 764989624 759469528 762014236 765992432 770255356 760309067
3801.5 760309067 751408005 758024826 761912689 766951218 771366196 757928848 754448395 761046143
3809.3 761046143 763894958 764522400 764987335 765204239 766717148 772585449 771417160 755205460 759846649
3817.9 759846649 766121368 770633011 770766296 751269608 755142288 761633987 763721008 765969009
3825.7 765969009 765426941 760823441 761322250 764110565 768236084 768914261 758316498 761523895 769513245
3834.3 769513245 763553696 762865143 770978928 760489655 755585632 764282303 757870102 758424454
3842.1 758424454 766811829 763942719 759397888 762845612 764716721 764323654 765649567 764330139
$$ packed form
3785.2G62141571j188126K340775P37381K3880r02863J28479P65076N82428k97470
3793.8G64331131J259613L825073m426193n520096K544708L978196M262924r946289
3801.5G60309067q901062O616821L887863N038529M414978j3437348l480453O597748
3809.3G61046143K848815O27442M64935K16904J512909N868301j168289j6211700M641189
3817.9G59846649O274719M511643J33285j9496688L872680O491699K087021K248001
3825.7G65969009n42068m603500M98809K788315M125519O78177j0597763L207397P989350
3834.3G69513245n959549o88553Q113785j0489273m904023Q696671o412201N54352
3842.1G58424454Q387375k869110m544831L447724J871109l93067J325913j319428
$$ plain form
3849.8 764330139 766060181 772900314 766298676 762800903 747083664 750859528 761890030 761818695
3857.5 761818695 760663757 762458191 764986877 768798599 763972473 763490677 769292831 761224976
3865.2 761224976 755698090 760463715 766365356 773050156 764330444 753787994 758255692 765977478
3872.9 765977478 769686356 758044891 759229126 763323822 763250046 765669479 770870514 765453033
3880.6 765453033 755948792 761596756 762992096 764712677 768875580 754161377 757512283 763231354
3888.3 763231354 764012527 768239441 766359024 756799774 758975220 762798004 761943512 763726501 765098495
3897 765098495 766599503 766976471 756139450 761312561 763668137 758560867 764626923 760648346 757840729
3905.7 757840729 759208832 760441132 763129425 763167725 763179779 762729034 762862778 763237305 762575989
$$ packed form
3849.8G64330139J730042O840133o601638l497773j5717239L775864J1030502p1335
3857.5G61818695j154938J794434K528686L811722m826126m81796N802154q067855
3865.2G61224976n526886M765625N901641O684800q719712j0542450M467698P721786
3872.9G65977478L708878j1641465J184235M094696p3776K419433N201035n417481
3880.6G65453033r504241N647964J395340J720581M162903j4714203L350906N719071
3888.3G63231354P81173M226914j880417r559250K175446L822784q54492J782989J371994
3897G65098495J501008L76968j0837021N173111K355576n107270O066056l978577k807617
3905.7G57840729J368103J232300K688293L8300J2054m50745J33744L74527o61316
$$ plain form
3914.4 762575989 764051361 765828400 761876602 758944397 763794632 763577042 758714218 761111526
3922.1 761111526 763408127 764208832 761044159 757914581 760136871 761876831 763101578 761837387
3929.8 761837387 761918106 764493103 760952454 759007187 760295639 760611343 762225800 763025894 761899338
3938.5 761899338 761335068 761481323 763524399 764892654 760355606 758910065 759937439 760889282 762308884
3947.2 762308884 760344620 760929642 761714783 759751816 760882034 761424637 761060562 760746994 761004562
3955.8 761004562 761245804 760350113 761129761 761541519 761905975 761449814 759763641 760762253 761334534
3964.5 761334534 761348801 761593781 761439362 762012177 760920563 759526062 760286713 760842056 760605164
3973.2 760605164 760605698 760861359 760800705 761030197 761756744 761660080 761133728 760681534 760225525 760024261
$$ packed form
3914.4G62575989J475372J777039l951798k932205M850235k17590m862824K397308
3922.1G61111526K296601Q00705l164673l129578K222290J739960J224747j264191
3929.8G61837387Q0719K574997l540649j945267J288452L15704J614457Q00094j126556
3938.5G61899338n64270J46255K043076J368255m537048j445541J027374R51843J419602
3947.2G62308884j964264N85022P85141j962967J130218N42603l64075l13568K57568
3955.8G61004562K41242q95691P79648M11758L64456m56161j686173R98612N72281
3964.5G61334534J4267K44980j54419N72815j091614j394501P60651N55343k36892
3973.2G60605164N34K55661o0654K29492P26547r6664n26352m52194m56009k01264
$$ plain form
3982.8 760024261 760762482 761495590 760666122 760483856 760390625 760046692 760912247 760811462 760483704 760332642
3992.5 760332642 760263596 760862122 760556030 760453110 760548630 759930573 759711456 760387192
4000.2 760387192
$$ packed form
3982.8G60024261P38221P33108q29468j82266r3231l43933Q65555j00785l27758j51062
3992.5G60332642o9046N98526l06092j02920R5520o18057k19117O75736
4000.2G60387192
##END=$$ End of the data block
