##TITLE=$$ Begin of the data block
##JCAMP-DX=5.00 $$ ACD/SpecManager v 10.08
##SPECTROMETER/DATA SYSTEM=Varian
##DATE=18 Dec 2012 13:49:04
##DATA TYPE=INFRARED SPECTRUM
##DATA CLASS=XYDATA
##ORIGIN=
##OWNER=
##NPOINTS=3735
##FIRSTX=399.26403809
##LASTX=4000.35498047
##MAXX=4000.35498047
##MINX=399.26403809
##MAXY=83.52413177
##MINY=33.28009033
##XFACTOR=1.0000000000
##YFACTOR=0.000000100000000
##FIRSTY=69.72893524
##DELTAX=0.96440572
##XUNITS=1/CM
##YUNITS=TRANSMITTANCE
##XYDATA=(X++(Y..Y))
399.3F97289352K659684l039017k058334P004623J2304764Q068237N848389l977738
407G24099960j1623382k158966n026017o38580P699814Q932037J128846j3346711k362289
415.7G06704712N888138J078186p235642j2907791N353165N974045M770279Q21228
423.4G10446320m21677k977524M42505N667877j827545m905930m420852l736649J736527
432.1G00003052L688202r04694l003845K813568M612503p06711j426239j225509n174866
440.7F98675461q28400L824463l9749L52936R32388N233383l637619o643829J513901
449.4F99382935q51517J301269K065277j706619j728515j816254j029205j510544R70840
458.1F95077667l701629m746323l04031K008438J569748j663971R71985K405471l232040
$$ y = [697289352, 699949036, 696910019, 694851685, 701856308, 714161072, 722229309, 728077698, 724099960, 712476578, 710317612, 705291595, 704653015, 712352829, 721284866, 722413712, 709067001, 706704712, 712592850, 713671036, 706435394, 693527603, 698880768, 704854813, 709625092, 710446320, 710024643, 707047119, 707489624, 713157501, 711329956, 706424026, 702003174, 698266525, 700003052, 703691254, 702786560, 699782715, 702596283, 707208786, 706502075, 705075836, 703850327, 698675461, 697847061, 701671524, 701631775, 701984711, 702917099, 708150482, 704512863, 697869034, 699382935, 698531418, 699832687, 701897964, 700191345, 698462830, 696646576, 695617371, 694106827, 695077667, 691376038, 686629715, 686325684, 688334122, 689903870, 688239899, 689211884, 691617355, 688385315]
466.8F88385315j445999j934891k151184P763672O372681o040421n502319N93948L531952
475.5F89572754K60849l540878j408997M009857M540100l15170L191376j016083p520523
484.1F87773285j310730K467804J490555l309326Q6441K537765J678925j00403m468994
492.8F86845322K703552M34189l566056J568222P39518J055908J548996l17764j619492
501.5F89392395j10474J086502k34298j358109m135971j965790J767807r67331k130432
510.2F81344299J939545K024689l044815k990265j024399O72073K2736j082993J494294
518.9F79355164j611329l356399j265488j01547R58710J474762M31823k688827j383438
527.5F71813431n83801Q58154K44674k314682L98179J073608O32629N19181l87040
$$ y = [688385315, 686939316, 685004425, 682853241, 690616913, 696989594, 690949173, 685446854, 686040802, 689572754, 689833603, 686292725, 684883728, 688893585, 693433685, 693118515, 696309891, 695293808, 687773285, 686462555, 688930359, 690420914, 687111588, 687198029, 689735794, 691414719, 691314316, 686845322, 689548874, 689983063, 686417007, 687985229, 688724747, 689780655, 691329651, 691011887, 689392395, 689281921, 690368423, 690134125, 688776016, 684640045, 682674255, 684442062, 683474731, 681344299, 683283844, 685308533, 682263718, 679273453, 678249054, 678921127, 678943863, 677860870, 679355164, 677743835, 674387436, 673121948, 673020401, 673979111, 675453873, 675885696, 673196869, 671813431, 671229630, 672087784, 672332458, 670017776, 670415955, 671489563, 672122192, 672641373, 672254333]
536.2F72254333j287536p18994L176880J765823j808777j690750k023621o91223J681443
544.9F70657578P51037K79389K749176R65805n59616R07440k89688p73926l1891j80969
554.5F74474335j066132j125641m32281M48456J209182R86862J471863q1100q19397
563.2F75066147J329117K27508Q087p09762l223038j411514R92M77829K429351J465455
572.9F75660172j90278n0811j857834l276062o7063P77893j033020l89022N64575O49261
582.5F70787811J343308J342239J559677J06201j366653j402359j536636Q1176N52140
591.2F71466904q1940R5596j73950Q65555j42212j638489M77829O58264j518249k819367
600.8F67189941l141632k555008l462371m157868k153168l001098m742279n085869
$$ y = [672254333, 670966797, 670247803, 673424683, 675190506, 673381729, 671690979, 669667358, 668976135, 670657578, 671408615, 671688004, 674437180, 675402985, 674843369, 675750809, 675461121, 674687195, 674655304, 674474335, 673408203, 672282562, 671850281, 672298737, 673507919, 674494781, 675966644, 675885544, 675066147, 676395264, 676622772, 676630859, 675921097, 672698059, 671286545, 671287537, 671765366, 674194717, 675660172, 675469894, 675419083, 673561249, 670285187, 670218124, 670996017, 669962997, 669573975, 670138550, 670787811, 672131119, 673473358, 675033035, 675139236, 673772583, 672370224, 670833588, 670914764, 671466904, 671384964, 671480560, 671306610, 672172165, 672029953, 670391464, 670869293, 671527557, 670009308, 667189941, 664048309, 661493301, 658030930, 653873062, 651719894, 648718796, 643976517, 638890648]
608.5F38890648o450653q537865j1782493j2148438j1130371q376961n754089m422379
616.3E70287399j604118O52428P76558m042473n207520n101509n504265k928200O72074
624.9E48000374P278290J0145988J2268829J2786522J2231179R834709N129013J551781
632.7F19226685j686402k799492m565963n621262o293030m155464K66457J734123P535782
641.3F03641434J2083893J3353652J3383637J1541138R237594R009705O704559L167420
649F82123032K763977K772445K144394R39942k9755J585312K816849J401062J221008
657.7F97738266J438599P56607j20163j02921Q54340K45361O43997J879731K290573
666.4G05624390j141968j3156052O314469O167602K566300M95376o64139K94114J198577
$$ y = [638890648, 632439995, 623902130, 612119637, 599971199, 588840828, 580463867, 574709778, 570287399, 568683281, 569335709, 570112267, 566069794, 560862274, 555760765, 550256500, 547328300, 548000374, 555278664, 565424652, 577693481, 590480003, 602711182, 612545891, 617674904, 619226685, 617540283, 614740791, 610174828, 604553566, 598260536, 594105072, 594371529, 596105652, 603641434, 615725327, 629078979, 642462616, 654003754, 663241348, 672251053, 678955612, 682123032, 684887009, 687659454, 689803848, 690743790, 690714035, 692299347, 695116196, 696517258, 697738266, 699176865, 699933472, 699813309, 699710388, 700564728, 700810089, 701454086, 703333817, 705624390, 704482422, 691326370, 697640839, 703808441, 706374741, 706870117, 706205978, 706500092, 707698669]
675.1G07698669J064301O31561R43833K26059J907J229629J010437L77961o22177n51072
684.7G12011108l80783j673736j638642m73022n71594j127777m69895o64367r16520
693.4G04094772p52945j808624k064896j207733k65426l96424m16488n80597j600495
702.1F95001144L434O05468j29928J364898J958619J287613J127014J826935J080627
710.8G04125824O67419K090607J934128J091461N60150J441880K385559J448974J316223
719.5G17062225J328736J486511J283111P70569R40323m62570p44629l39737R5368
728.1G21419907P06558j105576j969757j347351j19705L02734j86996J14517L26080
736.8G18140411L68119p01752j021271j84631N59616P04575O06002J477814J436615
$$ y = [707698669, 708762970, 709394531, 710338364, 710564423, 710566330, 711795959, 712806396, 713184357, 712562180, 712011108, 711630325, 709956589, 708317947, 707844925, 707273331, 706145554, 705675659, 705011292, 704094772, 703341827, 701533203, 699468307, 698260574, 697995148, 697598724, 697182236, 696601639, 695001144, 695004578, 695610046, 695480118, 696845016, 698803635, 700091248, 701218262, 703045197, 704125824, 704793243, 706883850, 708817978, 709909439, 710469589, 711911469, 714297028, 715746002, 717062225, 718390961, 719877472, 721160583, 721931152, 722871475, 722408905, 721664276, 721324539, 721419907, 722126465, 721020889, 719051132, 717703781, 717584076, 717886810, 717699814, 717814331, 718140411, 718508530, 717806778, 716785507, 716600876, 717160492, 717865067, 718471069, 719948883, 721385498]
745.5G21385498J759415K084198K247848K220688Q32520J769409K728958K461624J929474
754.2G39419632J709747K752610K214508J346283J504211J914825N85175o44836K6092
762.8G50828247L86658r1782p99484j89285k95487r12704m25797O84891l28369j036606
772.5G47820282J581802J137238R60235J794663J054687J491471P99789R53675J903457
781.2G59497299K059021J360932J141815J652374J596909J526413j38627l65829r5444
789.9G68234863k18429K16522J88446O47125R31168R73282o10123p33719M20990N57175
799.5G70607300O03332N5161j058960j566086J172562J037597q41980o12335L47138
808.2G69743729J286392l52478N35736M68597k07367K02408r06906R17664J386795
$$ y = [721385498, 723144913, 725229111, 727476959, 729697647, 730530167, 732299576, 735028534, 737490158, 739419632, 741129379, 743881989, 746096497, 747442780, 748946991, 750861816, 751446991, 750802155, 750828247, 751214905, 751123123, 750323639, 750134354, 749838867, 748926163, 748500366, 749185257, 748856888, 747820282, 749402084, 750539322, 751499557, 753294220, 754348907, 755840378, 756640167, 757593842, 759497299, 761556320, 762917252, 764059067, 765711441, 767308350, 768834763, 768696136, 768330307, 768234863, 768016434, 768232956, 768421402, 769068527, 769999695, 770972977, 770362854, 769629135, 770050125, 770607300, 771210632, 771265793, 770206833, 768640747, 769813309, 770850906, 770008926, 769396591, 769743729, 771030121, 770677643, 771213379, 771681976, 771474609, 771677017, 770770111, 771687775, 773074570]
816.9G73074570K30560j238556p20901R80453L32184J42975p37686p30973o92978o26525
826.5G70013123j424790k410431j195068j517029j852722k210007k251282k106933
834.2G55044861k750626l968658m240113k349243k208862k493973k808609k924118
841.9G31300659j909332j310349q74023r29871k00805j26801l20740M46091M32510
850.6G26507339J777649L010712J950150J296768K996979M311599L075638J471787
858.3G46398621J775207L235321K482071J501312J621399J808701J012039N51758J248092
867G61634521J111756J058044k01721L59802R95789L87955O19201j06430J014557K80151
876.7G67153625n02319L3112o64368q56934j563720j084748j894531k653885k268905
$$ y = [773074570, 773305130, 772066574, 771345673, 772326126, 772658310, 772801285, 772063599, 771332626, 770639648, 770013123, 768588333, 766177902, 764982834, 763465805, 761613083, 759403076, 757151794, 755044861, 752294235, 748325577, 744085464, 741736221, 739527359, 737033386, 734224777, 731300659, 729391327, 728080978, 727206955, 726277084, 726076279, 725949478, 725628738, 726074829, 726507339, 728284988, 731295700, 733245850, 734542618, 737539597, 741851196, 744926834, 746398621, 748173828, 751409149, 753891220, 755392532, 757013931, 758822632, 759834671, 760386429, 761634521, 762746277, 763804321, 763602600, 763962402, 764958191, 765346146, 765965347, 765858917, 766873474, 767153625, 766651306, 766684418, 766020050, 765163116, 763599396, 762514648, 760620117, 757966232, 755697327]
885.3G55697327j822434q41217j428070j627884j349869k32238R2773k83813J003494
894G49208069L44391l15094O40564M06570j62353K36282M65774K22626j64795k2659
903.7G50859375j65863j223068j283875k416229k278137j257324k335206k196655k527847
912.3G35175171k945480j783219j529541l184967m179459l293838k312241k072830
920G13873596k542648j779099j257248k657470l160935k260360j121521r24912j810837
928.7F96358566j457596K0752P96357Q32519O88095R39331J400070K228241K841340
937.4G04647675K604446K860947L382339L242874L620987L229752K140579K576218
945.1G28305817L069992K091827J285935K461929K705231J885376J204147J00479l13415
$$ y = [755697327, 753874893, 753033676, 751605606, 749977722, 748627853, 748395615, 748488388, 748204575, 749208069, 749552460, 749237366, 749877930, 750284500, 750122147, 750358429, 750824203, 751046829, 750882034, 750859375, 750693512, 749470444, 748186569, 745770340, 743492203, 742234879, 739899673, 737703018, 735175171, 732229691, 730446472, 728916931, 725731964, 721552505, 718258667, 715946426, 713873596, 711330948, 709551849, 708294601, 705637131, 702476196, 700215836, 699094315, 698169403, 696358566, 694900970, 694921722, 695718079, 696550598, 697238693, 698178024, 699578094, 701806335, 704647675, 707252121, 710113068, 713495407, 716738281, 720359268, 723589020, 725729599, 728305817, 731375809, 733467636, 734753571, 737215500, 739920731, 741806107, 743010254, 743110733, 742797318]
953.8G42797318m68827o59332j317902j816864j400451n72815j078644k014771k384262
962.5G31083450l040313k767182k639999k158127j900024k506867j868057r29642l29895
971.2G12943344l09753q44117p91778n17654j092377j547165r74960m77906l99780
979.8G05987854j188812j627503j227188j461487j519088j721115k045823j902160
987.6F93294678k755280l632049l747101m025345m641647o929398r490280j1319656
995.3F46753922q696747J529808R397926R217224N038452K166901n6305r39331j69525
1004F64242325m69132m79736q12073j083908r31396q56476q68607j575546j077042
1012.6F56088409j573181l072128l070984k031937j614608k599182k624207j895866
$$ y = [742797318, 742328491, 741669159, 740351257, 738534393, 737133942, 736561127, 735482483, 733467712, 731083450, 728043137, 725275955, 722635956, 720477829, 718577805, 716070938, 714202881, 713273239, 712943344, 712633591, 711789474, 710997696, 710480042, 709387665, 707840500, 706865540, 706387634, 705987854, 704799042, 703171539, 701944351, 700482864, 698963776, 697242661, 695196838, 693294678, 690539398, 686907349, 683160248, 679134903, 674493256, 667563858, 658073578, 646753922, 638057175, 639586983, 648984909, 658202133, 663240585, 665407486, 665351181, 664411850, 664242325, 663773193, 663293457, 662481384, 661397476, 660466080, 659609604, 658740997, 657165451, 656088409, 654515228, 651443100, 648372116, 646340179, 644725571, 642126389, 639502182, 637606316]
1020.3F37606316j437607j759491k197724k579536k045746j980629l116264j837349
1028.1F20651970j406670k744865l445282k218247j416664j353912j044235k768593
1035.8F04253502j603088j114731j586991n80406j004791j139832j197967K60773o49
1044.5E96285820m59709k11106K54059J757927Q73032K90108o46706j94168N54581
1053.1E98503838k90032n24826k13051K62795o67572M05960L59421o92673j179657
1061.8E95964203j718178j192474j543923k65312q58574o02951Q6289j30616M62952
1070.5E90201416j770363o59981l85856j140709k70424r72633j211510r46350j50490
1079.2E82693100j207008n94178K09465m98848q63647n16663n33180k819061k275124
$$ y = [637606316, 636168709, 634409218, 632211494, 629631958, 627586212, 625605583, 622489319, 620651970, 619245300, 616500435, 613055153, 610836906, 609420242, 608066330, 607022095, 604253502, 602650414, 601535683, 599948692, 599368286, 598363495, 597223663, 596025696, 596286469, 596285820, 595826111, 595615005, 595869064, 597626991, 598500023, 598790131, 598143425, 597949257, 598503838, 598213806, 597688980, 597475929, 597738724, 597071152, 597477112, 597836533, 597143860, 595964203, 594246025, 593053551, 591509628, 591244316, 590385742, 589782791, 589869080, 589738464, 590201416, 588431053, 587771072, 587385216, 586244507, 585974083, 585001450, 583789940, 582843590, 582693100, 581486092, 580891914, 581101379, 580602531, 579738884, 579222221, 578689041, 575869980, 573594856]
1087.9E73594856k690353l384857m063607m877853m287491o953697p750626q185463
1095.6E31400909p492332q532486r103203o953163r082184q759765q993340p985725
1103.3D64498711r762917r993629p964173r458809o788063q624916p061271p526932
1111C97318001p517929m781876n664596k633133l735695j247750j063881J37978J209450
1119.7C72020569n21164J633873N41000K968445J214218J145935O89087l77884J296158
1128.4C80610237j033630P59811j171036j616096k911186k523194j438636l998604
1136.1C66677666j248551l114013j836968k470169k011986q04367l058204j322709
1143.8C50810699m058876k581100k687454k017823j499595k224884r50508j989556
$$ y = [573594856, 570904503, 567519646, 563456039, 558578186, 554290695, 547336998, 539586372, 531400909, 523908577, 515376091, 506272888, 499319725, 490237541, 481477776, 472484436, 464498711, 454735794, 444742165, 436777992, 427319183, 420531120, 411906204, 404844933, 397318001, 389800072, 385018196, 379353600, 376720467, 372984772, 371737022, 370673141, 370811119, 372020569, 371499405, 373133278, 373674278, 376642723, 377856941, 379002876, 379691963, 379314079, 380610237, 379576607, 380336418, 379165382, 377549286, 374638100, 372114906, 370676270, 366677666, 365429115, 362315102, 360478134, 358007965, 355995979, 355191612, 352133408, 350810699, 346751823, 344170723, 341483269, 339465446, 337965851, 335740967, 334790459, 332800903]
1151.5C32800903J446648p01485J081543J413422K09732K073059J152687L806038J116257
1160.2C44398804K985191L264313L198967M466781L320198O370011M793091O121673
1167.9C78919029N524445O544037P492141O825104Q053017N972671Q386650P483902
1175.6D35200996Q145295P667541O583328P920647O416817Q043441O308785O076775
1183.3D92363625N267448N005188O214485M709892N302659M183158N042344M179115
1191E32267914L697090M093933L165093M264221L786583M906006M562950M665298M468765
1199.7E69877853L914376M569168L414612M117355L736801L559723L162804L352012
1207.4E99704704L288079K048530L461037K825546K456513K108230K092247K568817
$$ y = [332800903, 334247551, 333546066, 334627609, 336041031, 336250763, 338323822, 339476509, 343282547, 344398804, 347383995, 350648308, 353847275, 358314056, 361634254, 368004265, 372797356, 378919029, 384443474, 390987511, 398479652, 405304756, 413357773, 419330444, 427717094, 435200996, 443346291, 451013832, 457597160, 465517807, 471934624, 479978065, 486286850, 492363625, 497631073, 502636261, 508850746, 513560638, 518863297, 523046455, 528088799, 532267914, 535965004, 540058937, 543224030, 547488251, 551274834, 556180840, 560743790, 565409088, 569877853, 573792229, 578361397, 581776009, 585893364, 589630165, 593189888, 596352692, 599704704, 602992783, 605041313, 608502350, 611327896, 613784409, 615892639, 617984886, 620553703]
1215.1F20553703J688767J482010L60679R51805J050797Q32367J046295N62744R42307
1223.8F29471474L46641O53420N08613K82212L27072K14462K66914K82402J348992
1232.5F33702202N31616O14662P38335J66092P85789R30558Q49037N5465O29006P43828
1242.2F39746590O56852K75040j27945Q99506K43911O01655J84860j16272O62460K16980
1251.8F43243637N69687L58582J56021p8888M71039M77066K02026R89685M68826N87158
1261.4F47444839N77622N52292O24924O95800P62940P58667J186599P66068J212692
1270.1F54582443J209946J306305J442489J488190J891174R73511J295777J560516
1277.8F65750351J477890J683807K046891K162704J484070J889267K199859K136841
$$ y = [620553703, 622242470, 623724480, 624085159, 625036964, 626087761, 626920128, 627966423, 628529167, 629471474, 629818115, 630471535, 630980148, 631262360, 631589432, 631803894, 632070808, 632353210, 633702202, 634233818, 634848480, 635586815, 635752907, 636538696, 637469254, 638318291, 638373756, 639002762, 639746590, 640403442, 640678482, 640550537, 641450043, 641693954, 642295609, 642480469, 642364197, 643026657, 643243637, 643813324, 644171906, 644327927, 644249039, 644720078, 645197144, 645399170, 646388855, 646857681, 647444839, 648022461, 648574753, 649199677, 649895477, 650658417, 651417084, 652603683, 653369751, 654582443, 655792389, 657098694, 658541183, 660029373, 661920547, 662894058, 664189835, 665750351, 667228241, 668912048, 670958939, 673121643, 674605713, 676494980, 678694839, 680831680]
1285.5F80831680J398545J050415J356506J502151J860810J666488K086106K044220
1293.3F93796921J998901K079544J230087J166840J216049R59397J074218R50852O44302
1301.9G05117111O73599Q40455J378936J702195J065902O62689P64924P79418K95640
1310.6G13280869l6011J54571L55835M56925Q89587J204224O78329N70526P44400P24945
1320.3G19024200O66581J66931L42865N07660K60467N87464P52487O76803N80979M92935
1329.9G24059372N77316M27170J72424J4420k62299q58307q22830K1057k32849l70712
1339.6G22724762O4621R18884J039582M86068M75922o333k44751n00946r41238q52661
1349.2G23163910o41174K53067n6229l93066J25427K27127J68152J85013j82343p78885
$$ y = [680831680, 682230225, 683280640, 684637146, 686139297, 688000107, 689666595, 691752701, 693796921, 695795822, 697875366, 699105453, 700272293, 701488342, 702447739, 703521957, 704472809, 705117111, 705790710, 706631165, 708010101, 709712296, 710778198, 711440887, 712205811, 712985229, 713280869, 713244858, 713399429, 713755264, 714212189, 715101776, 716306000, 716984329, 717554855, 718299255, 719024200, 719690781, 719857712, 720200577, 720708237, 720968704, 721556168, 722308655, 722985458, 723566437, 724059372, 724636688, 725063858, 725236282, 725250702, 724988403, 724130096, 723307266, 723328323, 723095474, 722724762, 722789383, 723708267, 724747849, 725233917, 725709839, 725703506, 725458755, 724957809, 724016571, 723163910, 722522736, 722775803, 722719574, 722326508, 722451935, 722679062, 722847214, 723032227, 722849884, 722070999]
1358.8G22070999j51062r67178j221924n04761j516113P82242N25970m62570J5183
1367.5G18570786p52869n51300k80533j198273r60769q72879k060013j291657J66931
1376.2G10769424L15705R3689M57000M87214p477j14517j038895j308365l25851J019668
1385.8G10347595R01566j619110M81567J771927J166916M92019K85569R97696r21173
1394.5G13904572k746659o05392k66114n48095k527085j86233J089935O0120N06439
1403.2G08681488L55377j568680p99560J35040o37207m19617n42068r10492n27649
1411.9G03766632j52512L57285J52512J46713j18561j12076N30625l672409N62744
1420.6G01460953K490539N29099o94428j102829J303940J598435M95300R13620K60696
$$ y = [722070999, 721919937, 720952759, 719730835, 719226074, 717709961, 718492203, 719018173, 718555603, 718570786, 717817917, 717266617, 716986084, 715787811, 714827042, 713954163, 711894150, 710602493, 710769424, 711085129, 711178818, 711635818, 712123032, 712115555, 712001038, 710962143, 709653778, 709327927, 710347595, 711249161, 709630051, 710111618, 711883545, 713050461, 713542480, 713828049, 714825745, 713904572, 711157913, 710552521, 710286407, 709738312, 707211227, 707024994, 708114929, 708175049, 708681488, 709036865, 707468185, 706668625, 706803665, 706166458, 705746841, 705204773, 704294281, 703766632, 703614120, 703971405, 704123917, 704270630, 704152069, 704039993, 704570618, 700898209, 701460953, 703951492, 704480591, 703786163, 702683334, 703987274, 705585709, 706081009, 706994629, 707255325]
1429.2G07255325n74722R46732J095123m1504P1793J455917O58951l904495J506652
1437.9G08469772L295136J236496Q20007J069260P5989L20282J83410L20893O57272
1446.6G16448517q15964j619491J598281J782151J68304L32337O82067O97480j2436
1455.3G19261246k04239j327439k286834K447433K198868K866592J799393J175995
1463G25931015J602554k378158Q39844K556152J708298J135025Q13140J930695l64838
1471.7G33773727k938766N07889M607544M126053k76108K184295L317643J488494J138459
1480.3G47929230M5471Q3389Q64029P36618N61295M13894q26492p49054Q21076k872010
1490G47007446p87506K438431J398087m7913j01318j31531n458985J659394K41165
$$ y = [707255325, 706680603, 707627335, 708722458, 708680954, 708752747, 710208664, 710867615, 706963120, 708469772, 711764908, 713001404, 713821411, 714890671, 714966660, 715286942, 715470352, 715791245, 716448517, 715632553, 714013062, 715611343, 717393494, 717561798, 717894135, 718576202, 719273682, 719261246, 719057007, 717729568, 715442734, 717890167, 720089035, 722955627, 724755020, 725931015, 727533569, 725155411, 725995255, 728551407, 730259705, 731394730, 732207870, 734138565, 733773727, 730834961, 731342850, 735950394, 740076447, 739800339, 741984634, 745302277, 746790771, 747929230, 747974701, 748058090, 748922119, 749658737, 750220032, 750633926, 749807434, 749058380, 749879456, 747007446, 746219940, 748658371, 750056458, 750008545, 749907227, 749775696, 744316711, 745976105, 746217270]
1498.7G46217270k468720J032715l71628m43725k48718O65130m68292j0200653q239212
1507.3G25474167K888641L973770N01633J994782j312409k651214Q08181j301422n99289
1516G29776840l052139l199387L311234K358246l214951m921875P55539K164154K183533
1524.7G26161194k679520o06842j77612k427521O40259R05075l56674j088639k577667
1533.4G17792053m078979K486419J914902Q89053J692429n956116r734649M647979
1541.1G09653091K238617k205505J696472N99823q77151L412780J298676R34906j299210
1549.8G15452499k428207K504578J460189J367417l455582M35257M482041L777847
1557.5G23596039J739731j6092911M343185O038590L283691J361313P7362j271744
$$ y = [746217270, 743748550, 744781265, 744409637, 743965912, 743717194, 744382324, 743914032, 733713379, 725474167, 728362808, 732336578, 732838211, 734832993, 733520584, 730869370, 731677551, 730376129, 729776840, 726724701, 723525314, 726836548, 729194794, 725979843, 721057968, 721813507, 723977661, 726161194, 723481674, 722874832, 722697220, 720269699, 720909958, 721815033, 721458359, 720369720, 717792053, 713713074, 716199493, 718114395, 719003448, 720695877, 714739761, 705005112, 709653091, 711891708, 709686203, 711382675, 711982498, 711105347, 714518127, 715816803, 716751709, 715452499, 713024292, 715528870, 716989059, 718356476, 714900894, 715336151, 719818192, 723596039, 725335770, 709242859, 713586044, 719624634, 722908325, 724269638, 724347000, 723075256]
1565.2G23075256j67312J444092R83657j90429n442505K275314K362900J83792O86951
1573.9G25211716Q36410r77783r948730K983398K338943m52270j036682j962052m77371
1582.6G16515579j229400p73697j161881j610718j157989j945114j022492j985168
1590.3G05629120j571961k367172j662140j710663k618408r52301k031479j221008
1598F91493988k120819j504822k182236k856979j913452l193665j262436k073135j546249
1606.7F72840195k520066k100525j616134k287979l82920k772979k022248k645416
1614.4F56491928n87158j623764j1045990K463760K04392j42441j937866K41241j079407
1623.1F42984695p095375K17209q62770j27258m631195k292977J80436j098900m46778
$$ y = [723075256, 722907944, 724352036, 725335693, 725145264, 719702759, 721978073, 724340973, 724524765, 725211716, 726048126, 725070343, 715121613, 718105011, 720443954, 719991684, 718955002, 716992950, 716515579, 715286179, 714512482, 713350601, 711739883, 710581894, 708636780, 707614288, 705629120, 704057159, 701689987, 700027847, 698317184, 695698776, 694746475, 692714996, 691493988, 689373169, 687868347, 685686111, 682829132, 680915680, 677722015, 676459579, 674386444, 672840195, 670320129, 668219604, 666603470, 664315491, 663932571, 661159592, 659137344, 656491928, 655904770, 654281006, 643235016, 645698776, 645903168, 645760727, 643822861, 644064102, 642984695, 635889320, 636106529, 635243759, 635116501, 630485306, 628192329, 628372765, 627273865, 626827087]
1631.7F26827087j731681R13848r15n942192k546196N80826M59289M04396K62146j421814
1641.4F17804794R44596o36673J218071J452713l846207j215286j462555M586334K165527
1650.1F21011314K905960L270607o90231q738594J209946N039520K308807K595215
1657.8F28912544J246758J598434K074280J835632J645737r37271L532524K027702
1665.5F41936340K000351K341233R53216n41153J176605M181061J172104L962860M433136
1674.2F61615753J072846n72815L088379L770904K013397K428360L26157L323975M878387
1682.9F81945343k197571l996963O046753P034835L719178K152939K958221J762619
1690.6F99425354K499771K288437L114548L957672L457031l970718L680649O259994
$$ y = [626827087, 625095406, 626009254, 626008339, 620066147, 617519951, 618100777, 618560066, 618964462, 619226608, 617804794, 618749390, 618112717, 619330788, 620783501, 616937294, 615722008, 614259453, 618845787, 621011314, 623917274, 627187881, 626497650, 617759056, 618969002, 624008522, 626317329, 628912544, 630159302, 631757736, 633832016, 635667648, 637313385, 636376114, 639908638, 641936340, 643936691, 646277924, 647231140, 646689987, 647866592, 652047653, 653219757, 657182617, 661615753, 662688599, 662115784, 665204163, 668975067, 670988464, 673416824, 673742981, 677066956, 681945343, 679747772, 675750809, 681797562, 688832397, 692551575, 694704514, 697662735, 699425354, 701925125, 704213562, 707328110, 711285782, 714742813, 710772095, 714452744, 720712738]
1698.3G20712738N356445J175309m545670P566681M818497K687301K320099K245789
1706G42337189J210937L128968M518356J670456Q60824K455597K239228K506866j71585
1714.7G60756836j71509L449478R80530o031570M202957M416351K112885J466980L65219
1723.4G71548157O1722J595764J214981O28128O91528Q93707j886215m24270L630371
1732G77953873K432785l875046n441208N788422L998947J042023K435913j060868k917480
1740.7G80357361L626556K193909j002731N15976K986984K187805J236038K94037m7150
1749.4G92348785M097062J44729j569671L703765K237320J990815J893539j586838
1757.1H03259506Q56476K005997J878509K409592k848587n57022K943039J049423N13306
$$ y = [720712738, 726069183, 727244492, 722698822, 730265503, 735084000, 737771301, 740091400, 742337189, 743548126, 746677094, 751195450, 752865906, 753726730, 756182327, 758421555, 760928421, 760756836, 760585327, 764034805, 765015335, 758983765, 763186722, 767603073, 769715958, 771182938, 771548157, 771609879, 773205643, 774420624, 775048752, 775740280, 776633987, 774747772, 774323502, 777953873, 780386658, 776511612, 771070404, 776858826, 780857773, 781899796, 784335709, 783274841, 780357361, 783983917, 786177826, 785175095, 785691071, 788678055, 790865860, 792101898, 792395935, 792348785, 796445847, 796590576, 795020905, 798724670, 800961990, 802952805, 804846344, 803259506, 804115982, 806121979, 808000488, 810410080, 807561493, 807004471, 809947510, 810996933, 811510239]
1765.8H11510239J108780N09033l245011J939392L717881p11136m402008r54209M968415
1774.5H14441376J731796j470490J732407M71420O52619l4561j341553J284103J968308
1783.2H19435425J081085j234589j15661J529236M79507K67181R29184o38733r20104
1791.8H20812531k397233J76545L538665L50647j259918J184311J832199l08227j699753
1800.5H22229767J397629q23441k7847J800079L20358L38059p172j19323Q57620M88586
1810.2H26454315j633224L1967J083298N22995P21893j8387K91138k74201L63617Q13904
1819.8H28357315j66397N00336k87400M73709J88218l076554M41895K211914J820984
1828.5H30464020n79300m525833J477050K768021J31531J48773O96030N0506o62841
$$ y = [811510239, 812619019, 813128052, 809883041, 811822433, 815540314, 814829178, 810427170, 809472961, 814441376, 816173172, 814702682, 816435089, 816906509, 817559128, 817524567, 816183014, 817467117, 819435425, 820516510, 819281921, 819166260, 820695496, 821175003, 821442184, 822371368, 821732635, 820812531, 818415298, 818591843, 822130508, 822481155, 821221237, 822405548, 824237747, 823929520, 822229767, 823627396, 822803955, 822776108, 824576187, 824896545, 825234604, 825227432, 825108109, 825965729, 826454315, 824821091, 824853058, 825936356, 826459351, 827181244, 827162857, 827453995, 827179794, 827543411, 828357315, 828190918, 828691254, 828403854, 828877563, 829065781, 825989227, 826431122, 828643036, 830464020, 829884720, 825358887, 826835937, 829603958, 829735489, 829884262, 830580292, 830630798, 829967957]
1837.2H29967957l18985O95419j2131M61655n2185R80835N02395n550155K112961K626037
1846.8H31413803l89328p08465O68640R13086k60086K73666L51562L46909J03989O3247
1856.4H32777023K14386m61960K68479K74200J47553j56403J7929N7678l89404K13928
1866.1H32963409P4768K97852k105026j704254K107010J707305M79050j68762j25580
1874.8H33525772j21612K77175J5488K31934M11758k08893J48392j85699K93426j18561
1884.4H34269180k68783L15475j60904Q71659o72379k005615J129989J290207J83640
1893.1H34952469J58005o20041j202622O48194M22210K8763K19498j72272j07574j96991
1902.7H34129639J68228J31531M64096K69699m97513m44794l24707n21393q5067J000671
$$ y = [829967957, 829648972, 830344391, 830332260, 830793915, 830741730, 831722565, 832224960, 826674805, 828787766, 831413803, 831024475, 830316010, 830984650, 831897736, 831637650, 831911316, 832262878, 832609787, 832713776, 832777023, 832991409, 832529449, 832797928, 833072128, 833219681, 833063278, 833081207, 833138885, 832749481, 832963409, 833038177, 833336029, 831231003, 829526749, 831633759, 833341064, 833820114, 833651352, 833525772, 833404160, 833681335, 833696823, 833928757, 834340515, 834131622, 834280014, 834094315, 834387741, 834269180, 834000397, 834315872, 834154968, 835026627, 834354248, 832348633, 833478622, 834768829, 834952469, 835110474, 834490433, 833287811, 833936005, 834358215, 834386978, 834606476, 834434204, 834326630, 834129639, 834297867, 834429398, 834893494, 835163193, 834665680, 834220886, 833896179, 833374786, 833289719, 834290390]
1912.4H34290390K51083K09504j30692j83563Q04596k356034n20095J745452P28074
1921.1H34838715L55453j602936o46362J103287N41992l77045m21219O8055J22070
1929.7H33982010K58713J34353j08413k66648L6927j64109L205J34658k83050K42538
1939.4H33970184J52207Q00705l01209k377777O82678R13086o47506m02909L27683
1948.1H33117142L25088j26114j1673M42658K09198j12305k82745o35147J62506L92380
1957.7H33480988r4529j5487j91040j16578L5401J77383n8136q5525r4834r05151l30505
1968.3H31801987P51037O04248k32391l06091P8354R3536j03378N874J00251n72129
1978H32221298l96728p5074R7886M10995l8071j08566j10474j27639j74256l94134
$$ y = [834290390, 834541473, 834750977, 834620285, 834436722, 835241318, 832885284, 832365189, 834110641, 834838715, 835194168, 833591232, 832944870, 834048157, 834590149, 834213104, 833791885, 833859940, 833982010, 834240723, 834375076, 834266663, 834000015, 834036942, 833872833, 833876038, 834010696, 833727646, 833970184, 834122391, 834923096, 834621887, 832244110, 832926788, 833839874, 833192368, 832789459, 833117142, 833442230, 833316116, 833304443, 833747101, 833956299, 833843994, 833561249, 832926102, 833088608, 833480988, 833386459, 833370972, 833179932, 833063354, 833098755, 833276138, 833218002, 833132477, 833037643, 832132492, 831801987, 832553024, 833157272, 832924881, 832618790, 832697144, 832790680, 832687302, 832693176, 832793427, 832221298, 831824570, 831749496, 831847382, 832258377, 832220306, 832111740, 832001266, 831873627, 831699371, 831305237]
1987.6H31305237n05600m4174R67254J98975j576843k24228J084823M17176k0447l09525
1997.2H31292648l37372M1581r6588N111l89023k86483J93023J68305L69568j65635
2006.9H30795135m64248k86255j33972n1041j91040k66495q4457K62299K20108j10932
2016.5H29689102n97229M12674N68161n59540k73666k74429k4338o2103k86103j449
2026.2H28591080P553M92630J45035l94898m58679k5330Q1101m65851j77765j08032
2035.8H27686844j24588k39563n8441N42755N02853j144l34625k366j75018l57056
2045.5H27439651l88870l84216j97372J71203M11911k73285J07041M31442R8877J23901
2055.1H27540283j92337l92761p27463n27038l79715j93863j4725j1063M33503j09406
$$ y = [831305237, 830799637, 830755463, 831722717, 831921692, 830344849, 830120621, 831205444, 831622620, 831602173, 831292648, 830955276, 830996857, 830900269, 830905380, 830516357, 830229874, 830422897, 830591202, 830960770, 830795135, 830330887, 830044632, 829910660, 829859619, 829668579, 829402084, 829317627, 829579926, 829800034, 829689102, 829091873, 829504547, 830072708, 829513168, 829239502, 828965073, 828940735, 828878632, 828592529, 828591080, 828598633, 829091263, 829236298, 828841400, 828382721, 828357391, 828438492, 827972641, 827794876, 827686844, 827562256, 827322693, 827264252, 827807007, 828309860, 828308716, 827974091, 827971725, 827796707, 827439651, 827050781, 826666565, 826469193, 826640396, 827052307, 826779022, 826886063, 827317505, 827416382, 827540283, 827347946, 826955185, 826227722, 825700684, 825320969, 825127106, 825112381, 825101318, 825534821, 825425415]
2064.7H25425415n6992M24347J40992k31934o57196n52902o84967q01468m81491M7455
2074.4H22571259M14657K11487r7199k01110j4878k00271l44391j76392m68673o99616
2084H20994873o7139N50156K03476j86539K03018L23029k99301j31531J38016q774
2093.7H21719284l23105p15790j44424J4801J59836O78177P21588O16531Q7662j4877
2103.3H22799683K7999j52435l47290k17590J6327o1798J88217L31878O25687L76968
2113H23587646Q4458K54211j71127k64740r5444p6675m19693k75650j19934j40152
2122.6H22362900M46090M21906J96075q3847J2894k83737o07071p3395l72009l40347
2132.3H21679459j67084J84021N78003L97949N23529L10898J35193k53220m47159j90353
$$ y = [825425415, 825368423, 825792770, 825933762, 825701828, 825044632, 824491730, 823806763, 823005295, 822523804, 822571259, 822985916, 823197403, 823100204, 822899094, 822884216, 822683945, 822339554, 822163162, 821694489, 820994873, 820927734, 821477890, 821681366, 821494827, 821697845, 822020874, 821721573, 821590042, 821728058, 821719284, 821396179, 820680389, 820535965, 820550766, 820710602, 821388779, 822110367, 822726898, 822814560, 822799683, 822827682, 822675247, 822327957, 822110367, 822126694, 822064896, 822253113, 822584991, 823210678, 823587646, 823672104, 823926315, 823755188, 823490448, 823395004, 823318329, 822898636, 822622986, 822503052, 822362900, 822808990, 823230896, 823426971, 823343124, 823356018, 823072281, 822465210, 822391815, 822019806, 821679459, 821512375, 821696396, 822274399, 822672348, 823195877, 823506775, 823641968, 823388748, 822941589, 822751236]
2141.9H22751236k04163j58767J21383J89438J95542P09152K72827L3646L60336J31607
2151.5H24402237N417j94245j71051p19757n62210K97165L40805L37906L85285N30166
2161.2H24651718K61383K18811j71966n94864m36707m42276J08032R5826p7P7515J67694
2171.8H23935089K37351J5029K8687k66266j33896m15725m75769O4086N6000l8757
2181.4H23005829l6850M80347J16577O1798K07825l4562N37720K32925k58865m82406
2191.1H23830338j89438J62658L33252O26755L38974L03955K24381M26406j97296n16815
2200.7H25343170J05591k49481J33590J12534j40076O2561K89765O33468L37449M65622
2210.4H27094193K31170m14963o44912l05710O5918n8060n3635L5553K60239J4954
$$ y = [822751236, 822547073, 822388306, 822509689, 822699127, 822894669, 823603821, 823876648, 823910294, 824270630, 824402237, 824407654, 824213409, 824042358, 823322601, 822760391, 823057556, 823398361, 823736267, 824121552, 824651718, 824913101, 825131912, 824959946, 824365082, 823928375, 823486099, 823594131, 823689957, 823689880, 823767395, 823935089, 824172440, 824187469, 824216156, 823949890, 823815994, 823400269, 822924500, 822988586, 823044586, 823005829, 822968979, 823449326, 823565903, 823627701, 823835526, 823800964, 824338684, 824571609, 824312744, 823830338, 823640900, 823803558, 824136810, 824763565, 825102539, 825406494, 825630875, 826057281, 825859985, 825343170, 825448761, 825199280, 825332870, 825445404, 825305328, 825367889, 825657654, 826291122, 826628571, 827094193, 827325363, 826910400, 826265488, 825959778, 826025696, 825967636, 825914001, 825949554, 826209793, 826224747]
2220H26224747K05993L78495K3422J21765k85721m36401k86713l43628j39770N3253
2229.7H25515442k00806P0191R34524P45774K1438l86200q8882k56119n18875N34j95694
2240.3H25641327k57797J21078L69263J28784j06735m7074O4316P6828j49307K74277
2249.9H26114960j08338l69873k08435l98636J56556J44348K56652L49274J29852j79977
2259.5H25886383l32031n3024j70670K57339M5090j55411P3243j01242O7672K33994
2269.2H25751343N47333J68075k14920l47061k04773n4245l89938k75498k72522J96839
2278.8H24904633J46408o943L13263N87997O24771j61666j83335p20367p70340j74332
2288.5H24560089L5401M21295k70310r0713J48849L26157K34909k86255l28445n93186
$$ y = [826224747, 826430740, 826809235, 826832657, 826954422, 826668701, 826232300, 825945587, 825601959, 825462189, 825515442, 825314636, 825384827, 826319351, 827065125, 827086563, 826700363, 826611481, 826355362, 825836487, 825837021, 825641327, 825383530, 825504608, 825873871, 826002655, 825895920, 825848846, 825913162, 825989990, 825840683, 826114960, 826006622, 825636749, 825428314, 825029678, 825186234, 825330582, 825587234, 825936508, 826066360, 825886383, 825554352, 825501328, 825330658, 825587997, 825633087, 825477676, 825550919, 825449677, 825517349, 825751343, 826298676, 826466751, 826251831, 825904770, 825699997, 825645752, 825255814, 824980316, 824707794, 824904633, 825051041, 825044098, 825357361, 825945358, 826570129, 826408463, 826225128, 825504761, 824734421, 824560089, 824595490, 825016785, 824746475, 824655762, 824804611, 825130768, 825365677, 825079422, 824750977, 824157791]
2298.1H24157791J18179l97110m78439M044n4169L16467j59073J56022k97089j15204
2307.8H23251419j65329p76062k50244r70459L967l54690q95920K2964J19782P69882
2317.4H20755310j47705m35181l26156o69251j439590j315842K46277J22299K64816
2326.1H17054977p81707l70942J031952P13959j22528j205215p04956p6294Q39996
2334.8H16379242j030197j903916N07660R88770J024780J67465O08292j96457r58633
2343.4H15587006N49087N93949j49003m1046K161866K300720L06396j205978j144028
2352.1H18958969j093826j184769j71585o32629j336594j336517j403809l31879J213074
2360.8H12680435Q47473m28009L22495L72391R21859O30951M91181M45327m50744J055069
$$ y = [824157791, 824275970, 823878860, 823400421, 823404465, 823350296, 823666763, 823507690, 823663712, 823366623, 823251419, 823086090, 822310028, 822059784, 821089325, 821093292, 820738602, 819842682, 819865646, 819985428, 820755310, 820607605, 820172424, 819846268, 819177017, 817737427, 816421585, 816667862, 816790161, 817054977, 816273270, 815902328, 816934280, 817648239, 817525711, 816320496, 815615540, 815539246, 816379242, 815349045, 813445129, 813952789, 814941559, 815966339, 816133804, 816742096, 816545639, 815587006, 816136093, 816730042, 816581039, 816539993, 818701859, 821002579, 821308975, 820102997, 818958969, 817865143, 816680374, 816508789, 815876160, 814539566, 813203049, 811799240, 811467361, 812680435, 813527908, 813099899, 813422394, 813794785, 814716644, 815347595, 815838776, 816284103, 815833359, 816888428]
2370.4H16888428P69806P07016J158905O66198J219101Q60062K32773N23834J183701
2379.1H24209824O90689J42822M56161M86680L17688J24740K70004o7215l06091M6387
2388.8H26371689K50397M96597L07846r232k48413k20718j67999k24610k71148m86756
2398.4H25797653N4169M32205J63345J44883K72064J38016k21787j73645j55945m35562
2408.1H26015396m61426j79824J03759K58713Q5144k41089j43127K41623L80172M1962
2417.7H26101303k92816l92075l7536j297l62778L7689J21002n8136J15509J02768
2427.3H25333633l19824o25152j11618L00598k7390k23999J71127j18942j97601j4038
2437H24166794j40000O06156O3248m02833j64871m49753p6751l44391j38703P5684
$$ y = [816888428, 817658234, 818365250, 819524155, 820190353, 821409454, 822269516, 822502289, 823026123, 824209824, 824900513, 825043335, 825499496, 825986176, 826303864, 826428604, 826698608, 826631393, 826325302, 826371689, 826622086, 827118683, 827426529, 827417297, 827168884, 826948166, 826780167, 826555557, 826284409, 825797653, 825851822, 826284027, 826447372, 826592255, 826864319, 827002335, 826780548, 826606903, 826450958, 826015396, 825553970, 825374146, 825477905, 825736618, 825821762, 825580673, 825437546, 825679169, 826059341, 826101303, 825808487, 825416412, 825378876, 825377579, 825014801, 825052490, 825173492, 825115356, 825230865, 825333633, 825013809, 824388657, 824277039, 824577637, 824550247, 824326248, 824497375, 824378433, 824180832, 824166794, 824026794, 824632950, 824696198, 824293365, 824128494, 823678741, 823601990, 823257599, 823118896, 823194580]
2446.6H23194580j60217J35269m1580L8910m5090K1973L3416l67126M3716K03476j92337
2457.2H22864990k94266k61917j89514J2894m2725n1651j26877j71814k7313k50015
2466.9H21461792J18027K61841l19825l71475R0408L45536k4491l54309n42068m63410
2476.5H20202026j96609O4163K80151K28272j38245l92303p3013k23084k22473k8687
2486.2H19500198R5597R1934n06210J1520P6828l48129J6174J5869j20239m27399k99606
2496.8H18106537r2392L509J37024K73438K18582j51901J59836k16446m81720o9352
2506.4H17887115l25012n68313n29633k22549R4452N16891K42004M8218J64185l65143
2516.1H16942215r6512N570k20032o6910j8082j62658k89154q6136O866M0283j15280
$$ y = [823194580, 823034363, 823169632, 823128052, 823166962, 823121872, 823143845, 823177261, 822810135, 822853851, 823057327, 822864990, 822570724, 822308807, 822119293, 822132187, 822089462, 822037811, 821910934, 821739120, 821711807, 821461792, 821579819, 821841660, 821521835, 821150360, 821240768, 821586304, 821561813, 821207504, 820665436, 820202026, 820005417, 820069580, 820349731, 820578003, 820439758, 820047455, 819974442, 819751358, 819528885, 819500198, 819595795, 819687729, 819181519, 819193039, 819269867, 818921738, 818937912, 818953781, 818833542, 818406143, 818106537, 818014145, 818017654, 818154678, 818428116, 818646698, 818494797, 818654633, 818438187, 817956467, 817887115, 817562103, 816993790, 816464157, 816241608, 816336060, 816852951, 817094955, 817143173, 817307358, 816942215, 816845703, 816851273, 816631241, 816564331, 816546249, 816383591, 816094437, 816008301, 816015167, 816055450, 815940170]
2526.7H15940170K07138M09928j59607n54810l69339J9379n10254m46167l3417j20468
2536.3H14382553J73874L76205J32676l26691K21863L12881j62430k80456m88129j45492
2546H14196854o8360J10398l9597r0561J84174o6147j19629m59213p6447o3248o31561
2556.6H12876663l30047k5101j0376l95279J9684L97110J30157o2713j19171L9443
2566.2H12520370k67410j83334p4310j46409j86843k62986j27334j07727J46026j44729
2575.9H11165314o7063M03519N5847j59912l63541m09545n4474R308m24576l08228
2585.5H09846649J51596J77078o0501l86428j7701J63651p7515j82724k29645l7307
2595.1H09347153r3537j79901m4937Tk43912j78604l38364j88827J17874n48096m7302
$$ y = [815940170, 816147308, 816557236, 816397629, 815842819, 815473480, 815492859, 814982605, 814536438, 814503021, 814382553, 814556427, 814932632, 815065308, 814738617, 814960480, 815273361, 815110931, 814830475, 814342346, 814196854, 814128494, 814238892, 814199295, 814108734, 814292908, 814226761, 814107132, 813647919, 813571472, 813508224, 812876663, 812546616, 812521515, 812511139, 812115860, 812135544, 812532654, 812662811, 812600098, 812480927, 812520370, 812252960, 812069626, 811995316, 811848907, 811662064, 811399078, 811271744, 811164017, 811310043, 811165314, 811098251, 811501770, 811557617, 811397705, 811034164, 810624619, 810570145, 810579453, 810154877, 809846649, 809998245, 810175323, 810114822, 809728394, 809710693, 809874344, 809796829, 809614105, 809384460, 809347153, 809253616, 809073715, 809028778, 808983841, 808739929, 808561325, 808222961, 808034134, 808152008, 807603912, 807556610]
2605.7H07556610N16281o943j93862n14832l74527J1139r2697k01721k47956j31302
2615.4H06320190M27552P6828n86701K2507N8365l89328o00434m12063n8594k38876
2625H04619446j23368p0953M3564O8207K05765N25665j75781q54264p77969l35617
2634.7H03124695j51062m9668l0288k25907l6926o4773P8277K92511k95334p41272
2644.3H01900253n15670j78757J9302k44217k34070J34049k58942k06604J4191K29416
2654H00658951K56119n89524l17154N570k12860j91346j11465q6746m48075l04031
2663.6G98659439j0681J35040l86886l55378M43268m2724m08097m71496Q1176L07084
2673.3G97950745n45960m37240K6321K92358q7890m12674l01895l05710q6212k46735
$$ y = [807556610, 808072891, 808065948, 807872086, 807357254, 806982727, 806993866, 806901169, 806699448, 806451492, 806320190, 806747742, 806824570, 806237869, 806260376, 806318741, 805929413, 805328979, 804916916, 804858322, 804619446, 804496078, 804425125, 804468689, 804536896, 804742661, 805268326, 805092545, 804238281, 803460312, 803124695, 802973633, 802923965, 802893677, 802667770, 802630844, 802566071, 802644348, 802936859, 802641525, 801900253, 801384583, 801205826, 801225128, 800980911, 800746841, 800880890, 800621948, 800415344, 800429535, 800658951, 800915070, 800325546, 800008392, 800013962, 799801102, 799609756, 799498291, 799411545, 798963470, 798659439, 798648758, 798783798, 798396912, 798041534, 798484802, 798442078, 798033981, 797562485, 797643661, 797950745, 797404785, 796967545, 796993866, 797286224, 797198334, 796785660, 796483765, 796178055, 796091843, 795845108]
2682.9G95845108k94952j87607j3504L21274J62429k41775k60162r1172k45208k97394
2692.5G94697037k7161o866o80695n89218P2937l6011K2125o8588m13208m73709r8267
2703.1G92398376J3276j47248o86j02082K76032n7526p20367l42484m10461l59345
2712.8G90547485m3640Q6975p0190l90167l33786p1640K28881Q6060q7891j68609n82504
2723.4G89200974n11780n112O943j71356n37415l64990K48337p8431N9662j10550m91943
2734G87244339p9727k15759j18027k23541o2790L8452n46799m69894k63901J38397
2743.7G85440750J67389J94778k8610m98352j47934k79083l05023m84696p88726n20707
2753.3G82749786r0561M15268P3319j30158m501k59552k39181k84195o66199k34146
$$ y = [795845108, 795550156, 795362549, 795349045, 795670319, 795832748, 795590973, 795330811, 795239639, 794994431, 794697037, 794669876, 794663010, 793982315, 793393097, 793466034, 793430023, 793452148, 793383560, 792970352, 792496643, 792398376, 792411652, 792264404, 792263718, 792161636, 792437668, 792380142, 791659775, 791317291, 790906830, 790547485, 790503845, 790590820, 790520630, 790130463, 789796677, 789725037, 789953918, 790039978, 789952087, 789783478, 789200974, 788689194, 788684082, 788691025, 788519669, 787982254, 787617264, 787865601, 787787170, 787846832, 787736282, 787244339, 787164612, 786948853, 786830826, 786607285, 786544495, 786582947, 786036148, 785566254, 785302353, 785440750, 785608139, 785802917, 785774307, 785275955, 785128021, 784848938, 784543915, 784059219, 783270493, 782749786, 782659225, 783074493, 783147812, 783017654, 783013153, 782753601, 782514420, 782230225, 781564026, 781329880]
2762.9G81329880M79278J04370j99737k03629l65142o76423o20727j79291N4093K02407
2772.6G79925079l21579m09088k08053k49024j52588n21698k42920m9743m49600n27726
2782.2G76793060k96707j43280j88141l1509l01590l14484J374m8981l29285m05502
2791.9G74734955r2316m87213p54471m89960l26690k76566j07193K6856m27017l09449
2801.5G71490936j89132n85709m80194r7351j18256m59289k61612j00861k21558l32946
2811.2G68644028m64707m48227l43475m24347n77621o35147j037217m42199J69143
2819.8G64440231k52456l03192p05414o37741r6817L7155j44043o64139q13293p09382
2829.5G60150909l19900l42484l35922j0910m62189p99713p60574o20499m35333o31180
$$ y = [781329880, 781809158, 781913528, 781713791, 781510162, 781145020, 780468597, 779847870, 779668579, 779722672, 779925079, 779603500, 779194412, 778986359, 778737335, 778584747, 778063049, 777820129, 777770386, 777320786, 776793060, 776496353, 776353073, 776164932, 776133423, 775831833, 775517349, 775518723, 775469742, 775140457, 774734955, 774642639, 774155426, 773400955, 772910995, 772584305, 772307739, 772200546, 772227402, 771800385, 771490936, 771301804, 770716095, 770235901, 770138550, 770020294, 769561005, 769299393, 769198532, 768976974, 768644028, 768179321, 767731094, 767387619, 766963272, 766385651, 765750504, 764713287, 764271088, 764440231, 764187775, 763884583, 763179169, 762541428, 762444611, 762481766, 762337723, 761673584, 760860291, 760150909, 759831009, 759488525, 759152603, 759141693, 758679504, 757879791, 757119217, 756498718, 756063385, 755432205]
2839.1G55432205j325912j459198j064530j215057q82187n44128r91974j063385j342545
2847.8G45543289k124100j928710j315156q58993n13687p08161m10080k9373K19269
2856.5G37874298K34299M5547K32010p73468j169128k94419j46103m82177p42951n63583
2866.1G34214325o53763n32226n21927m97284k30332q89816o66656l53852n03921k32468
2875.8G29132080p35931p55234j61057j68228j30157M5089l28521m83399k05459n43213
2885.4G25665970n67017l13797q47015r62906n81665o76422m18625m23508j003647
2894.1G19871368k69470L56064m97513r29565r87396j056061l54233j32980m71878
2902.8G15528336m50898l89862j67694n42984p67059j679J87073m91714r42383p37534
$$ y = [755432205, 754106293, 752647095, 751582565, 750367508, 749485321, 748941193, 747949219, 746885834, 745543289, 743419189, 741490479, 740175323, 739316330, 738802643, 738094482, 737684402, 737655029, 737874298, 738108597, 738154144, 738386154, 737612686, 736443558, 736149139, 736003036, 735520859, 734777908, 734214325, 733560562, 733028336, 732506409, 732009125, 731778793, 730888977, 730222321, 729868469, 729364548, 729132080, 728396149, 727640915, 727479858, 727311630, 727181473, 727226562, 726898041, 726414642, 726209183, 725665970, 725098953, 724785156, 723938141, 722975235, 722393570, 721717148, 721298523, 720875015, 719871368, 719601898, 719957962, 719460449, 718530884, 717543488, 716487427, 716133194, 716000214, 715528336, 715077438, 714687576, 714519882, 713976898, 713209839, 713208160, 713395233, 712903519, 711961136, 711223602]
2912.4G11223602p60574q13675q49838q66699q45185j419143j186448l14941j73798
2921.1G03993301p55462p04651j99890j72653J45721l58048k35214N79148J20086o0959
2930.7G02351379J79978L47214J24816N0583J31684K49557K98157k3575M56467N14374
2940.4G04680634M30831O47965M39224K93198J24817J31225n14831m92859J97067P0877
2950G06008148J47782j28098o10275m54560j15661k98233j62277N0506m79660k53143
2959.7G03704529J41601j02386j63574L45764N35202M15039L26538K05078Q78754Q19702
2969.3G07106247O18362R28193M23889M92096R07898M77066L6697O09894J035766P69577
2979G13405685M76380M81186R10492O85043M05731L67050M78897O07377K98538K85415
$$ y = [711223602, 710463028, 709649353, 708799515, 707932816, 707087631, 705668488, 704482040, 704167099, 703993301, 703237839, 702533188, 702333298, 702160645, 702306366, 701948318, 701713104, 702292252, 702412338, 702351379, 702531357, 702878571, 703003387, 703053970, 703185654, 703435211, 703733368, 703709793, 704166260, 704680634, 705111465, 705759430, 706198654, 706491852, 706616669, 706747894, 706233063, 705740204, 705937271, 706008148, 706155930, 706027832, 705417557, 704962997, 704847336, 704549103, 704386826, 704437332, 703957672, 703704529, 703846130, 703743744, 703580170, 703925934, 704461136, 704876175, 705202713, 705407791, 706286545, 707106247, 707724609, 708652802, 709076691, 709568787, 710476685, 710953751, 710990448, 711600342, 712636108, 713405685, 713882065, 714363251, 715273743, 715958786, 716364517, 716731567, 717210464, 717817841, 718116379, 718401794]
2988.6G18401794N44129R60007M88891j25580k35214j95541O14929O39038L17841J20315
2998.2G21530609j1368J23520k39181k30408q5297N2948J47629R92J43204M26864K29645
3008.8G22089157p22351n78003J65100j03531p2479J6327m01001m73709k3956J91803
3018.5G20087357m88587q39157l49350k21176J0834R8877k92359n37796p42492m82331
3028.1G16243820k56882j64718j53961k13547J39236n6839l24249m14886p68357o32248
3037.8G13397369k75268m49982m77981j42899k42767n2567j21612q85010o53076J4114
3047.4G10110321k96249n59616k21253o55975r40247m89197j16272M0284k43378n06668
3057.1G06121750r50165p64770J30081K36511k85797m82330l86124o54526l9520K05383
$$ y = [718401794, 718945923, 719905930, 720394821, 720269241, 720034027, 719838486, 720453415, 721092453, 721410294, 721530609, 721519241, 721642761, 721403580, 721173172, 721087875, 721140823, 721288452, 721289444, 721432648, 721859512, 722089157, 721366806, 720788803, 720953903, 720850372, 720777893, 720794220, 720393219, 719919510, 719895554, 720087357, 719598770, 718759613, 718410263, 718189087, 718199921, 718298798, 718006439, 717468643, 716726151, 716243820, 715986938, 715822220, 715668259, 715454712, 715593948, 715537109, 715212860, 714797974, 714029617, 713397369, 713122101, 712672119, 712194138, 712051239, 711808472, 711755905, 711634293, 710749283, 710096207, 710110321, 709814072, 709254456, 709033203, 708377228, 707436981, 706947784, 706831512, 706871796, 706628418, 706121750, 705171585, 704406815, 704536896, 704773407, 704487610, 704005280, 703619156, 702964630, 702925110, 703130493]
3066.7G03130493p10449p86438o70776j94703M6311o11954n46570j06506j62354O791
3076.4F99393845k69165r54285l31497J35421j23062m41513m68292o3019l60183o72760
3086F95845490r40323n37033K72827J80816j56173p79038j001892p32574k06070j41220
3095.6F91804810l82615l2653n3940P2403l37830j178665j181107o25305J59607l4027
3105.3F88210678m98733l69187k97012l71170m28467n05676n69077q35419p56683k975
3114.9F83576279l31192p71256l49731n56641r33075o83822n45731r65881q28782q8806
3124.6F77521362M52271m44870j384506m55323j88522p29980q85773o08673o17523
3133.3F72658463n57480k00882n74646n13077o21872n13763n27344j127777p92923
$$ y = [703130493, 702420044, 701633606, 700962830, 700768127, 700814438, 700202484, 699655914, 699549408, 699387054, 699393845, 699124680, 698170395, 697838898, 697974319, 697851257, 697409744, 696941452, 696878433, 696518250, 695845490, 694905167, 694368134, 694640961, 694821777, 694665604, 693886566, 692884674, 692152100, 691946030, 691804810, 691422195, 691389542, 691335602, 691408005, 691070175, 689891510, 688710403, 688085098, 688244705, 688210678, 687711945, 687342758, 687045746, 686674576, 686246109, 685740433, 685171356, 684335937, 683579254, 683576279, 683245087, 682473831, 682124100, 681567459, 680634384, 679950562, 679404831, 678438950, 677610168, 677521362, 677973633, 677528763, 676144257, 675688934, 675500412, 674770432, 673884659, 673275986, 672658463, 672100983, 671900101, 671325455, 670812378, 670190506, 669676743, 669149399, 668021622, 667228699]
3141.9F67228699o80008m62647n81360q31298q19245r17740k85568O7978m43191j318131
3151.6F60957489o58569j1826o57196j094971j131744m73785o88172o40793m14276
3160.3F55186157n59234o04782j216584m89807k85339p55768o69251r76944q64639
3168.9F48763809k97775l97415j274719r45206m82865l24935p17240j041031j90124
3177.6F43092499q66623q70056n27115o06384m77486j192589o73027n18875q06770
3186.3F36553574r09462q81691l47634n43098p30820r81903o67992m42428m35600l27759
3195.9F30285187r22013j194458j125450n20172l68271p26928r13010p27158l56636
3204.6F23431091l92456j64032o37474n33485l48282j146622r03625o48041o62727
$$ y = [667228699, 666548691, 666086044, 665504684, 664673386, 663854141, 662936401, 662650833, 662718811, 662275620, 660957489, 660298920, 660287094, 659629898, 658534927, 657403183, 656929398, 656241226, 655600433, 655186157, 654626923, 654022141, 652805557, 652315750, 652030411, 651274643, 650605392, 649628448, 648763809, 648466034, 648068619, 646793900, 645848694, 645365829, 645040894, 644323654, 643282623, 643092499, 642225876, 641355820, 640828705, 640222321, 639744835, 638552246, 637879219, 637360344, 636553574, 635644112, 634762421, 634414787, 633871689, 633140869, 632158966, 631490974, 631048546, 630612946, 630285187, 629363174, 628168716, 627043266, 626523094, 626154823, 625427895, 624514885, 623787727, 623431091, 623038635, 622874603, 622237129, 621703644, 621355362, 620208740, 619305115, 618657074, 617994347]
3213.3F17994347q46787o70586l19099m38309o99081j041565p42569p06406q05359
3222F11724586o84051n58167k01797j64986n98488j082534p31316m66766o19316m34456
3231.6F06182709m38271p05871o15998n14755m30336l88794q33397p2670q2283j257858
3241.3F00842476q27103k74277k33459j191788j429214l77007j99508p30286q98132
3249.9E94681702k87896m77294k89650k42882n08232l28026r55467p76406p44209l68919
3259.6E89702721k07329o30226j3161l79410o61812r61113q97789k81562m71344l82538
3269.2E84816437k82402o6834l45192p42836q69369n19867l3417p01523q09822n49316
3278.9E79895859l30849k03476o93588p77321l41949k68593o23398p60155o76803q2550
$$ y = [617994347, 617147560, 616476974, 616157875, 615719566, 615020485, 613978920, 613236351, 612529945, 611724586, 611040535, 610482368, 610280571, 610115585, 609517097, 608434563, 607703247, 607236481, 606617165, 606182709, 605744438, 605038567, 604422569, 603907814, 603477478, 603088684, 602255287, 602182617, 602100334, 600842476, 600015373, 599741096, 599507637, 598315849, 596886635, 596509628, 596310120, 595579834, 594681702, 594393806, 593916512, 593626862, 593383980, 592875748, 592547722, 591592255, 590815849, 590071640, 589702721, 589495392, 588865166, 588852005, 588472595, 587810783, 586849670, 585951881, 585670319, 585198975, 584816437, 584534035, 584467201, 584122009, 583379173, 582509804, 581989937, 581956520, 581254997, 580445175, 579895859, 579565010, 579361534, 578667946, 577890625, 577548676, 577280083, 576656685, 575896530, 575219727, 575137177]
3288.5E75137177k06757m18129j09673m40864m48799m92821l50075o45714o07795j10703
3298.2E71305847n20477j72196l44047m61617m25491q33549m17366l29743m66690p71217
3307.8E66563454n39742m33121q41026m79660m16489n03959n37911p42416n38559j71967
3317.4E61358604q11462q11157Q6136m01268j009407o94962j75590r45702j184006
3326.1E55411186m71916l86887K6551p22313j084328p39746l64380m9209r88503p17888
3335.8E49912567p07092n03082J28822q39806r11674r44138r44519p8544k87476j039391
3345.4E43785667r58137q81271o69137j12876q01354j217346q75168p70111m30183
3354.1E37070084l97034m19159m06837p91436o93435l85971p19185n41001o38618q00247
$$ y = [575137177, 574930420, 574512291, 574402618, 573961754, 573512955, 573020134, 572670059, 572024345, 571416550, 571305847, 570785370, 570613174, 570269127, 569807510, 569382019, 568548470, 568131104, 567801361, 567334671, 566563454, 566023712, 565590591, 564749565, 564269905, 563853416, 563349457, 562811546, 562069130, 561530571, 561358604, 560547142, 559735985, 559822121, 559420853, 558411446, 557716484, 557540894, 556595192, 555411186, 554939270, 554552383, 554578934, 553856621, 552772293, 552032547, 551668167, 551618958, 550630455, 549912567, 549205475, 548702393, 548831215, 547991409, 547079735, 546135597, 545191078, 545112534, 544825058, 543785667, 542827530, 541946259, 541277122, 541164246, 540362892, 539145546, 538270378, 537500267, 537070084, 536673050, 536253891, 535847054, 535055618, 534362183, 533976212, 533257027, 532716026, 532077408, 531277161]
3363.7E31277161m16565r26056p38182o24543q41979k90261j92604p20367j368409
3372.4E25158195p60078n71213q59298l91465p43484o61774p2403l70064j087722r20296
3382.1E18720398j20354L0785n13840p35855l09525n78880l95241p0533m47617k93312
3391.7E15286026q34808j076813j80473p2518o90002p61223j26877j44539j90849j67351
3401.3E11040573n80406k38648K7123k69890l91731n19028R5215j26839j036377l54271
3411E07645721p5531n94635o44874j05591J60217M0932K4147o29654p60727n37643
3420.6E04522362P7858O37359j9035j47705k02980j91727J69373J6136o5308J29052
3430.3E04925385o791m38881j89247L27568K3728n20096P0496O79779O64444M8866
$$ y = [531277161, 530860596, 529934540, 529196358, 528571815, 527729836, 527439575, 527246971, 526526604, 525158195, 524398117, 523826904, 522967606, 522576141, 521832657, 521170883, 521098480, 520728416, 519640694, 518720398, 518600044, 518630829, 518116989, 517381134, 517071609, 516492729, 516097488, 516026955, 515579338, 515286026, 514451218, 513374405, 513193932, 513121414, 512431412, 511670189, 511543312, 511398773, 511207924, 511040573, 510460167, 510221519, 510248642, 509978752, 509587021, 509067993, 509163208, 509036369, 507999992, 507645721, 507570190, 506975555, 506330681, 506225090, 506385307, 506426239, 506450386, 505820732, 505060005, 504522362, 504600220, 505237579, 505218544, 505070839, 504867859, 504676132, 504845505, 504861641, 504796333, 504925385, 504918594, 504479713, 504290466, 504618034, 504641762, 504121666, 504192162, 504871941, 505536385, 505585251]
3439.9E05585251k43607L63198l54042N3825O8932M3373J107711q72764j2856J034279
3449.6E06773300K07443M21181K10877L17001k71454O68335Q86421O9390P50274J36414
3459.2E10169182K95639J99966L26081Q82110L19481L78456N93872N93453k47841K86102
3468.8E13796501P33528K82097O37131K13699J89858L17764L50876Q46367J112480
3477.5E18480301O97136J98326K26250N72891P24068L06816J368904R97009n1994O62498
3487.2E24182205o1645K90222J272163O91567J50337M74968Q02879Q95806J118888
3495.8E29817390K823k56500Q36220J265373N57480L25279R73320O0768p9078R60922
3505.5E34463997J292877J314697J883393L91922j211777J200294R49975L27529O20461
$$ y = [505585251, 505341644, 505704842, 505350800, 505404625, 505473557, 505516930, 506624641, 505751877, 505739021, 506773300, 506980743, 507401924, 507612801, 507929802, 507658348, 508326683, 509213104, 509282494, 510032768, 510169182, 510464821, 510664787, 510990868, 511872978, 512192459, 512570915, 513164787, 513758240, 513510399, 513796501, 514530029, 514812126, 515449257, 515662956, 515852814, 516170578, 516521454, 517367821, 518480301, 519177437, 519375763, 519602013, 520174904, 520898972, 521205788, 522574692, 523571701, 523519707, 524182205, 524120560, 524410782, 525682945, 526374512, 526524849, 526999817, 527802696, 528698502, 529817390, 529820213, 529563713, 530399933, 531665306, 532222786, 532548065, 533521385, 533582153, 533503075, 534463997, 535756874, 537071571, 538954964, 539346886, 538135109, 539335403, 540285378, 540612907, 541233368]
3514.2E41233368L05290P20139N42373J503182J604118Q3847L10135J864548J190491
3522.9E49357491j016961K96479J075325O22062M71955P49969J123200J460228O46820
3531.5E54786568j88446J116905J372299J434441k0638l18298J871338J138801Q20694
3540.2E62013664M55666P65838Q72231J051521J525994M79316J071587p17125J094894
3548.9E68613586J947976J253089K263985l84369R29871J315765J207047J119728k24381
3557.6E78042297J410370R06067J169090M93203J476097J275711M84733M285164n77011
3566.2E88965721j048508l99131p52220M698410K418136J359596J017914Q83827Q78601
3574.9E98022346J341019K334137J72348K173042J203385m0894J813469J530495J383781
$$ y = [541233368, 541538658, 542258797, 542801170, 544304352, 545908470, 545992317, 546302452, 548167000, 549357491, 548340530, 548637009, 549712334, 550334396, 550806351, 551556320, 552679520, 554139748, 554786568, 554598122, 555715027, 557087326, 558521767, 558501129, 558182831, 560054169, 561192970, 562013664, 562469330, 563235168, 564107399, 565158920, 566684914, 567164230, 568235817, 567518692, 568613586, 570561562, 571814651, 574078636, 573694267, 574624138, 575939903, 577146950, 578266678, 578042297, 579452667, 580358734, 581527824, 582021027, 583497124, 584772835, 585257568, 589542732, 588965721, 587917213, 587518082, 586765862, 591464272, 593882408, 595242004, 596259918, 597143745, 598022346, 599363365, 601697502, 601869850, 604042892, 605246277, 605205383, 607018852, 608549347, 609933128]
3583.6F09933128Q24356M178315J332893k968292J474037r82819L065186L582230L396263
3592.3F23835297P71942p18498L570861j363411K123223L639107l52707K123146K15377
3601F33844337J532937K902908J526184K204742K999573J835632k340927K912064n86243
3609.6F46831207p39517P636108Q28934j709976M672623r86023L258438M064560j85318
3618.3F63671036J015930k432327J53808L626328L363189K573395K472992J860581
3626F76304932J535568N778885j000748j0286941N034637N096664O018677K040558
3633.8F90522232j779556K145996L236465K467957j10550J398849K581101K129211
3641.5G02591705O98090L3340K821198M239807O355133k652130o205597O541443m17099
$$ y = [609933128, 610757484, 614935799, 616268692, 613300400, 614774437, 613791618, 616856804, 620439034, 623835297, 624607239, 623888741, 627459602, 626096191, 628219414, 631858521, 631505814, 633628960, 633844337, 635377274, 638280182, 639806366, 642011108, 645010681, 646846313, 644505386, 647417450, 646831207, 646091690, 653727798, 654556732, 652846756, 657519379, 656533356, 659791794, 663856354, 663671036, 664686966, 662254639, 662408447, 666034775, 669397964, 671971359, 674444351, 676304932, 677840500, 683619385, 682618637, 672331696, 677366333, 682462997, 688481674, 690522232, 688742676, 690888672, 694125137, 696593094, 696482544, 697881393, 700462494, 702591705, 703289795, 703323135, 706144333, 710384140, 716739273, 714087143, 707881546, 714422989, 714005890]
3650.1G14005890m178162r03167N955963N166397M259949M606323r281769J561432
3657.9G21192856N483932J425248J371765K10571J453400R37271J651230J206588J15662
3666.5G35048523L991547J780929k024917j487351n800781L881073Q880539R466171
3674.3G53735733k063217k1791306M877549Q807830M410401l251419m85306K993011
3682G47233276K072754J243363j0147L80935M482880O143036j1838837m961929Q830566
3690.6G53575897n503387j97907N144196K2964P30286l81851J92871K294082k51617
3699.3G55625534J713333L329315n816116k764358M542770J014938m00085P21054L714371
3708G61680756L683014r136506M722748O305008j4575882L921280M991226O80847N56412
$$ y = [714005890, 709827728, 708924561, 714880524, 720046921, 724306870, 728913193, 719631424, 721192856, 726676788, 728102036, 729473801, 729684372, 731137772, 732075043, 733726273, 734932861, 735048523, 739040070, 740820999, 738796082, 737308731, 731507950, 735389023, 744269562, 753735733, 751672516, 729881210, 734758759, 743566589, 747976990, 744725571, 744240265, 747233276, 749306030, 750549393, 750539246, 750920181, 755403061, 761546097, 749707260, 744745331, 753575897, 748072510, 747874603, 753018799, 753041763, 753772049, 753390198, 753583069, 755877151, 755625534, 757338867, 760668182, 754852066, 752087708, 756630478, 757645416, 757245331, 757966385, 761680756, 765363770, 756227264, 760950012, 767255020, 752679138, 756600418, 761591644, 762272491, 762828903]
3716.7G62828903J803818N25742l662568J151200N941772l863220n347061N121765
3724.4G64500351P40509o06232k764587R6054L967667O55822N312882m412461q091506
3733.1G59398499J0226821m67529j0563354J944656K919235K77558L059005L334427
3740.8G70129318m958801L007431J3046417j0836563k0912857J2134399P547303N859222
3748.5G75015869l738022j1649170J2458802n048142q878937O066819M797439L351746
3756.2G72376404n679627K431946O229019q749313j697006M337539O75660J41906M274140
3764.9G74340668k955704n910416M022446N887451j27792j0612793K466659M148179
3772.6G71258698j27869O02188m71420O30111K95563K371292J57318q132553K900696
$$ y = [762828903, 764632721, 765158463, 761495895, 762647095, 768588867, 764725647, 759378586, 764500351, 765240860, 764634628, 761870041, 761966095, 765933762, 766589584, 771902466, 767490005, 759398499, 769625320, 769157791, 758594437, 760539093, 763458328, 763735886, 766794891, 770129318, 765170517, 768177948, 781224365, 770387802, 749474945, 761609344, 769156647, 775015869, 771277847, 759628677, 772087479, 767039337, 758160400, 764227219, 769024658, 772376404, 766696777, 769128723, 775357742, 766608429, 764911423, 769248962, 769924622, 770066528, 774340668, 771384964, 765474548, 769496994, 775384445, 775256653, 764643860, 767110519, 771258698, 771130829, 771733017, 771261597, 771891708, 772187271, 774558563, 774715881, 766583328, 769484024]
3781.3G69484024K514191N13687K310715m252778k223053J683426J331482J052323
3789G72414017l02048l9291K5329O49262k4338J545257L302308n633393n046463K597657
3798.7G69488297M292144N053788q229828r543839M564819L699189N694122O213379
3806.4G81232071j2424622n214691O323624K167435K74963J068191j99203Q01468N804825
3815.1G79834061j103897j6120530M607468O647492M714431L13492j7802124K846527
3822.8G63936920N344773J641387K705079K69470m316712O49720K150726L836517J536942
3831.4G77754822j0036545L188324P537537o520844j548767P611923q258514m961090
3839.2G64766846P100830p328263J195832Q925628k906875m276123L316803J689834
$$ y = [769484024, 771998215, 772511902, 774822617, 770569839, 768346786, 770030212, 771361694, 772414017, 772111969, 772072678, 772098007, 772747269, 772722931, 774268188, 777570496, 771937103, 766890640, 769488297, 773780441, 778834229, 770604401, 761060562, 765625381, 769324570, 775018692, 781232071, 768807449, 763592758, 769916382, 772083817, 772358780, 773426971, 773227768, 774029236, 779834061, 778730164, 762609634, 767217102, 773864594, 778579025, 778892517, 761090393, 763936920, 769281693, 770923080, 773628159, 773897629, 769580917, 770230637, 772381363, 776217880, 777754822, 767718277, 770906601, 778444138, 771923294, 770374527, 777986450, 769727936, 764766846, 771867676, 764539413, 765735245, 774660873, 771753998, 767477875, 770794678, 772484512]
3846.9G72484512j78680J171799j315918K011566N613479p149581J148223j6868896
3854.6G56916504K392425J2025605l50190j727600J858902J920777L129196m619293
3862.3G71546326L55377O983642q109588o711579M836731N799866N913620q851929
3870G71762466r771118M153061P287750M477463j0172272L79181L745728o4468J961746
3878.7G73759537N434265n962143r695358O581573J067886J928711N853119j4782943
3886.4G64184647J497955M679489R51996M805603j160355r893264J625061L704223
3894.1G70395355j414413J661453J931229K241897J188812r915771N471497K273864
3901.8G73833923n935974N200501l789521k490921R82209Q86383K634048J34583k21176
$$ y = [772484512, 772305832, 773477631, 772161713, 774173279, 779786758, 772637177, 773785400, 756916504, 759308929, 771334534, 770984344, 769256744, 771115646, 773036423, 776165619, 771546326, 771901703, 778885345, 770775757, 764064178, 768900909, 774700775, 780614395, 771762466, 761991348, 766144409, 773432159, 777909622, 767737350, 768116531, 771862259, 771797791, 773759537, 779193802, 773231659, 763536301, 770117874, 771185760, 773114471, 778967590, 764184647, 765682602, 770362091, 771314087, 776119690, 774959335, 765066071, 766691132, 770395355, 768980942, 770642395, 772573624, 774815521, 776004333, 766088562, 771560059, 773833923, 767897949, 773098450, 769308929, 766818008, 767800217, 768686600, 771320648, 771455231, 771234055]
3910.5G71234055n02167Q3465L82538m10461J592331K274399l962479k903290N112915
3919.2G72901306q11233m874878K714462K069397Q07266k774963l260040K370986K044373
3927.9G71186676J080322j221618m54483K097549l028946k025528J694184O93283K84881
3936.6G70306320k82440k28271O54525M8294J967392J936875n000840j824340R23309
3945.2G68500824N98373J967163j326904N35584M34417k341919J082306J87378l51333
3953.9G69285889j78452m730R39026R1705N3864n97687N24750l80326j863708J088486
3963.6G68958817J031875L7995k64512P3624Q41065n79224q56018M10843M46930j45493
3973.2G69955902m96673m04892l00751r9716O68792M49906J55639J99814m68902n33524
$$ y = [771234055, 770731888, 770815353, 771197891, 770787430, 772379761, 774654160, 770691681, 767788391, 772901306, 772090073, 767215195, 769929657, 771999054, 772806320, 770031357, 766771317, 769142303, 771186676, 772266998, 771045380, 770590897, 772688446, 769659500, 767633972, 769328156, 770021439, 770306320, 770023880, 769795609, 770450134, 770498428, 772465820, 774402695, 769401855, 767577515, 768500824, 769099197, 771066360, 769739456, 770275040, 770709457, 768367538, 769449844, 769637222, 769285889, 769107437, 769102707, 770041733, 770133438, 770187302, 769589615, 770114365, 769734039, 767870331, 768958817, 769990692, 770028687, 769764175, 769837799, 770678864, 770099640, 769243622, 769654465, 770101395, 769955902, 769459229, 769054337, 768753586, 768653870, 769322662, 769772568, 769928207, 770128021, 769659119, 769125595]
3982.8G69125595K76413O49796n39475l46146J16807j04981M35104n18646M35944O15310
3992.5G70145721m75082J297j053162k73971O16150K02636K35596J24359
4000.2G69523544
$$ y = [769125595, 769402008, 770051804, 769512329, 769166183, 769282990, 769178009, 769613113, 769094467, 769530411, 770145721, 769670639, 769671936, 768618774, 768344803, 768960953, 769163589, 769399185, 769523544]
##END=$$ End of the data block
