##TITLE=$$ Begin of the data block
##JCAMP-DX=5.00 $$ ACD/SpecManager v 10.08
##SPECTROMETER/DATA SYSTEM=Varian
##DATE=18 Dec 2012 13:49:00
##DATA TYPE=INFRARED SPECTRUM
##DATA CLASS=XYDATA
##ORIGIN=
##OWNER=
##NPOINTS=3735
##FIRSTX=399.26403809
##LASTX=4000.35498047
##MAXX=4000.35498047
##MINX=399.26403809
##MAXY=83.88201141
##MINY=33.27769852
##XFACTOR=1.0000000000
##YFACTOR=0.000000100000000
##FIRSTY=70.23326874
##DELTAX=0.96440572
##XUNITS=1/CM
##YUNITS=TRANSMITTANCE
##XYDATA=(X++(Y..Y))
399.3G02332687J8138352j3021469l681259K469940J653824Q248214L985291N55267
$$ 702332687 720471039 707449570 703768311 706238251 707892075 716140289 720125580 720680847
407G20680847r515533m329377m47158j99585N441665J764298l303223n560608N821839
$$ 720680847 711165314 706835937 706388779 706189194 711630859 713395157 710091934 704531326 710353165
415.7G10353165O052017K062759J071244j8329544L013153K629699L647156J547623
$$ 710353165 716405182 718467941 719539185 701209641 704222794 706852493 710499649 712047272
423.4G12047272k655945j708222j259079M253159j017990n378265m933091o067733
$$ 712047272 709391327 707683105 706424026 710677185 709659195 704280930 699347839 693280106
431.1F93280106R26971N013580J045227k27584L935470L383179l248139m651413K79618
$$ 693280106 694207077 699220657 700265884 700038300 703973770 707356949 704108810 699457397 699737015
439.8F99737015q07877k017364N09414j261673L642197L474731J294861k691955n209885
$$ 699737015 698929138 696911774 697421188 696159515 699801712 703276443 704571304 701879349 696669464
448.4F96669464m346619k754516M733276J245270j066437M064789k245331l032760
$$ 696669464 692322845 689568329 694301605 695546875 694480438 698545227 696299896 693267136
456.2F93267136j437531k149582J272507N1575k286835j74027p22427o968079j625824
$$ 693267136 691829605 689680023 690952530 691004105 688717270 688543243 687820816 680852737 679226913
464.8F79226913N574189R11712j369095J822587K064285K520599R43833p147980K1286
$$ 679226913 684801102 685712814 684343719 686166306 688230591 690751190 691695023 684547043 684568329
473.5F84568329K896728j353683j648331j034241O06995L816757O147385J511764q54492
$$ 684568329 687465057 686111374 684463043 683428802 684035797 687852554 693999939 695511703 694657211
482.2F94657211j790085m170990k244033m48075L659973K491532k363663m854965J180267
$$ 694657211 692867126 688696136 686452103 686004028 689664001 692155533 689791870 684936905 686117172
490.9F86117172O017227k824630r41468K675248J105423j023331l695374M87595K414474
$$ 686117172 692134399 689309769 688368301 691043549 692148972 691125641 687430267 687917862 690332336
499.6F90332336J336594m87595j928482N71747o48346k652969k372360q9875L63007
$$ 690332336 691668930 691181335 689252853 689824600 689176254 686523285 684150925 684061050 684424057
508.2F84424057k486267l086548J023636L960342Q24356l530044l339234q00094k475510
$$ 684424057 681937790 678851242 679874878 683835220 684659576 681129532 677790298 676990204 674514694
516.9F74514694k061233J48239j04675J811752m3183k070312J21613J694183r63974
$$ 674514694 672453461 672601700 672497025 674308777 674265594 672195282 672316895 674011078 673047104
525.6F73047104j915207J374588j80359m20532m47922j726761o78177M41819K568588
$$ 673047104 671131897 672506485 672326126 671905594 671457672 669730911 669052734 669494553 672063141
534.3F72063141J478042r32159j250229n35736J274567J320877n2643j041031k224274
$$ 672063141 673541183 672609024 671358795 670823059 672097626 673418503 673365860 672324829 670100555
543F70100555j596374J022797K37960m32129J964417K357101J107407J0376P82928
$$ 670100555 668504181 669526978 669764938 669332809 671297226 673654327 674761734 674772110 675555038
551.6F75555038m26025j163559k10037l79028p94678k682877q02307J670380K024994
$$ 675555038 675129013 673965454 673755417 673376389 672581711 669898834 669096527 670766907 672791901
560.3F72791901J664123J50452R40933Q6670q89587j351853j056290k35061k255325
$$ 672791901 674456024 674606476 675547409 675634079 674744492 673392639 672336349 672101288 669845963
569F69845963k12098K074738J923904J258011M6539m38613j508408k413483j929245
$$ 669845963 669633865 671708603 673632507 674890518 674937057 674498444 672990036 670576553 668647308
577.7F68647308k05841q9493k96936L13721L62778K090530J398087L73306q5297q39233
$$ 668647308 668441467 668351974 668055038 668368759 668731537 670822067 672220154 672593460 672508163 671668930
587.3F71668930n37186m94918n38788j405869l15475N48935R69314J022187p94297
$$ 671668930 671131744 670636826 670098038 668692169 668376694 668925629 669894943 670917130 670122833
596F70122833N02625j00556k450561j876908j130294k540894k784347j559983l403091
$$ 670122833 670625458 670524902 668074341 666197433 665067139 662526245 659741898 658181915 654778824
604.7F54778824m071884m406510m296417m275474p043877q130455j1003456j2200966
$$ 654778824 650706940 646300430 642004013 637728539 630684662 622554207 611550751 599349785
612.4E99349785j1164131q553810n221177m108467k395897J44272J588288k952423
$$ 599349785 588185654 579631844 574410667 570302200 567906303 568050575 569638863 566686440
620.1E66686440n070229n745468o352501l518181L04375P436371J0319442J2003479
$$ 566686440 561616211 555870743 549518242 546000061 546304436 553740807 564060249 576063728
627.8E76063728J2310791J2287712J0390282M949799J894149r21211k668113m539223
$$ 576063728 588374519 600662231 611052513 616002312 617896461 616975250 614307137 609767914
635.5F09767914n612602n999604m762878n7907K783775P524758J2132911J3727684
$$ 609767914 604155312 598155708 593392830 593334923 596118698 603643456 615776367 629504051
643.3F29504051J2304497J1550903J1085358Q843002N255814L265991K451401K694626
$$ 629504051 641808548 653359451 664444809 673287811 678543625 681809616 684261017 686955643
651F86955643L046493J129761Q73337J676712J761169K103501J624069M24881k57111
$$ 686955643 690002136 691131897 692005234 693681946 695443115 697546616 699170685 699595566 699338455
659.7F99338455K8305J209946J527176M5395l84980J147309K466049k077255j2362595
$$ 699338455 699366760 700576706 702103882 702149277 701764297 702911606 705377655 703300400 690937805
668.3F90937805Q072968N274810K749558J624298o98547k31018P24182M53567P0496
$$ 690937805 699010773 704285583 707035141 708659439 707960892 707729874 708454056 708907623 708978119
677G08978119O27136J143417J082764J764755P95594m12751p64694j252060m5242l20282
$$ 708978119 709605255 710748672 711831436 713596191 714391785 713979034 713214340 711962280 711917038 711596756
686.7G11596756j691132p95364p26700p93457q04825j411590j293869j110306o24085
$$ 711596756 709905624 709110260 708383560 707590103 706785278 705373688 704079819 702969513 702345428
695.3G02345428j308517j720734p28531m17099n62133r79843k18354J038666P66144
$$ 702345428 701036911 699316177 698587646 698170547 697608414 696628571 696410217 697448883 698215027
704F98215027m1275M01764K205810J950836O61850J235428J345063Q73870J041642
$$ 698215027 698173752 698575516 700781326 702732162 703394012 704629440 705974503 706848373 707890015
712.7G07890015J439819J804428J371842J018066J591797J568985J623001J836319
$$ 707890015 709329834 711134262 712506104 713524170 715115967 716684952 718307953 720144272
720.4G20144272J633911J092606R9792K40021k25296m86222j70059N2262N68466n16358
$$ 720144272 721778183 722870789 722970581 723210602 722985306 722499084 722329025 722381287 722949753 722433395
730.1G22433395m40139l7156m53796r29642j074981m43573r47190m14657N30395N45120
$$ 722433395 721993256 721956100 721502304 720572662 719497681 719054108 718106918 717692261 718222656 718767776
739.7G18767776l05709j36032J607666R98687O49033R26590J668548K586976J614456
$$ 718767776 718462067 718326035 719933701 720932388 721581421 722508011 724176559 726763535 728377991
748.4G28377991J333084K110443L603973K889939J595077J711884J602859K819367
$$ 728377991 729711075 731821518 735425491 738315430 739910507 741622391 743225250 746044617
756.1G46044617K309341J242447J736069J668701Q34885K70996n5848n44433p30820
$$ 746044617 748353958 749596405 751332474 753001175 753836060 754107056 754051208 753506775 752775955
764.8G52775955r13696o38199n17349k23160k23694m49676k28958J133804K440414
$$ 752775955 751862259 751224060 750706711 750483551 750259857 749810181 749581223 750715027 753155441
773.5G53155441M10080J07422J961136J964188O84967M23889J811294J300507J912918
$$ 753155441 753565521 753672943 755634079 757598267 758283234 758707123 760518417 761818924 763731842
782.1G63731842K426148J045837O03027R83200K056275O97479j061325p09076Q73184
$$ 763731842 766157990 767203827 767806854 768790054 770846329 771543808 770482483 769773407 770646591
790.8G70646591Q36182k38571q0262L77732R01413o08826j61133R34143K65427L2043
$$ 770646591 771482773 771244202 771163940 771541672 772443085 771834259 771673126 772607269 772872696 772904739
800.5G72904739m12750n80749p19605P05948k0447o16913J7167L91998J302337l59039
$$ 772904739 772491989 771911240 771191635 771897583 771877136 771260223 771277390 771669388 772971725 772612686
810.1G72612686J220093J142731q66089n74570r35516N54657M22744O03104j08871
$$ 772612686 773832779 774975510 774109421 773534851 772599335 773153992 773576736 774179840 774070969
818.8G74070969p74765Q35952J85776l43170l10288n64956j875611j513671j201706
$$ 774070969 773296204 774132156 774317932 773974762 773664474 773099518 771223907 769710236 768508530
827.5G68508530j262513m25262j510544j531524k105866k435379l169556m041214k926406
$$ 768508530 767246017 766820755 765310211 763778687 761672821 759237442 756067886 752026672 749100266
836.1G49100266k875443l376846l601837k021714k036133l070983k024689j246491
$$ 749100266 746224823 742847977 739246140 737224426 735188293 732117310 730092621 728846130
843.9G28846130q06350j024247j91726k14005p25479Q28018J451187K086716L056107
$$ 728846130 728039780 727015533 726823807 726609802 725884323 726712341 728163528 730250244 733306351
852.5G33306351L056183J817398J703109K614899K665863K921219K990646L141251
$$ 733306351 736362534 738179932 739883041 742497940 745163803 748085022 751075668 754216919
860.3G54216919J555099O94123J446380J650849J669235J044312O74591O66656J261368
$$ 754216919 755772018 756466141 757912521 759563370 761232605 762276917 762951508 763618164 764879532
868.9G64879532L59802L17764O78025o3401J078492M89502J87454J169052K35596j191636
$$ 764879532 765239334 765557098 766235123 766171722 767250214 767739716 767927170 769096222 769331818 768140182
878.6G68140182j066970j103669k062759j988296j544800m92325j380844k196884j649247
$$ 768140182 767073212 765969543 763906784 761918488 760373688 759881363 758500519 756303635 754654388
887.3G54654388j694107j212158j174621k90833k25983l42712K51694R9411M32968
$$ 754654388 752960281 751748123 750573502 750282669 750056686 749713974 749965668 750065079 750498047
895.9G50498047k12860J5335R65805Q85315P47681N14450n59845j107178k90299j235961
$$ 750498047 750285187 750300522 751266327 752151642 752899323 753413773 752853928 751746750 751456451 750220490
905.6G50220490k214661k103729j544190j763763k234040j835098k502060k446747
$$ 750220490 748005829 745902100 744357910 742594147 740360107 738525009 736022949 733576202
913.3G33576202k058944j788559k828217l941879l284836l217468k067108j984406
$$ 733576202 731517258 729728699 726900482 722958603 719673767 716456299 714389191 712404785
921G12404785k528686j422730k027283k835846j878891j326980j693726j500473j247558
$$ 712404785 709876099 708453369 706426086 703590240 701711349 700384369 698690643 697190170 695942612
929.7F95942612o70243K08130K54975J260223K096100J828384K121735K337570K446442
$$ 695942612 695272369 695480499 695735474 696995697 699091797 700920181 703041916 705379486 707825928
938.4G07825928K597961L055039L298874L435821L061371K421570K465362K719422
$$ 707825928 710423889 713478928 716777802 720213623 723274994 725696564 728161926 730881348
946.1G30881348K638092J606216K491760K518998R13314J214447N20249m65851k98996
$$ 730881348 733519440 735125656 737617416 740136414 741049728 742264175 742784424 742318573 742019577
954.8G42019577q88672j368790o78176j522522j709061j141281k601624k502365j878128
$$ 742019577 741130905 739762115 739083939 737561417 735852356 734711075 732109451 729607086 727728958
963.4G27728958k431793k805023k128678j629104j825791j242294j715469j298371
$$ 727728958 725297165 722492142 720363464 718734360 716908569 715666275 713950806 712652435
971.2G12652435k96554j169281r78394p31582p08085q58917j404800n58243l83377
$$ 712652435 712355881 711186600 710208206 709476624 708768539 707909622 706504822 705946579 705563202
979.8G05563202j186524j921539j696853n99442p95517j730881k463760k284393k405243
$$ 705563202 704376678 702455139 700758286 700158844 699363327 697632446 695168686 692884293 690479050
988.5F90479050l241959l523407m388275n313568p040329r316330j1181259q600960
$$ 690479050 687237091 683713684 679325409 674011841 666971512 657655182 646473923 637872963
996.2F37872963J728859R140320Q975677N684891K413330J45569m70352m80805p09152
$$ 637872963 639601822 648742142 657717819 663402710 665816040 665961609 665491257 665010452 664301300
1004.9F64301300r70383j289062o55441n80979r11941p59735o81839j269608k557220
$$ 664301300 663330917 662041855 661386414 660805435 659893494 659133759 658451920 657182312 654625092
1013.6F54625092k437668k759476k670593j812058j834106j855850k748528k630653
$$ 654625092 652187424 649427948 646757355 644945297 643111191 641255341 638506813 635876160
1021.3F35876160k007447j570167j919251k230262k253762l040237k196961k274208
$$ 635876160 633868713 632298546 630379295 628149033 625895271 622855034 620658073 618383865
1029F18383865k717552k653351j926117j487655j552658r54819k168274j510544j447601
$$ 618383865 615666313 613012962 611086845 609599190 608046532 607091713 604923439 603412895 601965294
1037.7F01965294j389122k69013j301078j920510j324310P75871K69470k68287m68216
$$ 601965294 600576172 600307159 599006081 597085571 595761261 596537132 596806602 596538315 596070099
1046.4E96070099k70844J389237R91669Q42971o42738n16586J2016j49879j83106j004105
$$ 596070099 595799255 597188492 598180161 599023132 598380394 597863808 597875824 597725945 597542839 596538734
1056E96538734P47948J98593o62689l04069J67884j49994j420173j090317r77287j87645
$$ 596538734 597286682 597485275 596822586 596518517 596686401 596536407 595116234 594025917 593048630 592860985
1065.7E92860985j087227o80580k28768j40876M39453j883698j434479j391220o48422
$$ 592860985 591773758 591093178 590864410 590723534 591162987 589279289 587844810 586453590 585805168
1074.4E85805168l37219n70870L21274j706848j109047r25865q14552k20566l55034
$$ 585805168 585467949 584897079 585218353 583511505 582402458 581476593 580662041 580441475 580086441
1083E80086441j061745j486053q0834j902313k095337k796173m311180m279365m343033
$$ 580086441 579024696 577538643 577457809 575555496 573460159 570663986 566352806 562073441 557730408
1091.7E57730408m032288o910972p757378p924423p530442q014564q538895q156166
$$ 557730408 553698120 546787148 539029770 531105347 523574905 515560341 507021446 498865280
1099.4D98865280j0155296q330956q781547q289795q979721r002342p875061r982567
$$ 498865280 488709984 480379028 471597481 463307686 454327965 445325623 437450562 427467995
1107.1D27467995p511406q428803p153167p595520p094269n205918n462608k523727
$$ 427467995 419956589 411527786 404374619 396779099 389684830 384478912 379016304 376492577
1114.9C76492577l802262p49130j012726L84255Q96835n63164K397461O11382K699089
$$ 376492577 372690315 371941185 370928459 371312714 372209549 371646385 374043846 374655228 377354317
1123.5C77354317Q33931J453437J300545q44002K68784j699753J11008j490402p08466
$$ 377354317 378188248 379641685 380942230 380098228 380367012 378667259 378778267 377287865 376579399
1132.2C76579399k776756l590470k012443l713417p73621l185272j437645j641159
$$ 376579399 373802643 370212173 368199730 364486313 363712692 360527420 359089775 357448616
1139.9C57448616j719437j409187l712311j286201l615341k135811l714447k228585
$$ 357448616 355729179 354319992 350607681 349321480 345706139 343570328 339855881 337627296
1147.6C37627296n43632k682457l88985j235237J128655n83535P28608J482582J131439
$$ 337627296 337083664 334401207 334012222 332776985 333905640 333322105 334050713 335533295 336664734
1156.3C36664734K176437O59714L769341J299285L215180L691025L161583M307479
$$ 336664734 338841171 339500885 343270226 344569511 347784691 351475716 354637299 358944778
1164C58944778L397789O463166N163078O337929N490951O714211P439461O351051P889557
$$ 358944778 362342567 368805733 373968811 380306740 385797691 392511902 399951363 406302414 414191971
1172.7D14191971O010361Q567848P668190P728767P836838O942139P507362O093178
$$ 414191971 420202332 428770180 436438370 444167137 452003975 458946114 466453476 472546654
1180.4D72546654P686119O442222O755448N840339N353013O067390M709892N274391
$$ 472546654 480232773 486674995 493430443 499270782 504623795 510691185 515401077 520675468
1188.1E20675468M180794N038109L869247M030724M297333L189087M605407L371964
$$ 520675468 524856262 529894371 533763618 537794342 542091675 545280762 549886169 553258133
1195.9E53258133M477806M497604M489098M843063M726334M894791L060379M039878
$$ 553258133 557735939 562233543 566722641 571565704 576292038 581186829 584247208 588287086
1203.6E88287086L816185L331833L285599L133049L065910K412911L159599K580338
$$ 588287086 592103271 595435104 598720703 601853752 604919662 607332573 610492172 613072510
1211.3F13072510K882423K294960J776467K077598J303330J435165J076698J377297
$$ 613072510 615954933 618249893 620026360 622103958 623407288 624842453 625919151 627296448
1219F27296448Q70285O97479O60210M17518Q83484J01052M92668N55305M16527R1209
$$ 627296448 628166733 628864212 629524422 629941940 630825424 630926476 631419144 631974449 632390976 632482185
1228.6F32482185L73459Q56285M14658Q82149P7591N49125R05075Q24280P40509L17574
$$ 632482185 632855644 633711929 634126587 635008736 635086327 635635452 636540527 637364807 638105316 638422890
1238.3F38422890J070594J2398J35422M65736M40751O21337N35889P79038P6828P87887
$$ 638422890 639493484 639505882 639641304 640107040 640547791 641169128 641705017 642484055 642560883 643348770
1247.9F43348770L18451N8899J32523J00021R74121K33002L71780j68304M67910Q76618
$$ 643348770 643667221 643726120 643858643 643958664 644932785 645165787 645537567 645369263 645837173 646713791
1257.6F46713791J80893J047821M19845M06418M77066P29294N54505p3319L84598Q15735
$$ 646713791 646894684 647942505 648362350 648768768 649245834 649975128 650529633 650456314 650840912 651656647
1267.2F51656647J362533Q33283J307678J689682J472778J349869J469421J653748
$$ 651656647 653019180 653852463 655160141 656849823 658322601 659672470 661141891 662795639
1274.9F62795639R52606J803971J808548J046752J425324K279816K260055J640396
$$ 662795639 663748245 665552216 667360764 668407516 669832840 672112656 674372711 676013107
1282.7F76013107J985474J783066J788025J334991J156006J348953J351090K043457
$$ 676013107 677998581 679781647 681569672 682904663 684060669 685409622 686760712 688804169
1290.4F88804169J870727J945038J963348K292481K057953J182632J253739P80258
$$ 688804169 690674896 692619934 694583282 696875763 698933716 700116348 701370087 702150345
1298.1G02150345R64737J410141J052627O40335Q00171J170960J147842J243057P52411
$$ 702150345 703115082 704525223 705577850 706218185 707018356 708189316 709337158 710580215 711332626
1306.8G11332626Q83103J183853O72226M34646J6480R3613L05709J66169O50482J183014
$$ 711332626 712215729 713399582 714071808 714506454 714522934 714616547 714922256 715088425 715738907 716921921
1316.4G16921921J126251R66263J106033M38080J63040O31867N00793K62451K25525
$$ 716921921 718048172 719014435 720120468 720558548 720721588 721353455 721854248 722116699 722342224
1325.1G22342224M44260Q31604Q05359K77710M38003R15909M67148L33938J23825k11257
$$ 722342224 722786484 723618088 724423447 724701157 725139160 726055069 726522217 726856155 726979980 726768723
1334.7G26768723n56641r32617n76935j098557l62091O38352J051254J476364M45557
$$ 726768723 726212082 725279465 724702530 723603973 723241882 723880234 724931488 726407852 726853409
1343.4G26853409K96249K13013m33731o59180q25119p56225o12183j15585l32642n9433
$$ 726853409 727149658 727362671 726928940 726269760 725444641 724688416 724076233 723960648 723628006 723568573
1353.1G23568573L66669J82266j15433O5232L50952m63639l98712j274185j316223
$$ 723568573 723935242 724117508 724002075 724067307 724418259 723954620 723555908 722281723 720965500
1361.7G20965500n62821j420364J012802N50308l79104J755o89087n63660n55801j126328
$$ 720965500 720402679 718982315 719995117 720545425 720166321 720168076 719478989 718915329 718359528 717233200
1371.4G17233200r83810q13904j887512j553650L90930N95169K060M05807O95725k00272
$$ 717233200 716249390 715435486 713547974 711994324 712385254 712980423 712982483 713388290 714084015 713883743
1381G13883743j05743m50821j213608l22800O92826N7983j548309J096878J929703
$$ 713883743 713778000 713327179 712113571 711790771 712483597 712541580 710993271 712090149 714019852
1389.7G14019852R00802L81928J79214M72107j549988k554397K80456K34528l69949
$$ 714019852 714920654 715302582 715481796 715953903 714403915 711849518 712129974 712364502 711994553
1398.4G11994553k798310o42166J364288J42441K20871J85471j730652o20728L17765
$$ 711994553 709196243 708554077 709918365 710060806 710281677 710467148 708736496 708115768 708433533
1407.1G08433533m63181m95071q25806q47168n55191l13568M28390L93830J67465l81622
$$ 708433533 707970352 707475281 706649475 705802307 705247116 704933548 705361938 705755768 705923233 705541611
1416.7G05541611N1880N94711l929443P79876K274018L01818n87768r82132J272507
$$ 705541611 705593491 706188202 702258759 703038635 705312653 705614471 705026703 704044571 705317078
1425.4G05317078J715927P48977R49784J55868o62231Q70209R56039j65710K86102
$$ 705317078 707033005 707781982 708731766 708887634 708225403 709095612 710051651 709885941 710172043
1434.1G10172043J876831J264267m390564K62909L305740J623917R31854Q67157r7122
$$ 710172043 712048874 713313141 708922577 709185486 712491226 714115143 715046997 715914154 715817032
1442.7G15817032M86603N75103J90430J60675m59442p90787J248856J442489M73938
$$ 715817032 716303635 716878738 717069168 717229843 716770401 715979614 717228470 718670959 719144897
1451.4G19144897O26908L61481P91854P72324M93469k129898m816360K948455L724823
$$ 719144897 719771805 720133286 720925140 721697464 722190933 720061035 715244675 718193130 721917953
1460.1G21917953L187867J380386Q90656J925735k499008M00543L078079J813050R67331
$$ 721917953 725105820 726486206 727376862 729302597 726803589 727204132 730282211 732095261 733062592
1468.8G33062592Q90274J866531j38702k645340J1062M452896M267121P7133J640930
$$ 733062592 733952866 735819397 735680695 733035355 733046417 737499313 741766434 741843567 743484497
1477.5G43484497K908402J669082J141358K5940N16815J032638P28455O72378O31714
$$ 743484497 746392899 748061981 749203339 749229279 749746094 750778732 751507187 752179565 752811279
1486.1G52811279j069870j404419J270371k248993j737518K196960J555252L77731
$$ 752811279 751741409 750336990 751607361 749358368 747620850 749817810 751373062 751750793
1493.8G51750793m119j192398o166916K235641R4376k295838J549073r8648l88566
$$ 751750793 751746674 750554276 744387360 746623001 746717377 744421539 745970612 745871964 745483398
1502.5G45483398j81350N00107m9897m495315p988358j433792K208328j36184J896438
$$ 745483398 745302048 745802155 745752258 741256943 733268585 731834793 734043121 733906937 735803375
1511.2G35803375j240921k343063R93652j237182j136551m223404k496186L911210
$$ 735803375 734562454 732219391 733213043 731975861 730839310 726615906 724119720 728030930
1518.9G28030930K249679m558945o289749K592163L159180J757965l008804O7749N21240
$$ 728030930 730280609 725721664 719431915 722024078 725183258 726941223 723932419 724000168 724521408
1527.6G24521408k040405J92795N70068l98560l99704j584930m331207K300186J548920
$$ 724521408 722481003 722673798 723243866 722845306 722445602 720860672 716529465 718829651 720378571
1536.3G20378571Q33282J654282q457032r685974N772858K293930j532974K648849
$$ 720378571 721211853 722866135 714409103 704723129 710495987 712789917 711256943 713905792
1544G13905792P88193j982422L423233J804505J331253j472168k419053K934800J350860
$$ 713905792 714693985 712711563 716134796 717939301 719270554 717798386 715379333 718314133 719664993
1552.7G19664993P94144m004135P94678M609680L131637k031097j8171082J0384293
$$ 719664993 720459137 716455002 717249680 721859360 724990997 722959900 704788818 715173111
1560.4G15173111O897659L463974J690750m1580j805878J25657J734695Q48312j99585
$$ 715173111 722070770 725534744 727225494 727183914 725378036 725503693 727238388 728086700 727887115
1569.1G27887115n367736J835479K136841J69296O53992P21588j282348r613648L122025
$$ 727887115 722519379 724354858 726491699 726660995 727314987 728036575 726754227 717140579 720262604
1577.7G20262604J835251n89447o90003j489105j97678j423645r58481j034851j603698
$$ 720262604 722097855 721508408 720818405 719329300 719131622 717707977 716749496 715714645 714110947
1586.4G14110947j550751j987915j068726k337112j311798k236557j881638k104568
$$ 714110947 712560196 710572281 709503555 707166443 705854645 703618088 701736450 699631882
1594.1F99631882k871247q45337k003860r82361k174606j641083k016754k852554k443238
$$ 699631882 696760635 695915298 693911438 692929077 690754471 689113388 687096634 684244080 681800842
1602.8F81800842l681488r23156k219086j939850k179337j951217k275162k881165
$$ 681800842 678119354 677196198 674977112 673037262 670857925 668906708 666631546 663750381
1610.5F63750381k20565k642670k026901k850342p57828j591644j1439972K452927
$$ 663750381 663529816 660887146 658860245 656009903 655252075 653660431 642220459 644673386
1618.2F44673386O8893p1945j769028j01623j958084o813546R48181p26814N2681m381523
$$ 644673386 644742279 644670334 642901306 642799683 640841599 634028053 634976234 634249420 634302101 629920578
1627.9F29920578k450027J37443r68704n53627j870270R05457J7242o148224k801895
$$ 629920578 627470551 627607994 626639290 626085663 624215393 625120850 625138092 618989868 616187973
1636.6F16187973J096153K47956M42161R72824j461372R10873l62320J290703J873017
$$ 616187973 617284126 617532082 617974243 618947067 617485695 618396568 618034248 619324951 621197968
1645.3F21197968k834816j175423k198296M291268K246895L063354K817802l640403
$$ 621197968 618363152 617187729 614989433 619280701 621527596 624590950 627408752 623768349
1653F23768349p298546K656479O208534K564430K465782J512375J868973K185555J404457
$$ 623768349 616469803 619126282 625334816 627899246 630365028 631877403 633746376 635931931 637336388
1661.6F37336388Q35037n94788L958168K458115K249603K397843J628723n18265L94669
$$ 637336388 638171425 637576637 641534805 643992920 646242523 648640366 650269089 649750824 650145493
1670.3F50145493M117507J303101M103165M137268R53827k81906K928009L922958K097168
$$ 650145493 654263000 655566101 659669266 663806534 664760361 664478455 667406464 671329422 673426590
1679F73426590K244644J93939L501892M936982k058182l967514N187912P390060L695450
$$ 673426590 675671234 675865173 679367065 684304047 682245865 678278351 683466263 690856323 694551773
1687.7F94551773J860809K903138J662368L349839K655410K601242L783341L651276
$$ 694551773 696412582 699315720 700978088 704327927 706983337 709584579 713367920 717019196
1695.4G17019196l538285L849488O447296N767746K178192o560822P773972N289383
$$ 717019196 713480911 717330399 723777695 729545441 731723633 725162811 732936783 738226166
1703.1G38226166K395096J970367K482986J390915K854538M412995J842499P49511
$$ 738226166 740621262 742591629 745074615 746465530 749320068 753733063 755575562 756325073
1710.8G56325073K653580K392883K101746j441574r63440M214172R76486n408020N266114
$$ 756325073 758978653 761371536 763473282 762031708 761068268 765282440 766258926 760850906 766117020
1719.5G66117020M341583K111206J485062L39126K99454J381531P10525O12183R07211
$$ 766117020 770458603 772569809 774054871 774393997 774693451 776074982 776785507 777397690 778304901
1728.2G78304901R84955j863403n36805L611222K424927l869401n149383N711822M027710
$$ 778304901 779289856 777426453 776889648 780500870 782925797 779056396 773907013 779618835 783646545
1736.9G83646545J155243K164307j917114k734604M241028K301407j242524J233445
$$ 783646545 784801788 786966095 785048981 782314377 786555405 788856812 787614288 788847733
1744.6G88847733L428726J612243P23267N7907l68194M029541O37512r71604L698349
$$ 788847733 792276459 793888702 794611969 794669876 794301682 798331223 798968735 797997131 801695480
1753.3H01695480K420578J984253J213684k291717J218719K484360K211762K634048
$$ 801695480 804116058 806100311 807313995 805022278 806240997 808725357 810937119 813571167
1761H13571167l463516r32312L401336J037293L49426J450806Q65402k671967J941376
$$ 813571167 810107651 809175339 812576675 813613968 813963394 815414200 816279602 813607635 815549011
1769.7H15549011K987671j503677m681015p17392N265655J890564j411743J523819
$$ 815549011 818536682 817033005 812351990 811634598 816900253 818790817 817379074 818902893
1777.4H18902893M05502O99082j39923j100998J583023J824188P72934j158218k6856
$$ 818902893 819308395 820007477 819867554 818766556 820349579 822173767 822946701 821788483 821761627
1786H21761627J481323M83857K89764Q61130j074524j195374k434463L92608M001999
$$ 821761627 823242950 823726807 824016571 824877701 823803177 822607803 820173340 820565948 824567947
1794.7H24567947P14875j151505J251984J785278o26602j765823J469345q93784k0447
$$ 824567947 825282822 824131317 825383301 827168579 826541977 824776154 826245499 825351715 825331268
1803.4H25331268J837311N83420N74341r461k9602Q06809J72577j704789J12076J047592
$$ 825331268 827168579 827751999 828326340 828316879 828287277 829094086 829266663 827561874 827673950 828721542
1813H28721542M49448N56030k9831L17078k59476M19007Q44345k4033M11453l09219
$$ 828721542 829170990 829727020 829697189 830014267 829754791 830173798 831018143 830994110 831405563 831096344
1822.7H31096344P55997K56576l424835N11017K563858J750412j007004n063705J422500
$$ 831096344 831852341 832108917 828684082 829195099 831758957 833509369 832502365 827438660 828861160
1831.4H28861160K973786N04684M89731O15921K41470o55822o72150Q73108j21613
$$ 828861160 831834946 832339630 832829361 833445282 833686752 833030930 832358780 833231888 833110275
1840.1H33110275M13513N4245R04999O30493n669250K262421K752151p12357q44573
$$ 833110275 833523788 833578033 834483032 835113525 829444275 831706696 834458847 833746490 832901917
1848.7H32901917P38754Q38241K1439M83246o333J93711R2621J08108M11072k20642
$$ 832901917 833640671 834478912 834500351 834983597 834977264 835170975 835263596 835371704 835782776 835562134
1858.4H35562134J22070l30200m1199j20086R3917K73362O3324O34231l0060M30146
$$ 835562134 835684204 835354004 835312805 835192719 835286636 835559998 835623322 836257553 836227493 836657639
1868H36657639k169495k002335K009278J610412N81665k29568J93634M120K7389J68305
$$ 836657639 834488144 832485809 834495087 836105499 836687164 836457596 836651230 836655350 836682739 836851044
1877.7H36851044m5929k671k67257M21142J46942K59247Q164k20948J86463o4087Q63647
$$ 836851044 836805115 836802444 836535187 836956329 837103271 837362518 837370682 837149734 837336197 837272110 838135757
1888.3H38135757j027603k440414J030197J366272L16772J92414n65033j136017P45544
$$ 838135757 837108154 834667740 835697937 837064209 837380981 837573395 837008362 835872345 836617889
1896.9H36617889O84281K20718R4986n55725k08511M8141L01132L4180K91672L73764
$$ 836617889 837302170 837522888 837617874 837062149 836853638 836901779 837202911 837237091 837528763 837902527
1906.6H37902527k37503k99835l80326p91549j87455R04923K04544L72848l6468J82800
$$ 837902527 837665024 837365189 836984863 836193314 836005859 836910782 837115326 837488174 837451706 837634506
1916.2H37634506J185608k585220q20770J597213O04554J92108j706772n21317J089325
$$ 837634506 838820114 836234894 835414124 837011337 837615891 837807999 836101227 835579910 836669235
1924.9H36669235O27976q7052p2860J9836k20947K85110L10669K365n04532j98364
$$ 836669235 837297211 837210159 837137299 837157135 836936188 837221298 837531967 837534332 837029800 836831436
1934.6H36831436J4420N8365O4239l71475J02081k14386N62973j45416k251511Q96988
$$ 836831436 836845856 836904221 836968460 836596985 836699066 836484680 837047653 836902237 834650726 835547714
1944.2H35547714J081467l69644j75400K56653L29590k77863k47650O6528O8131K42004
$$ 835547714 836629181 836259537 836084137 836340790 836670380 836392517 836144867 836211395 836279526 836521530
1953.8H36521530j23749m90722K23846L82538j144o5461j96533j51367j31149j02997
$$ 836521530 836397781 835907059 836130905 836513443 836512299 836446838 836250305 836098938 835967789 835864792
1963.5H35864792l16773j15280o5994p19299J43127P93305L23944N8975K5024k95715
$$ 835864792 835548019 835432739 835366745 834647446 834790573 835583878 835907822 835966797 835991821 835696106
1973.1H35696106l12424p6O1264q5526l88259n2796J46485K28L06j51978m2419n6534
$$ 835696106 835383682 835383606 835444870 835359344 834971085 834918289 835064774 835065002 835065308 834913330 834870911 834814377
1984.7H34814377j12076j27563k60239o37741m08631O42167K13241j181106O7062J259079
$$ 834814377 834702301 834574738 834314499 833676758 833268127 833910294 834123535 832942429 833009491 834268570
1994.3H34268570L43628j87607j92947k95868j58615k18964Q8806j46408j98669K55355
$$ 834268570 834612198 834424591 834231644 833935776 833777161 833558197 833647003 833500595 833301926 833557281
2004H33557281L03269J47552l36303k62146k03476l00751k73514k68783j92871j33896
$$ 833557281 833860550 834008102 833671799 833409653 833206177 832905426 832631912 832363129 832170258 832036362
2013.6H32036362L93219N40695k55966q22907K71225N35431l24020l80936m83017j7013
$$ 832036362 832429581 832970276 832714310 831891403 832162628 832698059 832374039 831993103 831510086 831493073
2023.3H31493073K79006o485j51519r9411L99627L54004n1803k93503q1406k84729
$$ 831493073 831772079 831765594 831614075 831514664 831914291 832268295 832216492 831922989 831841583 831556854
2032.9H31556854n69000r0103l9673l17917l65066R1323M00315M37393J35498o1111
$$ 831556854 830987854 830897751 830858078 830540161 830175095 830266418 830666733 831104126 831239624 831178513
2042.6H31178513j21613n84488l50494l62168o3858R2011j23291J81122J18560M95530
$$ 831178513 831056900 830472412 830121918 829759750 829695892 829787903 829664612 829845734 829964294 830459824
2052.2H30459824K11105j2207q4610l66211n7144n57861m09928l70636n64499j54953
$$ 830459824 830670929 830658722 830574112 830207901 830150757 829592896 829182968 828812332 828247833 828092880
2061.9H28092880J62812O82525J95313l67966n2948R0256k39563l21884n48172r34449
$$ 828092880 828255692 828938217 829133530 828765564 828712616 828802872 828563309 828241425 827693253 826758804
2071.5H26758804n54351m63639q8348L02200J33286K39563J90963m62112o42395J26800
$$ 826758804 826204453 825740814 825652466 825954666 826087952 826327515 826518478 826056366 825413971 825540771
2081.1H25540771j61590o44226m20304j02920K64358K86026L38593J58005j01013l74680
$$ 825540771 825379181 824734955 824314651 824211731 824476089 824762115 825100708 825258713 825157700 824783020
2090.8H24783020j71585P0953R690j30463m42963J79215o867r5062P36771N91964L96271
$$ 824783020 824611435 824682388 824692078 824561615 824118652 824297867 824291000 824195938 824932709 825524673 825920944
2101.4H25920944Q6365l7842P2556K25067r6512m96445j14441k68402j19476N82733
$$ 825920944 826007309 825969467 826042023 826267090 826170578 825674133 825559692 825291290 825171814 825754547
2111H25754547Q80356M03213n3863Q621P8125Q774m65317l52859l26081j89438Q0491
$$ 825754547 826634903 827038116 826984253 826992874 827070999 827079773 826614456 826261597 825935516 825746078 825826569
2121.6H25826569P3318N71137K71530k0600J45111M0131n16663q04672l40347j17645
$$ 825826569 825899887 826471024 826742554 826721954 826867065 826907196 826390533 825585861 825245514 825127869
2131.3H25127869J38015M2572K41929M23660K44140L96958M23889K68021n31159n36957
$$ 825127869 825265884 825308456 825550385 825974045 826218185 826615143 827039032 827307053 826775894 826238937
2140.9H26238937j74484j24740M3563J07727M18168J15127L36609N21698J67618L90548
$$ 826238937 826064453 825939713 825983276 826091003 826509171 826624298 826960907 827482605 827650223 828040771
2150.6H28040771J88599k88391l94821l02582o82144k59628N29098M79660N83115L61099
$$ 828040771 828229370 827940979 827546158 827243576 826561432 826301804 826830902 827310562 827893677 828254776
2160.2H28254776p5836P3089L57361j94702m05044l28598l17841m7760l14407L03344
$$ 828254776 828178940 828252029 828609390 828414688 828009644 827681046 827363205 827315445 827001038 827304382
2169.9H27304382N63202P7591q5449j59683N5542k45819m62113n97763q8043J96304
$$ 827304382 827867584 827945175 827859726 827700043 827755585 827509766 827047653 826449890 826361847 826558151
2179.5H26558151k33001P5759L20588N26657L26767J72043K10952J96228K5101l09448
$$ 826558151 826325150 826400909 826721497 827248154 827574921 827746964 827957916 828154144 828179245 827869797
2189.1H27869797j88446l88336O9046L02200J23978L81546K80380J39160L54080R83048
$$ 827869797 827681351 827293015 827362061 827664261 827788239 828169785 828450165 828589325 828943405 829926453
2198.8H29926453N8822n99670l40881m58451K85645K22397r7962J20773L66517L60260
$$ 829926453 829985275 829385605 829044724 828586273 828871918 829094315 828996353 829117126 829483643 829843903
2208.4H29843903M80499N69534j38931m62036n17044J81198K02789k74582j00632j60598
$$ 829843903 830324402 830893936 830755005 830292969 829775925 829957123 830159912 829885330 829784698 829624100
2218.1H29624100K05459K22473M72565K12784O6299K98920n34668m93393k87781k40249
$$ 829624100 829829559 830052032 830524597 830737381 830803680 831102600 830567932 830074539 829786758 829546509
2227.7H29546509k20566j6479P4081J59378M57611j6632K20032P7591J03607N2185
$$ 829546509 829325943 829309464 829383545 829542923 830000534 829983902 830203934 830281525 830385132 830437317
2237.4H30437317n19257j17111l77273k68631P7438K68707J89820K8305J41906j32217
$$ 830437317 829918060 829800949 829423676 829155045 829232483 829501190 829691010 829719315 829861221 829729004
2247H29729004l6011m13742J3580J97525l16619q6441j78147K78168M01459K46658
$$ 829729004 829692993 829279251 829292831 829490356 829173737 829087296 828909149 829187317 829588776 829835434
2256.7H29835434Q7433L1204J7548j93177L8605k83508j61286k04773k70080K43149
$$ 829835434 829922867 829954071 829971619 829778442 829817047 829533539 829372253 829167480 828897400 829140549
2266.3H29140549L11279K899p2250N58014Q8196k22626j67771k62603L8375j92718
$$ 829140549 829451828 829454727 829382477 829940491 830028687 829806061 829638290 829375687 829414062 829221344
2275.9H29221344j53351l89404k14615K36130L41720K03095L39355P07856l0823k14539
$$ 829221344 829067993 828678589 828463974 828700104 829041824 829244919 829584274 830292130 830261307 830046768
2285.6H30046768n42984o04019l36761k11030L39585j94321J54343M07638Q7281j87760
$$ 830046768 829503784 828899765 828563004 828351974 828691559 828497238 828651581 829059219 829146500 828958740
2295.2H28958740p6446P2250q53424k46582k62528k09808j449l83835K68402p9956
$$ 828958740 828882294 828954544 828101120 827854538 827592010 827382202 827380753 826996918 827265320 827185364
2304.9H27185364r0561k43149p8430l27530m72031k38113j381607L8605J0986k43912
$$ 827185364 827094803 826851654 826773224 826445694 825973663 825735550 824353943 824392548 824403534 824159622
2314.5H24159622L39050n01708J22909m28619o29578j78757L41416m80042j668014
$$ 824159622 824498672 823996964 824119873 823691254 823061676 822882919 823224335 822744293 821076279
2323.2H21076279l60108l27377k26822n34363J20468Q86460M34112Q07038l14255j417465
$$ 821076279 820716171 820388794 820161972 819627609 819748077 820634537 821068649 821875687 821561432 820143967
2332.8H20143967j240235j63955o25611p98187J47324M96139M80118l58353Q08869
$$ 820143967 818903732 818739777 818114166 817315979 817463303 817959442 818439560 818081207 818890076
2341.5H18890076k16370p14188P34559P87963J009446N39550J824417J958924o714
$$ 818890076 818673706 817959518 818694077 819482040 820491486 821031036 822855453 824814377 824807663
2350.2H24807663j775360k128220j530990j071091l37601m01687m88663M4479q91723
$$ 824807663 823032303 820904083 819373093 818302002 817964401 817562714 817074051 817118530 816226807
2358.9H16226807k095337o25763J151199Q87222J308365M42353M22973J634751R54055
$$ 816226807 814131470 813505707 814656906 815544128 816852493 817294846 817717819 819352570 820306625
2367.6H20306625j24817r8571N92117L49960P92237J089019M75464M43039R50699R49020
$$ 820306625 820181808 820083237 820675354 821025314 821817551 822906570 823382034 823825073 824775772 825724792
2377.2H25724792J067124J400299M46320M72488P23343J07117R4299J27182J92566
$$ 825724792 826791916 828192215 828638535 829111023 829834366 829941483 830035782 830162964 830355530
2385.9H30355530N0049L06320M07104k08511j22757L66974K01263m11148j26648J87989
$$ 830355530 830405579 830711899 831119003 830910492 830787735 831154709 831355972 830944824 830818176 831006165
2395.5H31006165q2398m08020m19083J06659K09351K02179J55945J7090j93253o2942
$$ 831006165 830923767 830515747 830096664 830203323 830412674 830614853 830770798 830787888 830594635 830531693
2405.2H30531693K48413l31421o00663l58886m4937K57110L33100J12609k04238q2474
$$ 830531693 830780106 830448685 829848022 829489136 829444199 829701309 830034409 830147018 829942780 829860306
2414.8H29860306R9106J43509j62049k18353k13776j99279k6780j43432J26800j69220
$$ 829860306 829959412 830102921 829940872 829722519 829508743 829309464 829282684 829139252 829266052 829096832
2424.5H29096832k50244K54059K41241o4926m97207m2878K40555k17056m74548p1335
$$ 829096832 828846588 829100647 829341888 829276962 828779755 828736877 828977432 828760376 828285828 828214493
2434.1H28214493K29721j66550j40610M2496J81275l2959J05209K9755n59388q9950
$$ 828214493 828444214 828277664 828137054 828179550 828360825 828327866 828433075 828462830 827903442 827813492
2443.7H27813492l51944m10080L56445L20282j00250l56827j42135m8676L05862L13645
$$ 827813492 827461548 827051468 827407913 827728195 827627945 827271118 827128983 827080307 827386169 827699814
2453.4H27699814k68326m68826k49329J88599j15738m32663j70212n8517q8272J45263
$$ 827699814 827431488 826962662 826713333 826901932 826786194 826353531 826183319 826124802 826036530 826181793
2463H26181793K5330k87857M9820n5695j81885q8730k33078k39791j81733J40534K25372
$$ 826181793 826207123 825919266 825969086 825913391 825731506 825642776 825409698 825169907 824988174 825128708 825354080
2473.6H25354080p1029k93274j61820j12915k44522j42517L738l0594j16272K94953
$$ 825354080 825283051 824989777 824827957 824715042 824470520 824328003 824331741 824301147 824184875 824479828
2483.3H24479828J33896l88718l50189r7504J88751k65426m72260k68860j34353L19595
$$ 824479828 824613724 824225006 823874817 823777313 823966064 823700638 823228378 822959518 822825165 823144760
2492.9H23144760L17230k09808k72064n8441m96216k47345K91748J81503J66779K3651
$$ 823144760 823461990 823252182 822980118 822921677 822425461 822178116 822469864 822651367 822818146 822841797
2502.6H22841797K01645m4480n27267l07465k28195n50690m70581J23825M6998m9973
$$ 822841797 823043442 822998962 822471695 822164230 821936035 821385345 820914764 821038589 821085587 821035614
2512.2H21035614L19366M27323k3728o06231l89939k7847r7580j06354k5940j50070
$$ 821035614 821354980 821782303 821758575 821152344 820762405 820734558 820636978 820530624 820504684 820354614
2521.9H20354614j983K7923J1978j2664m46930Q0337L08075l4103j20926l79029l66821
$$ 820354614 820352631 820380554 820392532 820379868 819932938 820013275 820321350 820287247 820166321 819787292 819420471
2532.5H19420471m07409o257K39716L4332j26266R7656J52893j87073K71683k25372
$$ 819420471 819013062 819006805 819246521 819280853 819154587 819252243 819405136 819218063 819489746 819264374
2542.1H19264374m49066L5858j48316q9950p5150K00272l52707m62723j15433p7285
$$ 819264374 818815308 818851166 818702850 818612900 818537750 818738022 818385315 817922592 817807159 817729874
2551.7H17729874M92324j22528n0811J53274m48150l80707k86408J8006L7536p7133
$$ 817729874 818222198 818099670 818048859 818202133 817753983 817373276 817086868 817104874 817142410 817065277
2561.4H17065277k18964j78222R2315J52512n0049l11661n8212j15051k49634j66550
$$ 817065277 816846313 816668091 816760406 816912918 816862869 816551208 816492996 816377945 816128311 815961761
2571H15961761L05787K46276j89285K09732n15594n66788L26691K1438j17798k81753
$$ 815961761 816267548 816513824 816324539 816534271 816018677 815451889 815778580 815800018 815682220 815400467
2580.7H15400467m95834K6931M08402n264l22800m93546k28653K54975J12076N2261
$$ 815400467 814904633 814931564 815339966 815334702 815011902 814518356 814289703 814544678 814656754 814709015
2590.3H14709015l66058m12751J15586J17645q5220l52860l91693j41983r2087j74942
$$ 814709015 814342957 813930206 814045792 814163437 814078217 813725357 813333664 813191681 813099594 812924652
2600H12924652O5765l05557j66168L49121l99933j07269J94855j79062k26593o32935
$$ 812924652 812990417 812684860 812518692 812867813 812467880 812360611 812555466 812376404 812149811 811516876
2609.6H11516876m02679J55639J45798k36130l07388j19858J58005O256l53317K1286
$$ 811516876 811114197 811269836 811415634 811179504 810872116 810752258 810910263 810916519 810563202 810584488
2619.3H10584488j1673l2654k53448p57904m41208o1264N9738q3771m0436M0741J30081
$$ 810584488 810572815 810540161 810286713 809528809 809087601 809026337 809086075 809002304 808961868 809002609 809132690
2629.9H09132690J79367l47671p30438n00031k87933l22952K56347M33502O87k23389
$$ 809132690 809312057 808964386 808233948 807733917 807445984 807123032 807379379 807812881 807813568 807590179
2639.5H07590179k48718R6283Q4381L0136k86102n49622m87365m01840j42594k79693
$$ 807590179 807341461 807437744 807522125 807552261 807266159 806716537 806229172 805827332 805684738 805405045
2649.1H05405045n5619k06985k29874K80457K0065k39792n11780k64969J4649j87607
$$ 805405045 805349426 805142441 804912567 805193024 805213089 804973297 804461517 804196548 804211197 804023590
2658.8H04023590k9449K9525k99682j73569K93655k1209k01493m89578l81088J64947
$$ 804023590 803994141 804023666 803723984 803550415 803844070 803822861 803621368 803131790 802750702 802915649
2668.4H02915649l13491k20719q0642K4261L48892m03976q03070o4621L11432J6784
$$ 802915649 802602158 802381439 802300797 802325058 802673950 802269974 801466904 801402283 801713715 801730499
2678.1H01730499M6997o0577l14484m95758m13055k91138l63846J38626J43128j32828
$$ 801730499 801777496 801716919 801402435 800906677 800493622 800202484 799838638 799977264 800120392 799987564
2687.7G99987564k46506l9673o7367o19354J52816M40674k43606n88455l84064l2273
$$ 799987564 799741058 799701385 799634018 799014664 799167480 799608154 799364548 798776093 798392029 798359756
2697.4G98359756j95999o942j62735l73307l68881k76794r2469n3100K35672j27716
$$ 798359756 798163757 798156815 797994080 797620773 797251892 796975098 796882629 796829529 797065201 796937485
2707G96937485o409r6054q04977l77045k4490P3699j26419l12042j18103k47726l59116
$$ 796937485 796931076 796835022 796030045 795653000 795628510 795702209 795575790 795263748 795145645 794897919 794538803
2717.6G94538803j33591R3842k01798k63595q4381m05274l29742J93024J4267m59824
$$ 794538803 794405212 794499054 794297256 794033661 793949280 793544006 793214264 793407288 793421555 792961731
2727.3G92961731n70526l05023N5160J86157K15836l23257j12000K08893n04379l89405
$$ 792961731 792391205 792086182 792141342 792327499 792543335 792220078 792108078 792316971 791812592 791423187
2736.9G91423187k93350k07062k22168k23236K19345k13241j46103J46637j4115l30047
$$ 791423187 791129837 790922775 790700607 790477371 790696716 790483475 790337372 790484009 790469894 790139847
2746.5G90139847n84946j14593o867l80249o23855m61579j86539O4011R7122k49557
$$ 790139847 789554901 789440308 789433441 789053192 788429337 787967758 787781219 787845230 787942352 787692795
2756.2G87692795l86887k48337M2572p3318j25046k96402l28827K35672J05515k53449
$$ 787692795 787305908 787057571 787100143 787026825 786901779 786605377 786276550 786512222 786617737 786364288
2765.8G86364288o22101m68215q240n3253Q5144M882l81011n04456k69623l01132k84424
$$ 786364288 785742187 785273972 785265732 785212479 785297623 785302505 784921494 784417038 784147415 783846283 783561859
2776.4G83561859k62070l16543j59836l55225j87378k67257n39627n18647m44107J0987
$$ 783561859 783299789 782983246 782823410 782468185 782280807 782013550 781473923 780955276 780511169 780522156
2786.1G80522156J66702K12631j81198n44128m52652l17154n1651k83432n69534n17197
$$ 780522156 780688858 780901489 780720291 780176163 779723511 779406357 779354706 779071274 778501740 777984543
2795.7G77984543j85166k42004k02026j75248p00607j82648j5716o94962n69687j19400
$$ 777984543 777799377 777557373 777355347 777180099 776479492 776296844 776281128 775586166 775016479 774897079
2805.4G74897079k88543m52042j33362j39770m47540o51398j32675j23139p07931p41730
$$ 774897079 774608536 774156494 774023132 773883362 773435822 772784424 772651749 772528610 771820679 771078949
2815G71078949l68805l4790r25369o10428J84708m70353m94766n11017l19671L2806
$$ 771078949 770710144 770675354 769749985 769139557 769324265 768853912 768359146 767848129 767528458 767561264
2824.7G67561264Q7662j51978r20410j061554o43921m29764k95639j28555m26330k36054
$$ 767561264 767648926 767496948 766576538 765514984 764871063 764441299 764145660 764017105 763590775 763354721
2834.3G63354721l72009j169129p68509l74450n60150j058655j164246j155624j426163
$$ 763354721 762982712 761813583 761045074 760670624 760110474 759051819 757887573 756731949 755305786
2843G55305786j073456p64465p20291j108856j433411j765823j651154j199646j069565
$$ 755305786 754232330 753467865 752747574 751638718 750205307 748439484 746788330 745588684 744519119
2851.7G44519119n81817r65119p06024l2577J96151L45841l49655j60370l51868m80804
$$ 744519119 743937302 742972183 742266159 742233582 742429733 742775574 742425919 742265549 741913681 741432877
2861.3G41432877k46506o43006m54864k88544r3078o11191r45206p74078o29807k52609
$$ 741432877 741186371 740543365 740088501 739799957 739706879 739095688 738150482 737376404 736746597 736493988
2870.9G36493988p26929p17544m91944j24893o9046r41086o64291k28500k21177j56936
$$ 736493988 735767059 735049515 734557571 734432678 734363632 733422546 732758255 732529755 732308578 732151642
2880.6G32151642k83203m74167m95606m01840n12848l38974n69839r75571l96881K7771
$$ 732151642 731868439 731394272 730898666 730496826 729983978 729645004 729075165 728099594 727702713 727730484
2890.2G27730484l39508o50253r77402j116791n43594j09482j62506l83530n89676
$$ 727730484 727390976 726740723 725763321 724646530 724102936 723993454 723830948 723447418 722857742
2898.9G22857742r81598r12399j65787q545k70233o78405p67365n39932l03955R0255
$$ 722857742 721876144 720963745 720797958 720789413 720519180 719840775 719073410 718533478 718229523 718319778
2908.6G18319778k47039p95822o75736l16620m91257r22470j084060q77686n27572
$$ 718319778 718072739 717276917 716601181 716284561 715793304 714870834 713786774 712909088 712381516
2917.2G12381516j175843j449508l24326J33896m83856p12662n48859l35464j52054
$$ 712381516 711205673 709756165 709431839 709565735 709081879 708369217 707820358 707484894 707332840
2925.9G07332840n24216k48489K45438J55639M74091O13174L49732P1029l99399o15844
$$ 707332840 706808624 706560135 706805573 706961212 707435303 708048477 708398209 708469238 708069839 707453995
2935.6G07453995K27737P88727P50351N00565m3488N83343R66111M29992k42233q8348
$$ 707453995 707681732 708470459 709220810 709721375 709677887 710261230 711227341 711657333 711415100 711326752
2945.2G11326752O20804j92490n90592m21524j88064K85873J50605k30179q87375o52313
$$ 711326752 711947556 711755066 711164474 710742950 710554886 710840759 710991364 710761185 709873810 709221497
2954.8G09221497N7678M93927o5079p92160j04065J88294K82363m4632l45153N09491
$$ 709221497 709279175 709773102 709708023 708915863 708811798 709000092 709282455 709237823 708892670 709402161
2964.5G09402161Q22830J74789J59226P09839L85818P04498J329728Q92639M10156
$$ 709402161 710224991 710399780 710559006 711268845 711654663 712359161 713688889 714581528 714991684
2973.2G14991684P12128P90863R2392O05163R31015Q97217N33447j25580Q23212Q89435
$$ 714991684 715703812 716494675 716587067 717192230 718123245 719020462 719553909 719428329 720251541 721140976
2982.8G21140976O10199O48575K76565L61176O67572N78079J02310R30023N85480l97873
$$ 721140976 721751175 722399750 722676315 723037491 723705063 724283142 724385452 725315475 725900955 725503082
2992.5G25503082K43073L03039M25721L80172J89514K08435j26419k95257o0654K4185
$$ 725503082 725746155 726049194 726474915 726855087 727044601 727253036 727126617 726831360 726770706 726794891
3002.1G26794891k30026K10343J21917J10474O03714K39715j15127o67038l27835K08206
$$ 726794891 726564865 726775208 726897125 727007599 727611313 727851028 727735901 727068863 726741028 726949234
3011.7G26949234o25687m68368J79291j98212l36227l06168k01492K03704k58407n09567
$$ 726949234 726323547 725855179 726034470 725836258 725500031 725193863 724992371 725196075 724937668 724428101
3021.4G24428101j71280k14539n5923k46354p10144m44412j42975j47018K31705j03150
$$ 724428101 724256821 724042282 723986359 723740005 723029861 722585449 722442474 722295456 722527161 722424011
3031G22424011q35724k92358R0103k13547n60989p52411o58188l08532l21961l28979
$$ 722424011 721588287 721295929 721386032 721172485 720611496 719859085 719200897 718892365 718570404 718241425
3040.7G18241425L1127k59780j66245k07138p07474m15191l35312o64215n06745J71738
$$ 718241425 718272552 718012772 717846527 717639389 716931915 716516724 716181412 715517197 715010452 715182190
3050.3G15182190l87878j157990m54636K02103k9602q16727q02078n08270m67682k56348
$$ 715182190 714794312 713636322 713181686 713383789 713354187 712537460 711735382 711227112 710759430 710503082
3060G10503082l20587j50375L43551R8420j053620p52868l8605l18527l91312n56183
$$ 710503082 710182495 710032120 710375671 710474091 709420471 708667603 708628998 708310471 707919159 707362976
3069.6G07362976l09524j42899k82974k96402l43628l97949j58539J22146m94079m10385
$$ 707362976 707053452 706910553 706627579 706331177 705987549 705589600 705431061 705553207 705059128 704648743
3079.2G04648743k28348n94559m21448k44369k19116n25437m48227n87005o60782j35040
$$ 704648743 704420395 703825836 703404388 703160019 702940903 702415466 701967239 701380234 700719452 700584412
3088.9G00584412J01242r2850n60379m19769o30646m96216k65045m15497n6686l19596
$$ 700584412 700685654 700592804 700032425 699612656 698982010 698485794 698220749 697805252 697748566 697428970
3098.5F97428970k9754k54441p31124p88117r20181J41907J24664k07291p8049m98352
$$ 697428970 697399216 697144775 696413651 695625534 694705353 694847260 694971924 694764633 694686584 694188232
3108.2F94188232q65860o57196p6217o77643r45816l48816m6616o21185q77685j80436
$$ 694188232 693322372 692665176 692588959 691911316 690965500 690616684 690570068 689948883 689071198 688890762
3117.8F88890762r82971j269455l03879J9303o14548j271362k67792j58539j132583
$$ 688890762 687907791 686638336 686334457 686353760 685739212 684467850 684200058 684041519 682908936
3126.5F82908936q36411M883j05820j127930j098938j87683k9449m28314q71964o71310
$$ 682908936 682072525 682077408 681971588 680843658 679744720 679557037 679527588 679099274 678227310 677556000
3136.1F77556000j99661o14777n28412k77634p52334q13370p91168o09818p60803j093826
$$ 677556000 677356339 676741562 676213150 675935516 675183182 674369812 673578644 672968826 672208023 671114197
3145.8F71114197r31397p70492m72946l33558m08248q68912n58930L0060r78699j398086
$$ 671114197 670182800 669412308 668939362 668605804 668197556 667328644 666769714 666799774 665821075 664422989
3155.4F64422989p64923n25131m96064o02188p99331o76575n73883p03964n84259m83780
$$ 664422989 663658066 663132935 662636871 662034683 661235352 660558777 659984894 659280930 658696671 658212891
3165.1F58212891n04837o81000p71790q69293q42895o89164q48007o62460o55365o64368
$$ 658212891 657708054 657027054 656255264 655385971 654543076 653853912 653005905 652343445 651688080 651023712
3174.7F51023712o66199p04422n80673q18710o03790q70209r03092m21295o82678o01959
$$ 651023712 650357513 649653091 649072418 648253708 647649918 646779709 645876617 645455322 644772644 644170685
3184.4F44170685q85697j125946l03344p3319q94546p43485m43458j264153j241836
$$ 644170685 643284988 642159042 641855698 641782379 640887833 640144348 639700890 638436737 637194901
3193F37194901r47075o78215j48011k42118p89872j122169j049614p89604j91765k81601
$$ 637194901 636247826 635569611 635421600 635179482 634389610 633267441 632217827 631428223 631236458 630954857
3202.7F30954857n54352q07419q49571o19659j277848n19981J51558p32804q52165
$$ 630954857 630400505 629593086 628743515 628123856 626846008 626326027 626477585 625744781 624892616
3211.4F24892616p25021n13611m41933o57081q58879r33647r29871p46346n14183o16607
$$ 624892616 624167595 623653984 623212051 622554970 621696091 620762444 619832573 619086227 618572044 617955437
3221F17955437n03693p22313o84509k48947k38953n23033q64677o86493m08173o42204
$$ 617955437 617451744 616729431 616044922 615795975 615557022 615033989 614169312 613482819 613074646 612432442
3230.7F12432442j038742m40827k83127p71560n48897p43294p17430o13747n26466
$$ 612432442 611393700 610952873 610669746 609898186 609349289 608605995 607888565 607274818 606748352
3239.3F06748352o86493r00574m20303m88319k83509l98559j063080r52568l53012
$$ 606748352 606061859 605161285 604740982 604252663 603969154 603570595 602507515 601554947 601201935
3248F01201935l52326r07516p21588o85501j53656j1330m08516l09791r42078q39272
$$ 601201935 600849609 599942093 599220505 598535004 598381348 598370018 597961502 597651711 596709633 595870361
3257.7E95870361p15866q05664p08465n98603k56385p81403n43900j55563l73459l20854
$$ 595870361 595154495 594348831 593640366 593041763 592785378 592003975 591460075 591304512 590931053 590610199
3267.3E90610199n73006o01959k99225k18391m56391n74264p02019o11496n94749p44019
$$ 590610199 590037193 589435234 589136009 588917618 588461227 587886963 587184944 586573448 585978699 585234680
3276.9E85234680n98068n77240m33922m04968k25716k93083n33371o83784q10700l18336
$$ 585234680 584636612 584059372 583625450 583220482 582994766 582701683 582168312 581484528 580673828 580355492
3286.6E80355492l75290l62168m54330o09131j69067j59340k04468n74150n72434o22139
$$ 580355492 579980202 579618034 579163704 578554573 578385506 578226166 578021698 577447548 576875114 576252975
3296.2E76252975n67932j59874m41093k63672p14493q96454m53491o93779j77765K4529
$$ 576252975 575685043 575525169 575084076 574820404 574105911 573209457 572755966 572062187 571884422 571908951
3305.9E71908951m88091p55424q26454l78151o3553o18630j264763j135444m83513
$$ 571908951 571420860 570665436 569838982 569460831 569397278 568778648 567513885 566378441 565894928
3314.6E65894928m60053n00450M1008l98559q32634r03015j005783o29540m16641k22511
$$ 565894928 565434875 564934425 564975433 564576874 563744240 562841225 561835442 561205902 560789261 560566750
3324.2E60566750o49414p79877r44214r91402l53317p81937m64019k68746n46570p85751
$$ 560566750 559917336 559137459 558193245 557201843 556848526 556066589 555602570 555333824 554787254 554001503
3333.8E54001503j352768m95491n84335o86951J2703q01811j071778o07490r11789
$$ 554001503 552648735 552153244 551568909 550881958 550894661 550092850 549021072 548413582 547501793
3342.5E47501793p78351k77862o87485r66454j165771j134186o18362n83764o73790
$$ 547501793 546723442 546445580 545758095 544791641 543625870 542491684 541873322 541289558 540615768
3351.2E40615768r66835r40551p44515k22778k51007j219177q63572p06100r15146
$$ 540615768 539648933 538708382 537963867 537741089 537490082 536270905 535407333 534701233 533786087
3359.9E33786087o10962m71535q77304j119041m49295o50025p03888m87365p76100
$$ 533786087 533175125 532703590 531826286 530707245 530257950 529607925 528904037 528416672 527640572
3368.6E27640572o73294q80318r25980p40013n28107o50634q76313o94885o33278m50859
$$ 527640572 526967278 526086960 525160980 524420967 523892860 523242226 522365913 521671028 521037750 520586891
3378.2E20586891n45235o08177o91147q13751n13725o49223n82047j85203m58870n68238
$$ 520586891 520041656 519433479 518742332 517928581 517414856 516765633 516183586 515998383 515539513 514971275
3387.8E14971275k26440n34973p81899l13568o59332j266480o86226k59361l25470
$$ 514971275 514744835 514209862 513427963 513114395 512455063 511188583 510502357 510242996 509917526
3396.5E09917526k34680l44086n77392l77655r3155m67987o43540k76413J56899O1073
$$ 509917526 509682846 509338760 508761368 508383713 508290558 507822571 507179031 506902618 507059517 507120590
3406.2E07120590q30269m58755m5509k68631j01471m60663j18714m13665r65767k79847
$$ 507120590 506290321 505831566 505786057 505517426 505415955 504955292 504836578 504422913 503457146 503177299
3415.8E03177299l81965n67932k1858l54310r84344M43497P23114m0245J95808l59230
$$ 503177299 502795334 502227402 502205544 501851234 500866890 501310387 502033501 501993256 502189064 501829834
3425.5E01829834k15683q3656j99776J77116O3401l6011k05727l3073r995m69169m09012
$$ 501829834 501614151 501530495 501330719 501507835 501571236 501535225 501329498 501296425 501286430 500817261 500408249
3436.1E00408249N12695K75650j39084J17340j52282O37893K03629Q8119N33677M93583
$$ 500408249 500920944 501196594 501057510 501174850 501022568 501660461 501864090 501952209 502485886 502979469
3445.7E02979469J206208j127778n89942J452903N22614o6796K8763M30184j17836
$$ 502979469 504185677 503057899 502467957 503920860 504443474 504376678 504405441 504835625 504717789
3454.4E04717789K38723M98925L99055J048699M15916J23024L29628J065865Q24813
$$ 504717789 504956512 505455437 505854492 506903191 507319107 507442131 507771759 508837624 509662437
3463.1E09662437P6409J97029L69911P32803J55335M27742J66473O2104J177444R06105
$$ 509662437 509738846 509935875 510305786 511038589 511193924 511621666 511788139 511850243 513027687 513933792
3472.7E13933792J140480R00345l50189j6403R51690Q66318O77681K51999R9983P40624
$$ 513933792 515074272 515974617 515624428 515608025 516559715 517426033 518103714 518355713 518455696 519196320
3482.3E19196320O11457J289063P84721L21007Q38966j37329K92855R00268O95534
$$ 519196320 519807777 521096840 521881561 522202568 523041534 522904205 523197060 524097328 524792862
3491E24792862O42281J209487J367226M81377J7776k05078O05850O46820M87709Q40531
$$ 524792862 525435143 526644630 528011856 528493233 528511009 528305931 528911781 529558601 530046310 530886841
3500.7E30886841J351890J285630o88553L03764J526756Q15125R15451J745682N49774
$$ 530886841 532238731 533524361 532835808 533139572 534666328 535481453 536396904 538142586 538692360
3509.4E38692360j122322J168098J756935R75419N36956K09770N30777R05381J474762
$$ 538692360 537570038 538738136 540495071 541470490 542007446 542217216 542747993 543653374 545128136
3518E45128136L82728K42729J271439J351395O14204j95198M31213J021767J545029
$$ 545128136 545510864 545753593 547025032 548376427 548990631 548795433 549226646 550248413 551793442
3526.7E51793442P03926N27458O12335J046334J336746K9259Q55216J333313J574898
$$ 551793442 552497368 553024826 553637161 554683495 556020241 556049500 556904716 558238029 559812927
3535.4E59812927J68953m15458K084960J542054J028328L21769J063347J680641Q11196
$$ 559812927 559981880 559566422 561651382 563193436 564221764 564543533 565606880 567287521 568098717
3544.1E68098717R61342M91600J387024k52839P46117J520996J755181K565002j419067
$$ 568098717 569060059 569551659 570938683 570685844 571431961 572952957 574708138 577273140 575854073
3552.7E75854073O81343J625175J090813J521568K01111J828041J474609P90253M13475
$$ 575854073 576535416 578160591 579251404 580772972 580974083 582802124 584276733 585066986 585480461
3561.4E85480461J778870J017456N2604M471131P42225j034774m24996o12602L901405
$$ 585480461 587259331 588276787 588329391 592800522 593542747 592507973 592082977 591470375 595371780
3570.1E95371780K036591J296349J760978K328720J538887J027756J585045k0371K428627
$$ 595371780 597408371 598704720 600465698 602794418 604333305 605361061 606946106 606925735 609354362
3578.8F09354362K022400M22860J256408J844063J844940M88930L698311N91087l324775
$$ 609354362 611376762 611799622 613056030 614900093 616745033 617233963 620932274 621523361 618198586
3587.5F18198586J997070K5673L217125L471183L072358O27632N2528L688698j544724
$$ 618198586 620195656 620221329 623438454 626909637 629981995 630609627 630662155 634350853 632806129
3596.1F32806129J572648L572578R10454K450065J15357J248016K785416J640930J928635
$$ 632806129 634378777 637951355 638861809 641311874 641427231 642675247 645460663 647101593 649030228
3604.8F49030228L311462K067108k431946L168412k95563k7313Q191681Q37707k434616
$$ 649030228 652341690 654408798 651976852 655145264 654849701 654822388 663014069 663851776 661417160
3613.5F61417160M326401j614685L142853M552154l74298R67255j548691M07181L208999
$$ 661417160 665743561 664128876 667271729 671823883 671449585 672416840 670868149 671275330 674484329
3622.2F74484329L366089K928848K639161K383270J727524N856552j136475j0925445
$$ 674484329 677850418 680779266 683418427 685801697 687529221 693385773 692249298 681323853
3629.9F81323853O216583N341644N983200J761322k669296K206421L600311K779312
$$ 681323853 687540436 692882080 698865280 700626602 697957306 700163727 703764038 706543350
3637.6G06543350R6512J275406K490997K427140R35134p43560K117309M020081N294342
$$ 706543350 706639862 707915268 710406265 712833405 713768539 713024979 715142288 719162369 724456711
3646.3G24456711l387528m087753O299439j53k533341j081924N997009M617539M219131
$$ 724456711 721069183 716981430 723280869 723280716 720747375 719665451 725662460 730279999 734499130
3655G34499130N456696j0041428J323776N734330J577606J305618k01263J128387M30985
$$ 734499130 739955826 729914398 731238174 736972504 738550110 739855728 739654465 740782852 741213837
3663.6G41213837J508865J632004O92596M638672K233505j811142j594085p175598
$$ 741213837 742722702 744354706 745047302 749685974 751919479 750108337 748514252 741338654
3671.4G41338654L781738R128647Q525848l068848k0707779L402176Q630753N259170
$$ 741338654 745120392 754249039 762774887 759706039 738998260 742400436 751031189 756290359
3679.1G56290359j914978L35770K600632J672745J409759j99127K05307M119644N199585
$$ 756290359 754375381 754711151 757311783 758984528 760394287 760195160 760400467 764520111 769719696
3687.8G69719696j2101822l909454R706116o022797r40781N863114R06143O59637k35290
$$ 769719696 757617874 753708420 763414536 757391739 756450958 762314072 763220215 763879852 763644562
3696.4G63644562K41546J316224m40598J942673L104858n406341k841492M739990J592484
$$ 763644562 763886108 765202332 764761734 766704407 769809265 764402924 761561432 766301422 767893906
3705.1G67893906k67945K90222K929230L873749q440628M078064N165634j4107742
$$ 767893906 767625961 767916183 770845413 774719162 766278534 770356598 775522232 761414490
3712.8G61414490M915466N059891N19943N47104K356872J565781l835297N81437N962677
$$ 761414490 766329956 771389847 771909790 772456894 774813766 776379547 772544250 773125687 779088364
3721.5G79088364m163666n831757M705277L62472p46002l414383J73569M996948J555557
$$ 779088364 774924698 769092941 773798218 774160690 773414688 770000305 770173874 775170822 776726379
3730.2G76726379N317917m657669q243637R687119K5024r775848O85959K737808O23398
$$ 776726379 782044296 777386627 769142990 778830109 778855133 769079285 769765244 772503052 773126450
3738.9G73126450L458175L903885n298767K310715J2891540j0172424k0747833J1351318
$$ 773126450 776584625 780488510 775189743 777500458 790391998 780219574 759471741 770823059
3746.6G70823059P388382P385712j767655j2817077J0826492o540909p784271O668625
$$ 770823059 778211441 785597153 783829498 771012421 781838913 775298004 767513733 774182358
3754.3G74182358N103302L106003o436387K465745O516647q557892k164001M564209
$$ 774182358 779285660 782391663 775955276 778421021 784937668 776379776 774215775 778779984
3762G78779984J457595o3247L510208l137512n445023L897705N250931j95618r429779
$$ 778779984 780237579 780174332 783684540 780547028 775102005 778999710 784250641 784055023 774625244
3770.7G74625244K197037L608932J79825N84564m38232Q68835J86921K594604J39084
$$ 774625244 776822281 780431213 780611038 781195602 780757370 781626205 781813126 784407730 784546814
3779.4G84546814q248596L044891K479782M34647J774978m328765j231079J949081
$$ 784546814 776298218 779343109 781822891 782257538 784032516 779703751 778472672 780421753
3787.1G80421753J342087J391220q12226j54800M57077K24686R6283J580429K925873
$$ 780421753 781763840 783155060 782342834 782188034 782645111 782869797 782966080 784546509 787472382
3795.8G87472382n430375n105133K901078L972549M195786q829117j0300675N045929
$$ 787472382 782042007 776936874 779837952 783810501 788006287 779177170 768876495 773922424
3803.5G73922424M611740O459198N307770j4110412m177170O579666L013687R48639
$$ 773922424 778534164 784993362 790301132 776190720 772013550 778593216 781606903 782555542
3811.2G82555542P90405j85013R42536O441192q22296j7039871M674454O300201M516754
$$ 782555542 783345947 783160934 784103470 790544662 789722366 772682495 777356949 783657150 788173904
3819.9G88173904K45896j9199448L160782N861435J967697L049622K74887m811325
$$ 788173904 788419800 769220352 772381134 778242569 780210266 783259888 783534775 778723450
3827.6G78723450L86123K547989M504624J225128j0771256L733597Q079834p224960
$$ 778723450 779109573 781657562 786162186 787387314 776616058 780349655 788429489 781204529
3835.3G81204529j396561Q958817r141922n633393P838211p174301R81827Q288574
$$ 781204529 779807968 788766785 779624863 773991470 781829681 774655380 775637207 783925781
3843G83925781l171158m462356L022842K248688P37762J350327k079315J459350N372086
$$ 783925781 780754623 776292267 779315109 781563797 782301559 783651886 781572571 783031921 788404007
3851.7G88404007o739807J483002j5303650K613144J0396957j657639j176834L171387
$$ 788404007 781664200 783147202 767843552 770456696 780853653 779196014 778019180 781190567
3859.4G81190567K559738J826172n732193Q39157P049484q571624o709824M900818
$$ 781190567 783750305 785576477 779844284 780683441 787732925 779161301 772451477 777352295
3867.1G77352295O492233P204972r961854r768066N129700P335434L303222j2785034
$$ 777352295 783844528 791049500 781087646 771319580 776449280 783784714 787087936 774302902
3874.8G74302902J299973N131607P82165K628022M845733o647339q765335O715927
$$ 774302902 775602875 780734482 781516647 784144669 788990402 782343063 773577728 780293655
3882.6G80293655J104660J974335N286713j6036835J882477N702057J364059M352646
$$ 780293655 781398315 783372650 788659363 772622528 774505005 780207062 781571121 785923767
3890.3G85923767j776657r630127K294159M064484j136856J510162J181717J672745
$$ 785923767 784147110 774516983 776811142 780875626 779738770 781248932 782430649 784103394
3898G84103394N79223j0227356N342255J525879n604477N123291m014206k078476J277313
$$ 784103394 784682617 774455261 779797516 781323395 775718918 780842209 776828003 774749527 776026840
3906.7G76026840K171555L390503k11716k33383k04773K42538L13187m27399J167069
$$ 776026840 778198395 781588898 781377182 781143799 780939026 781181564 781494751 781067352 782234421
3915.3G82234421J526031l391113l093491M303742p36771m449310K877045J955261
$$ 782234421 783760452 780369339 777275848 781579590 780842819 776393509 779270554 781225815
3923.1G81225815Q09555k821045k869186K550125J656646J394806j270218o84814K501373
$$ 781225815 782035370 779214325 776345139 778895264 780551910 781946716 780676498 779991684 782493057
3931.7G82493057k636718j621171Q66242m24271J110382J469345m54711p13273K3118
$$ 782493057 779856339 778235168 779101410 778677139 779787521 781256866 780802155 780088882 780112000
3940.4G80112000K153930J420670n649491j249313J865921L27988R75494j651382P84149
$$ 780112000 782265930 783686600 778037109 776787796 778653717 778981705 779957199 778305817 779089966
3949.1G79089966o1875k182464K511062P94297r64508j88294K72827O2561n67245Q97980
$$ 779089966 779028091 776845627 779356689 780150986 779186478 778998184 779271011 779333572 778766327 779664307
3958.7G79664307L78265O69403n50766k271728P05413J410294M64554k63748l44086
$$ 779664307 780042572 780711975 780161209 777889481 778594894 780005188 780469742 780205994 779861908
3967.4G79861908K96402o65894q63266L72773L06320M49142K58332o13633j13296l1815
$$ 779861908 780158310 779492416 778629150 779001923 779308243 779757385 780015717 779402084 779288788 779256973
3977.1G79256973N55802J42822j251068k45819K34146M6234Q93631O41174j026840
$$ 779256973 779812775 779955597 778704529 778458710 778692856 778739090 779632721 780273895 779247055
3985.7G79247055k20871M98352o29730J06583J22833Q2474L0136k59552K07367o77262
$$ 779247055 779026184 779524536 778894806 779001389 779124222 779206696 779236832 778977280 779184647 778507385
3995.4G78507385o9732Q35189K65351r1248J73950
$$ 778507385 778437653 779272842 779538193 779446945 779620895
4000.2G79620895
$$ 779620895
##END=$$ End of the data block
