##TITLE=$$ Begin of the data block
##JCAMP-DX=5.00 $$ ACD/SpecManager v 10.08
##SPECTROMETER/DATA SYSTEM=Varian
##DATE=18 Dec 2012 13:48:56
##DATA TYPE=INFRARED SPECTRUM
##DATA CLASS=XYDATA
##ORIGIN=
##OWNER=
##NPOINTS=3735
##FIRSTX=399.26403809
##LASTX=4000.35498047
##MAXX=4000.35498047
##MINX=399.26403809
##MAXY=84.17773437
##MINY=33.16494751
##XFACTOR=1.0000000000
##YFACTOR=0.000000100000000
##FIRSTY=69.14677429
##DELTAX=0.96440572
##XUNITS=1/CM
##YUNITS=TRANSMITTANCE
##XYDATA=(X++(Y..Y))
399.3F91467743Q610840l467026n077896N171738J1482772M72641L548203P040405
$$ 691467743 700078583 696611557 691533661 696705399 708188171 708660812 712209015 719249420
407G19249420j4115066m115601M424973k85569M303513K794189n49926q538514o922607
$$ 719249420 705134354 701018753 705443726 705158157 709461670 712255859 711705933 703167419 696244812
415.7F96244812k84500M285126N735855j8043366J219635M665604M762497J668625
$$ 696244812 695960312 700245438 705981293 687937927 689157562 693823166 698585663 700254288
423.4G00254288o135407k121048M532089O019669R13544j508026l506012k841950K991715
$$ 700254288 694118881 691997833 696529922 702549591 703463135 701955109 698449097 695607147 698598862
432.1F98598862j301270j696930L743820L270340o85272k640152j403427j449280k993927
$$ 698598862 697297592 695600662 699344482 702614822 701929550 699289398 697885971 696436691 693442764
440.7F93442764m691009j442719M343872L647309P89184k42691m684753l213349J736069
$$ 693442764 688751755 687309036 691652908 695300217 696089401 695846710 691161957 687948608 689684677
449.4F89684677J246872L562927J301041m217987N7068j613617k715302l603897l508301
$$ 689684677 690931549 694494476 695795517 691577530 691634598 690020981 687305679 683701782 680193481
458.1F80193481N367051J115036k598801k015610J19400k547455j581268K575379o34156
$$ 680193481 685560532 686675568 684076767 682061157 682180557 679633102 678051834 680627213 679993057
466.8F79993057J501999k54822n12237P929993M457092p712097m909974J063233l54996
$$ 679993057 681495056 681240234 680727997 688657990 693115082 685402985 680493011 681556244 681201248
475.5F81201248J258621N83802l007508R23615J738205M70657M075012K547531k733306
$$ 681201248 682459869 683043671 680036163 680959778 682697983 683168640 687243652 689791183 687057877
484.1F87057877n546494l494492J966172L470230Q55179k97394N94482m12521r75571
$$ 687057877 681511383 678016891 679983063 683453293 684308472 684011078 684605560 684193039 683217468
492.8F83217468L835526J860275k830124j605987j828232J000442M457016K147446
$$ 683217468 687052994 688913269 686083145 684477158 682648926 683649368 688106384 690253830
500.5F90253830j285400m048996j510926J235657n64575m302597k658386J573028J8387
$$ 690253830 688968430 684919434 683408508 684644165 684079590 679776993 677118607 678691635 678710022
509.2F78710022p5684O9199o20270M90799o66199k313919m91485o65436j539459Q2474
$$ 678710022 678634338 678703537 678083267 678574066 677907867 675593948 675102463 674437027 672897568 672980042
518.9F72980042q29621p22580q30688o23017M43955j223984j878815O23322J642074
$$ 672980042 672150421 671427841 670597153 669974136 670418091 669194107 667315292 667938614 669580688
527.5F69580688j310272j139068O59332J0910M60052l86352R45740J009826j306762
$$ 669580688 668270416 667131348 667790680 667801590 668261642 667875290 668821030 669830856 668524094
536.2F68524094l68348K59552J744385J496201j260224j381836j442260r94263J057129
$$ 668524094 668155746 668415298 670159683 671655884 670395660 669013824 667571564 666577301 667634430
544.9F67634430N63431k47650J465377K246628J030350k009659j489792J196366M79507
$$ 667634430 668197861 667950211 669415588 671662216 672692566 670682907 669193115 670389481 670868988
553.6F70868988j157303r30710k91061p55997P90024J391449J177444K254105O56509
$$ 670868988 669711685 668780975 668489914 667733917 668523941 669915390 671092834 673346939 674003448
562.3F74003448n51147q55026j182251m67606M9210q60748j099244N32380q11844k98081
$$ 674003448 673452301 672597275 671415024 670947418 670996628 670135880 669036636 669569016 668757172 668459091
571.9F68459091J962204J929321J13373l080291k335358n81589r99222j256714j12762
$$ 668459091 670421295 672350616 672463989 669383698 667048340 666466751 665467529 664210815 664098053
580.6F64098053J293335J499329J842117j90430l8605o3476l83759O03791j085282
$$ 664098053 665391388 666890717 668732834 668542404 668503799 668440323 668056564 668660355 667575073
589.3F67575073k19650P64389k3651n79300o485M27322p65304Q2626Q70438J069793
$$ 667575073 667355423 668119812 668096161 667516861 667510376 667937698 667172394 667255020 668125458 669195251
598.9F69195251j515960m031143l014374k690735j339188k722091m128952m177094
$$ 669195251 667679291 663648148 660633774 657943039 656603851 653881760 649752808 645575714
606.6F45575714n237121n443688o652794q918381j1487770j0920906j0885048q353996
$$ 645575714 640338593 634894905 628242111 619323730 607835960 596915054 586030006 577676010
614.3E77676010m854164l441162r72481o15463L07808k504654m214058n342712p076951
$$ 577676010 572821846 569380684 568408203 567792740 568100548 565595894 561381836 556039124 548962173
623E48962173m351005q2932P031823J0931434J3429680J2619095J0578117R233437
$$ 548962173 544611168 544528236 551560059 562491493 575921173 588540268 599118385 608351822
630.7F08351822O271820L177452m57954l453560o406594n169067n735130n489121N24979
$$ 608351822 614623642 617801094 617343140 613889580 607482986 602313919 596578789 591089668 591614647
639.4E91614647L703880Q400612J1201477J2993889J4326096J2758407R230118P394409
$$ 591614647 595318527 603719139 614920616 627914505 642240601 654999008 664229126 671623535
647.1F71623535P384644M802170J986999K328949K368240P23267K69470J055451J142730
$$ 671623535 679008179 683810349 685797348 688126297 690494537 691217804 691487274 692542725 693685455
655.8F93685455J792374K198791J424942R47419N2032o27289o69708Q75702J905060
$$ 693685455 695477829 697676620 699101562 700048981 700101013 699473724 698804016 699679718 701584778
664.5G01584778J423340K081299j439896r992676O548920M784393K687073J176758
$$ 701584778 703008118 705089417 703649521 693656845 700205765 704990158 707677231 708853989
672.2G08853989j30310M17022R36432M19159k49710J85089J003418J104508N95550
$$ 708853989 708723679 709140701 710077133 710496292 710246582 710431671 711435089 712539597 713135147
680.9G13135147N47409K21481j315917j422349J29395n1651j089783q97369q55560
$$ 713135147 713682556 713904037 712588120 711165771 711295166 711243515 710153732 709256363 708400803
689.6G08400803q92105r99146j276169k160492j238556J403656l14788k620469j237487
$$ 708400803 707508698 706509552 705233383 703072891 701834335 703237991 702923203 700302734 699065247
698.2F99065247L09448o03104j641998l01743N80750O49185M58832P65533J979447
$$ 699065247 699374695 698771591 697129593 696827850 697408600 698057785 698516617 699282150 701261597
706.9G01261597J839676J552887J478652N96085J85318J168671K016601K064667J989899
$$ 701261597 703101273 704654160 706132812 706728897 706914215 708082886 710099487 712164154 714154053
715.6G14154053J425247J681976J534958Q86078J254425J532517J233673K37426N34058
$$ 714154053 715579300 717261276 718796234 719682312 720936737 722469254 723702927 723940353 724474411
724.3G24474411M34952j298828j609574L56598J411286l07236j166992o59790K03704
$$ 724474411 724909363 723610535 722000961 722357559 723768845 723461609 722294617 721634827 721838531
733G21838531m7836k25220J2970j269149r05152k42920l0212J4343q1482J450196J743545
$$ 721838531 721790695 721565475 721578445 720309296 719404144 719161224 719131012 719145355 719063873 720514069 722257614
743.6G22257614O02570O25915J883850K396698K336960J812973J713639K750549K396011
$$ 722257614 722860184 723486099 725369949 727766647 730103607 731916580 733630219 736380768 738776779
752.2G38776779K688904J822205J395721K931671J391220O68564J495209J709060J267396
$$ 738776779 741465683 743287888 744683609 747615280 749006500 749675064 751170273 752879333 754146729
760.9G54146729J148910L58734q35724k22473p24792j092072j233597m81949Q17719
$$ 754146729 755295639 755654373 754818649 754596176 753871384 752779312 751545715 751063766 751881485
769.6G51881485N34134m60587j87225J884232M79431J42746J689071J280213K031173
$$ 751881485 752415619 751955032 751767807 753652039 754131470 754274216 755963287 757243500 759274673
778.3G59274673J359787R90983J640625J846618J451111R89151J277695J129532J414566
$$ 759274673 760634460 761625443 763266068 765112686 766563797 767552948 768830643 769960175 771374741
787G71374741N41381K2126j98517K35443R96933k21100m46854N06974J254425n18189
$$ 771374741 771916122 771938248 771739731 771975174 772972107 772751007 772304153 772811127 774065552 773547363
796.6G73547363p93380J165466R96551M56238m24805j036148r56420J88751K3193m77905
$$ 773547363 772753983 773919449 774916000 775372238 774947433 773911285 772954865 773143616 773166809 772688904
806.2G72688904J64490N7144O29120L23791L51563K37503K06527O4469j301346J2817
$$ 772688904 772853394 772910538 773539658 773863449 774215012 774452515 774659042 774723511 773422165 773434982
815.9G73434982J150360O30494n44129n62591M02221J29624k36817l84445j71738j227264
$$ 773434982 774585342 775215836 774671707 774109116 774511337 774640961 774404144 774019699 773847961 772620697
825.5G72620697j471939j504898k292023j751022j346970j853409k728881j844559
$$ 772620697 771148758 769643860 767351837 765600815 764253845 762400436 759671555 757826996
833.3G57826996j835938l499603l516617k119369k924042m275360k404633k253723
$$ 757826996 755991058 752491455 748974838 746855469 743931427 739656067 737251434 734997711
841G34997711j985245q34045j851578j878586j427459k3728R78928J03989J73187K47955
$$ 734997711 733012466 732178421 730326843 728448257 727020798 726997070 727975998 728079987 728253174 728501129
850.6G28501129J251831K961197K508392J782837K838669L836365L361359K431106
$$ 728501129 729752960 732714157 735222549 737005386 739844055 743680420 747041779 749472885
858.3G49472885K038651K503967K580566K050095P51724j18027M83780J803894K176133
$$ 749472885 751511536 754015503 756596069 758646164 759397888 759279861 759763641 761567535 763743668
867G63743668J016845N23911L84826K44446o6375R46731J312561l65295k49024N6916
$$ 763743668 764760513 765284424 765669250 765913696 765847321 766794052 768106613 767741318 767492294 767549210
876.7G67549210L64761J09558r06067j410522j328583j287384j600342j565552k846298
$$ 767549210 767913971 768023529 767117462 765706940 764378357 763090973 761490631 759925079 757078781
885.3G57078781j726379p59964j743927j175461j151657l44315Q8806j43814l67050
$$ 757078781 755352402 754592438 752848511 751673050 750521393 750177078 750265884 750122070 749755020
894G49755020m29611J47552N07737J712722O76957p78885j145j6708p43179k14463
$$ 749755020 749325409 749472961 749980698 751693420 752370377 751591492 751590347 751573639 750830460 750615997
903.7G50615997J17798j366424j569748j589814j592712j713715k677612k331848k098846
$$ 750615997 750733795 749367371 747797623 746207809 744615097 742901382 740223770 737891922 735793076
912.3G35793076k015076j965180k208328l060303l699417l188171k542267k214050
$$ 735793076 733778000 731812820 729604492 726544189 722844772 719656601 717114334 714900284
920G14900284k376251k122269k216873k570191k030258j534805j547470j438217j524277
$$ 714900284 712524033 710401764 708184891 705614700 703584442 702049637 700502167 699063950 697539673
928.7F97539673j184158p2937K16445K72828M14581R93423J831818K117157K488861
$$ 697539673 696355515 696282578 696499023 696771851 697186432 698179855 700011673 702128830 704617691
937.4G04617691K539291K980576L564224K821198K813644L368225K611084J825485
$$ 704617691 707156982 710137558 713701782 716522980 719336624 722704849 725315933 727141418
945.1G27141418K527771L366166K783126J842728J264496J504211Q88901n9891J00708
$$ 727141418 729669189 733035355 735818481 737661209 738925705 740429916 741318817 741258926 741359634
953.8G41359634j95236r36127j251907r59244j404571j499787j861343k348556j824723
$$ 741359634 741164398 740228271 738976364 738017120 736612549 735112762 733251419 730902863 729078140
962.5G29078140k056350j993027k138062k712478k629547j766053j104965j127396
$$ 729078140 727021790 725028763 722890701 720178223 717548676 715782623 714677658 713550262
970.2G13550262q40683q43353j149216r60540p50962j222000q60672l81012r13772
$$ 713550262 712709579 711866226 710717010 709756470 709005508 707783508 706922836 706541824 705628052
978.9G05628052p82776r06983j525039j857224j625519j197357j175079j856918k708435
$$ 705628052 704845276 703938293 702413254 700556030 698930511 697733154 696558075 694701157 691992722
987.6F91992722k402039k569733l300171m077453n596619p334976q868179j0542908
$$ 691992722 689590683 687020950 683720779 679643326 674046707 666711731 657843552 647300644
995.3F47300644q399353P42912Q245430Q691025N138092K934341J175385l84369r2926
$$ 647300644 638901291 639644203 647889633 656580658 661718750 664653091 665828476 665444107 665351181
1004F65351181m07104j193009j435089l73383n20935j775817j347275j536637j615905
$$ 665351181 664944077 663751068 662315979 661942596 661421661 659645844 658298569 656761932 655146027
1012.6F55146027k066040k248536j876297k037201j632308j987916k529373k823066
$$ 655146027 653079987 650831451 648955154 646917953 645285645 643297729 640768356 637945290
1020.3F37945290k254067k198906k539520j500740r43070j875038l018493k341957
$$ 637945290 635691223 633492317 630952797 629452057 628508987 626633949 623615456 621273499
1028.1F21273499j911355k660560l385201k174911j648026k201576q64220j385078
$$ 621273499 619362144 616701584 613316383 611141472 609493446 607291870 606427650 605042572
1035.8F05042572j301765j341248j554146j000519j133308l83492o42967j1406m21714
$$ 605042572 603740807 602399559 600845413 599844894 598711586 598328094 597685127 597673721 597252007
1044.5E97252007p17774m30069m01459J338349J029320L70941j37406k42424k68554
$$ 597252007 596534233 596104164 595702705 597041054 598070374 598441315 598303909 598061485 597792931
1053.1E97792931m08936n33981o50292L94707l9330J15357j59416n28641j224556j435242
$$ 597792931 597383995 596850014 596199722 596594429 596555099 596670456 596511040 595982399 594757843 593322601
1062.8E93322601j59645o16455j02997j407127j057816l57093q61206K19764n99022
$$ 593322601 593162956 592546501 592443504 591036377 589978561 589621468 588760262 588980026 588381004
1071.5E88381004P49932r88999k226944j4801n18341j233520j470108j66817o49643
$$ 588381004 589130936 588141937 585914993 585900192 585381851 584148331 582678223 582511406 581861763
1080.1E81861763q51898l59726n31349q60710j364213r01794j828232k084198l794174
$$ 581861763 581009865 580650139 580118790 579258080 577893867 576992073 575163841 573079643 569285469
1088.8E69285469m190903l430404m208794n271835p366524o600533p491493p447281
$$ 569285469 565094566 561664162 557455368 552183533 544817009 538216476 530724983 523277702
1096.5E23277702q442230q743095o756249r566116q958321r136505q609772r786224
$$ 523277702 514835472 506092377 499336128 489770012 480811691 471675186 463065414 453279190
1104.2D53279190r911728q120346r202652o274986q662872p665291p222824p052002
$$ 453279190 443367462 435247116 426044464 419769478 411106606 403441315 396218491 389166489
1112C89166489m877396n784760l226737l188172K18506q72040m15993Q80204K77252
$$ 389166489 384289093 378504333 375277596 372089424 372307930 371435890 371019897 371900101 372177353
1120.6C72177353K942848O50902J729736k08397J182175J612778m90723L06206j881104
$$ 372177353 375120201 375771103 377500839 377292442 378474617 380087395 379596672 379902878 378021774
1129.3C78021774K39334j426353j494064l010750l353996j987191l473205p87392l393288
$$ 378021774 378261108 376834755 375340691 372329941 368975945 366988754 363515549 362728157 359334869
1138C59334869j311645j646614k994118j727714k751732j660347l984413k188836l128585
$$ 359334869 358023224 356376610 353382492 351654778 348903046 347242699 343258286 341069450 337940865
1146.7C37940865j569100r83543k007523m5471j685753J375809k19841J022262R64623
$$ 337940865 336371765 335388222 333380699 333335228 331649475 333025284 332805443 333827705 334792328
1155.4C34792328J310997L097992M76303L712540J956443L395348L127098L079834
$$ 334792328 336103325 339201317 339677620 343390160 345346603 348741951 351869049 354948883
1163.1C54948883M602127L344917O160202M667130O259727N797005P193604P710418
$$ 354948883 359551010 362895927 369056129 373723259 379982986 385779991 392973595 400684013
1170.8D00684013O232071P785111N960083Q576736P817459Q292771P534027O119461
$$ 400684013 406916084 414701195 420661278 429238014 437055473 445348244 452882271 459001732
1178.5D59001732Q057785O922645P913247O105270O599731O145936N442390O184502
$$ 459001732 467059517 473982162 481895409 488000679 494600410 500746346 506188736 512373238
1186.2E12373238M685745N546646M416580M893265L964806L694191M128570L494644
$$ 512373238 517058983 522605629 527022209 531915474 535880280 539574471 543703041 547197685
1193.9E47197685M772835L801765M503785L856277M561539N474510M490814M433403
$$ 547197685 551970520 555772285 560276070 564132347 568693886 574168396 578659210 583092613
1201.6E83092613L355446M219017L673210L346329L027496L184395L451157K120971
$$ 583092613 586448059 590667076 594340286 597686615 600714111 603898506 607349663 609470634
1209.4F09470634L200722K644539K179298J994668K109718K532730J172867P72247
$$ 609470634 612671356 615315895 617495193 619489861 621599579 624132309 625305176 626077423
1217.1F26077423O41937J551133J227111O75621M30870K23046J051025L70636N85327
$$ 626077423 626719360 628270493 629497604 630173225 630604095 630827141 631878166 632248802 632834129
1225.8F32834129K40517Q9455J89094J42594N89752K52380R99298L15972M32891Q64563
$$ 632834129 633074646 633164101 633353195 633495789 634085541 634337921 635337219 635653191 636086082 636950645
1235.4F36950645P83272J004830J14746O32820M40941N96809N74417Q9035L22800K14462
$$ 636950645 637733917 638738747 638853493 639486313 639927254 640524063 641098480 641187515 641510315 641724777
1245F41724777P70035P33261R52988K89764K04621M45938l65677K70309P09687N11703
$$ 641724777 642494812 643228073 644181061 644470825 644675446 645121384 644755707 645026016 645735703 646247406
1254.7F46247406j52054N22232Q68454N32379M58756M3030R98611O59866O72150M06876
$$ 646247406 646095352 646617584 647486038 648018417 648477173 648520203 649518814 650178680 650850830 651257706
1264.3F51257706m7837P52869O18668J014251J266785J598053J196671Q04672J333389
$$ 651257706 651209869 651962738 652581406 653595657 654862442 656460495 657657166 658461838 659795227
1273F59795227J681900J539536J129684J834030J728897J565552J382370J826401K345505
$$ 659795227 661477127 663016663 664146347 665980377 667709274 669274826 670657196 672483597 674829102
1281.7F74829102J523666J891098J963501J912842J515197J082840J392289J477203
$$ 674829102 676352768 678243866 680207367 682120209 683635406 684718246 686110535 687587738
1289.4F87587738J929321J758957J828385K035522K162399K152253J553115J276246
$$ 687587738 689517059 691276016 693104401 695139923 697302322 699454575 701007690 702283936
1297.1G02283936J004867Q39539R37271R93652R92203J070709J072998J254425J355133
$$ 702283936 703288803 704128342 705065613 706059265 707051468 708122177 709195175 710449600 711804733
1305.8G11804733P54242Q03910J213989P71408R2163N5084L85208J56174R7885R10797
$$ 711804733 712558975 713362885 714576874 715348282 715440445 715495529 715880737 716036911 716134796 717045593
1315.4G17045593J072159N39932P64389R07746Q32367R91363O33469K92129J18332
$$ 717045593 718117752 718657684 719422073 720329819 721162186 722153549 722787018 723079147 723197479
1324.1G23197479J16883N26809J080399J206360M53643J99814O42548L73688j17646
$$ 723197479 723314362 723841171 724921570 726127930 726581573 726781387 727423935 727797623 727679977
1332.8G27679977m8980K61764p07092j519623l07388k12555k87552J85089J044998
$$ 727679977 727630997 727892761 727185669 725666046 725358658 725146103 724858551 725043640 726088638
1341.5G26088638J417237N25283L67279K49100k35595n80292o45752o57807j010818
$$ 726088638 727505875 728031158 728398437 728647537 728411942 727831650 727185898 726528091 725517273
1350.2G25517273k86102p4463N4703M16107K27508k42157k38418L6392j71051K72369
$$ 725517273 725231171 725156708 725211411 725627518 725855026 725612869 725374451 725410843 725239792 725512161
1359.8G25512161j160202j909637j053162j615524J310730Q37326l56827K69852o61392
$$ 725512161 724351959 722442322 721389160 719773636 721084366 721921692 721564865 721834717 721173325
1368.5G21173325q10852m85688j000747q37861j291351k306137j146088N42527P33261
$$ 721173325 720362473 719876785 718876038 718038177 716746826 714440689 713294601 713837128 714570389
1377.2G14570389l3035K85949N10712j61057M0055n38330j005631n21927M67453L45688
$$ 714570389 714537354 714823303 715334015 715172958 715213013 714674683 713669052 713147125 713614578 713960266
1386.8G13960266j776276J105652K068482R44366P17316M51431L33481j742706k413636
$$ 713960266 712183990 713289642 715358124 716302490 717019806 717471237 717804718 716062012 713648376
1395.5G13648376L22342L00751m39224k838745n58396J254120P3090M5166J33133j451874
$$ 713648376 713970718 714271469 713832245 710993500 710435104 711689224 711762314 711807480 711940613 710488739
1405.1G10488739o41479K88772n93414q08335p21359o65664p40128k36435O54373L63693
$$ 710488739 709847260 710136032 709542618 708734283 708012924 707347260 706607132 706370697 707025070 707388763
1414.8G07388763j5411o45065j75247M29916m174347Q77762K774429Q50678n73120
$$ 707388763 707373352 706728287 706553040 706982956 702808609 703686371 706460800 707311478 706738358
1423.4G06738358j074372J420746J445465K80686J117935O98852p74231O04401J312027
$$ 706738358 705663986 707084732 708530197 708810883 709928818 710627670 709853439 710457840 711769867
1432.1G11769867l9215p0419J672287P09228m199066J143341L042755J352463R23157
$$ 711769867 711730652 711660233 713332520 714041748 709842682 710986023 714028778 715381241 716304398
1440.8G16304398J173172J98669L50037L20663J05057M59213l51562j497040J080169
$$ 716304398 717477570 717676239 718026276 718346939 718451996 718911209 718559647 717062607 718142776
1449.5G18142776J746140O48041O63147P40661J077118P28302Q9112l655014m140473
$$ 718142776 719888916 720536957 721200104 721940765 723017883 723746185 723835297 720180283 716039810
1458.2G16039810L916626L363266L241882J863862Q50906J654434k687607K65961L231354
$$ 716039810 719956436 723319702 726561584 728425446 729276352 730930786 728243179 728509140 731740494
1466.8G31740494K021560Q84552R38187K128983p64771l480301J049500N060272M601593
$$ 731740494 733762054 734646606 735584793 737713776 736949005 733468704 734518204 739578476 744180069
1475.5G44180069k73972J585617K932587J430283J413192k84576j07727J166000P86896
$$ 744180069 743906097 745491714 748424301 749854584 751267776 750983200 750875473 752041473 752828369
1484.2G52828369O93054N68238j100846p74231J118470k961350j332092K341156J807098
$$ 752828369 753521423 754089661 752988815 752214584 753333054 750371704 749039612 751380768 753187866
1492.9G53187866L12577j01014m13589o505966J601410L2424k163314J459579n09415
$$ 753187866 753500443 753399429 752985840 746479874 748081284 748113708 745950394 747409973 746900558
1501.6G46900558r9029K59018P61948n73655j0464019r223481K719040M448014M56237
$$ 746900558 746801529 747060547 747822495 747248840 736784821 727561340 730280380 734728394 735184631
1510.2G35184631K266770j172638k715531J311722j277694j212235m002609l088455
$$ 735184631 737451401 736278763 733563232 734874954 733597260 732385025 728382416 725293961
1518G25293961M075851K595215l946686o728287J947785L203811J898652l222733Q9569
$$ 725293961 729369812 731965027 728018341 721290054 723237839 726441650 728340302 725117569 725207138
1526.6G25207138N80902k509384P00912J219407j26419n36728k300721m113235K375793
$$ 725207138 725788040 723278656 723979568 725198975 725072556 724535828 722235107 718121872 720497665
1535.3G20497665J383896R32160K078933p702407r741135N897140K647171n19180J700516
$$ 720497665 721881561 722813721 724892654 717190247 707449112 713346252 715993423 715474243 717174759
1544G17174759m21753j755142L481292K112961J364136j720581k126465K768326J344681
$$ 717174759 716753006 714997864 718479156 720592117 721956253 720235672 718109207 720877533 722222214
1552.7G22222214J205139l502350O97327M748840K745895n893554j7508240J1466675
$$ 722222214 723427353 719925003 720622330 725371170 728117065 722223511 704715271 716181946
1560.4G16181946P785492L781128J951523O04248j876832K9526J873627Q12073m88053
$$ 716181946 723967438 727748566 729700089 730304337 728427505 728457031 730330658 731142731 730654678
1569.1G30654678p072220K603455L310776M46243K69013L91998j573868j0364685L720856
$$ 730654678 723582458 726185913 729496689 729942932 730211945 730603943 729030075 718665390 722386246
1577.7G22386246K366485m93545m92630j705551p27921j281738p86133j223373j579514
$$ 722386246 724752731 724259186 723766556 722061005 721333084 720051346 719265213 718041840 716462326
1586.4G16462326j366653k264100j584472k384720j250229k248154j641464j899185
$$ 716462326 715095673 712831573 711247101 708862381 707612152 705363998 703722534 701823349
1594.1G01823349k958755j145401k072526q13522k298279k029113k431260k964553
$$ 701823349 698864594 697719193 695646667 694833145 692534866 690505753 688074493 685109940
1601.9F85109940k075882l214569j002350k511368k174606k791748k079163j803436
$$ 685109940 683034058 679819489 678817139 676305771 674131165 671339417 669260254 667456818
1609.6F67456818k747193k34756k766037k277298k970810n99365j349030j1798248
$$ 667456818 664709625 664474869 661708832 659431534 656460724 655861359 654512329 642714081
1617.3F42714081K165985j06583j20163k139587m49905j784363o708870Q87413o79512
$$ 642714081 644880066 644773483 644653320 642513733 642063828 640279465 633570595 634458008 633778496
1626F33778496J04141m430351k172318K94190j055908m09508j605873J059112j0872
$$ 633778496 633882637 629452286 627279968 627574158 626518250 626108742 624502869 625561981 625551109
1634.6F25551109p526092k519379J569748N44090P65152Q65975j308937J412544k67944
$$ 625551109 618025017 615505638 617075386 617619476 618384628 619250603 617941666 619354210 619086266
1643.3F19086266J388511J733055l856887r36471j277236M406967K222557L347168
$$ 619086266 620474777 622207832 618350945 617414474 616137238 620544205 622766762 626113930
1651F26113930L769302k306900j1965637M011803P204017L044739K214279J061325
$$ 626113930 629883232 627576332 615610695 619622498 626826515 629871254 632085533 633146858
1658.8F33146858K006874K202149J371345J349449k20985L984261K215423K208634
$$ 633146858 635153732 637355881 638727226 640076675 639855690 643839951 646055374 648264008
1666.5F48264008K543106J417083k74276Q66089M280319J000671L998108M396591m21142
$$ 648264008 650807114 652224197 651949921 652816010 657096329 658097000 662095108 666491699 666070557
1675.1F66070557p68814M083099M239883K204285K494736M37774L301316M815521n92041
$$ 666070557 665301743 669384842 673624725 675829010 678323746 678761520 682062836 686878357 686286316
1683.8F86286316l184586L696823O648484L369903J799393L264999K252961K949066
$$ 686286316 683101730 686798553 693447037 696816940 698616333 701881332 704134293 707083359
1691.5G07083359K484588K866593L601303K747192m864196M616012P107925O070939
$$ 707083359 709567947 712434540 716035843 718783035 713918839 718534851 725642776 731713715
1699.3G31713715J382446o345291Q258972N431747K682038J816330J984787J461334
$$ 731713715 733096161 726750870 735009842 740441589 743123627 744939957 746924744 748386078
1707G48386078L250198M551316K022476J287536K793808K203064K041931j035919j125717
$$ 748386078 751636276 756187592 758210068 759497604 762291412 764494476 766536407 765500488 764374771
1715.6G64374771L414765Q22677n436325N440979M761200K106552J206741l3416J68152
$$ 764374771 767789536 768612213 763175888 768616867 773378067 775484619 776691360 776657944 776826096
1724.3G76826096J804351J200486O42852O54602Q46177j929627k85721L683014K011490
$$ 776826096 778630447 779830933 780473785 781128387 781974564 780044937 779759216 783442230 785453720
1733G85453720l874741m925231N915374M326706R10874J849289k369843k922821M453888
$$ 785453720 781578979 776653748 782569122 786895828 787806702 789655991 787286148 784363327 788817215
1741.7G88817215K306442r34524J247101L034133J433182P74536M21143o0806L691558
$$ 788817215 791123657 790189133 791436234 794470367 795903549 796678085 797099228 797038422 800729980
1750.4H00729980j65863n17196L922424J966782K289581K135239j865006J019745K254715
$$ 800729980 800564117 800046921 803969345 805936127 808225708 810360947 808495941 809515686 811770401
1759H11770401J983643K452087l233719o15768L123779Q78601M11072J210022N70602
$$ 811770401 813754044 816206131 812972412 812356644 815480423 816359024 816770096 817980118 818550720
1767.7H18550720l139572J946030L498230j484223m871444k47498N473709J788025
$$ 818550720 815411148 817357178 820855408 819371185 814499741 814252243 819725952 821513977
1775.4H21513977j858063J951828Q88977M93088n84488j459808J872940K159500Q93173
$$ 821513977 819655914 821607742 822496719 822989807 822405319 820945511 822818451 824977951 825871124
1784.1H25871124j234970k8457J652069M90493J14136O35605r90372j380310k753982
$$ 825871124 824636154 824607697 826259766 826750259 826864395 827500000 826509628 825129318 822375336
1792.8H22375336J279678M097290M8370j149597J884079J907578p93228j837159J297837
$$ 822375336 823655014 827752304 827800674 826651077 828535156 830442734 829649506 827812347 829110184
1801.5H29110184r09882j65481J521606N01556R08890K70310l90549O98929P03048
$$ 829110184 828200302 828034821 829556427 830057983 830966873 831237183 830846634 831545563 832248611
1810.2H32248611j392898j57547O89773K76947M50821J50376P74917l41949M48303
$$ 832248611 830855713 830698166 831387939 831664886 832115707 832266083 833041000 832699051 833147354
1818.8H33147354J258927r8038J32980m26483J015625M79050l647461O08749K332993
$$ 833147354 834406281 834308243 834441223 834014740 835030365 835509415 831861954 832470703 834803696
1827.5H34803696J392440r80758m652481J898422K875519K46506M13665K94419K6626
$$ 834803696 836196136 835215378 830562897 832461319 835336838 835583344 835997009 836291428 836318054
1836.2H36318054o78940p53097J048126R4681L16086K28042R22013l62244n570526
$$ 836318054 835639114 834886017 835934143 836028824 836344910 836572952 837494965 837132721 831562195
1844.9H31562195L172912K833100p21665m99801R08127P08770m21066J43433J96991
$$ 831562195 834735107 837568207 836846542 836346741 837254868 837963638 837542572 837686005 837882996
1853.6H37882996M61120K13394k9144J07651l91464L17535K12479n6305m38156J57470
$$ 837882996 838344116 838557510 838528366 838636017 838244553 838562088 838774567 838718262 838280106 838437576
1863.2H38437576K63748q6288O25000k22778m58527k334671r09653K314835J475372
$$ 838437576 838701324 838615036 839240036 839017258 838558731 836224060 835314407 837629242 839104614
1871.9H39104614L42026l75748l81j35651K86408M18091J96685L94516j21765Q3161
$$ 839104614 839446640 839070892 839070511 838934860 839221268 839639359 839836044 840230560 840108795 840191956
1881.5H40191956j10779L00522j18637l33405L49274J56784Q61664j190720k270279
$$ 840191956 840081177 840381699 840263062 839929657 840278931 840435715 841297379 840106659 837836380
1890.2H37836380J331635J427612J82876j7700o51321p28684R47876L07465j8387J90277
$$ 837836380 839168015 840595627 840778503 840760803 840109482 839380798 840328674 840636139 840617752 840808029
1899.8H40808029l72543j10855j04523K29340M5700M6081K59476p8354k69546k92893
$$ 840808029 840435486 840324631 840220108 840449448 840495148 840541229 840800705 840722351 840452805 840159912
1909.5H40159912q73108m92630J230011M26331r2087j03226L78495J143646k860413
$$ 840159912 839286804 838794174 840024185 840450516 840358429 840255203 840633698 841777344 838916931
1918.2H38916931q53577K044831P07702O4087j721573o23626J311340O33087l81088
$$ 838916931 838063354 840108185 840815887 840879974 839158401 838534775 839846115 840479202 840098114
1926.8H40098114j58844K50855P9040J63345J23368L3416l60107k09808r3308J24970
$$ 840098114 839939270 840190125 840269165 840432510 840555878 840589294 840229187 840019379 839926071 840051041
1936.5H40051041K63824k43759k69470p6752R29108r52149k669601J320419J200104
$$ 840051041 840314865 840071106 839801636 839724884 840653992 839701843 837032242 838352661 839552765
1945.2H39552765n35507m8218N59387K36282k12478r2926J96762k9602r7809N4932
$$ 839552765 839017258 838969040 839528427 839764709 839552231 839459305 839656067 839626465 839528656 839583588
1954.8H39583588k86942n5694J04980K62985K15531k96173l68271k78473L91159p248
$$ 839583588 839296646 839240952 839345932 839608917 839824448 839528275 839160004 838881531 839272690 839265442
1964.5H39265442l72849j65557q70667M6158P99637K22549q5068R690l24784l57742
$$ 839265442 838892593 838727036 837856369 837902527 838702164 838924713 838839645 838849335 838524551 838166809
1974.1H38166809m2648L586K17895k25296K6169K39181j64337P4234j55258j09329
$$ 838166809 838124161 838127747 838345642 838120346 838146515 838385696 838221359 838295593 838140335 838031006
1983.7H38031006n0354j17569j82648n32074n91354k28272Q57773M29535j480942o9885
$$ 838031006 837980652 837863083 837680435 837148361 836557007 836328735 837186508 837616043 836135101 836065216
1993.4H36065216J458359L83911l83682j06964j15204l67203m38690J13525K01187
$$ 836065216 837523575 837907486 837523804 837416840 837301636 836934433 836495743 836609268 836810455
2002.1H36810455j20468j36642J14898K29569k8916k3727k66724k85644j08261l17002
$$ 836810455 836689987 836553345 836668243 836897812 836868896 836845169 836578445 836292801 836184540 835867538
2011.7H35867538m01763o87M94003J26877m03519m71496J66702L95126Q2016m8523
$$ 835867538 835465775 835465088 835959091 836085968 835682449 835210953 835377655 835772781 835854797 835806274
2021.3H35806274m97589m37545j65024M9133L3112K08129N75638J6022k51007j45645
$$ 835806274 835308685 834871140 834706116 834755249 834788361 834996490 835572128 835588150 835337143 835191498
2031H35191498M6387j68229m50744l16162k53601j08338l26767O8283N45731M12063
$$ 835191498 835237885 835069656 834618912 834302750 834049149 833940811 833614044 833682327 834228058 834640121
2040.6H34640121j71966k73590J78985l46679k77558k15454q9340M654l62473M0131
$$ 834640121 834468155 834194565 834373550 834026871 833749313 833533859 833444519 833449173 833086700 833126831
2050.3H33126831M4327N47561N93567r3765M0665J44501l55683j013565n84869l97950
$$ 833126831 833171158 833718719 834312286 834218521 834259186 834403687 834048004 833034439 832449570 832051620
2059.9H32051620m27780j96228K92206N62821k54593n3559L85285J60598l58123p38068
$$ 832051620 831623840 831427612 831719818 832282639 832028046 831974487 832359772 832520370 832162247 831424179
2069.6H31424179o54068p03430m14505m40979j38702M16564K58332J85089L52173k51389
$$ 831424179 830770111 830066681 829652176 829211197 829072495 829489059 829747391 829932480 830284653 830033264
2079.2H30033264r44824j62735M6310m77523o53000k67563N43670M18015J85242J94626
$$ 830033264 829088440 828925705 828972015 828494492 827841492 827573929 828117599 828535614 828720856 828915482
2088.9H28915482Q8882j13602j66244k38953j35422j05514l80554K51465n9891j99661
$$ 828915482 829004364 828890762 828724518 828485565 828350143 828244629 827864075 828115540 828055649 827855988
2098.5H27855988O93588N97153M27474K02103q0108k74811J24664M2419l96804p7j50909
$$ 827855988 828549576 829146729 829574203 829776306 829696198 829421387 829546051 829588470 829191666 829191589 829040680
2109.1H29040680L5324L67889M87977O40182O13556k8000o87332J38245K21481l99246
$$ 829040680 829076004 829443893 829931870 830572052 831185608 831157608 830470276 830608521 830830002 830430756
2118.7H30430756n88761k10724l9291j18332Q53958P50580N3482r4681p5912k96631
$$ 830430756 829841995 829631271 829591980 829473648 830327606 831078186 831131668 831036987 830961075 830664444
2128.4H30664444p42035m38690j68686n8746j91574L39050O99997K33307M52346L36609
$$ 830664444 829922409 829483719 829315033 829256287 829064713 829403763 830103760 830337067 830789413 831126022
2138H31126022k78473o37130j68457j50223l36456J86386K33612J02997L9138P00684
$$ 831126022 830847549 830210419 830041962 829891739 829555283 829741669 829975281 830078278 830117416 830818100
2147.7H30818100P83386J16501R079k9373q3237k38647j68305m94384j63346K75955
$$ 830818100 831601486 831717987 831727066 831697693 831614456 831375809 831207504 830713120 830549774 830825729
2157.3H30825729K81144P24945L03115K35444J28097j76926j45263k37885k52304l26919
$$ 830825729 831106873 831831818 832134933 832370377 832498474 832321548 832176285 831938400 831686096 831359177
2167H31359177J06048k09579k64588L22037L95660L56598j48849k46048j68152k16904
$$ 831359177 831465225 831255646 830991058 831313095 831708755 832065353 831916504 831670456 831502304 831285400
2176.6H31285400k26669j93787k73895k39563L6469J91345N94025L09600L55301L74680
$$ 831285400 831058731 830864944 830591049 830351486 830387955 830579300 831173325 831482925 831838226 832212906
2186.3H32212906j96304r6131Q2245K18353m06341l52173K16293L99475O34842J85929
$$ 832212906 832016602 831920471 832002716 832221069 831814728 831462555 831678848 832078323 832713165 832899094
2195.9H32899094K87017N67627P02362J35956q05435q46329m87365J83029J87607K47268
$$ 832899094 833186111 833753738 834456100 834592056 833786621 832940292 832452927 832635956 832823563 833070831
2205.5H33070831M39530L68957K89994M21066O57196m8828m54102n27267k60010j3580
$$ 833070831 833510361 833879318 834169312 834590378 835247574 835198746 834744644 834217377 833957367 833943787
2215.2H33943787J3656L2807k92817K54288M40903N44815K65655k81143K7542l46298
$$ 833943787 833957443 833990250 833697433 833951721 834392624 834937439 835203094 834921951 834949493 834603195
2224.8H34603195j4343j1292q54721l82385M33655K24686k6703K78701J22757J71128
$$ 834603195 834588852 834577560 833722839 833340454 833774109 833998795 833972092 834250793 834373550 834544678
2234.5H34544678j40152j48545K47651l42408k89611J14669J71585j63345m33426j04523
$$ 834544678 834404526 834255981 834503632 834161224 833871613 833986282 834157867 833994522 833561096 833456573
2244.1H33456573L23411K90985L662Q7051k14386j95312q3924k56271r9487p9651n2185
$$ 833456573 833779984 834070969 834074631 834161682 833947296 833751984 833668060 833411789 833312302 833232651 833180466
2254.7H33180466P7209L59650J58996K00196K24151k77176k05612p1335l967k35290
$$ 833180466 833257675 833617325 833776321 833976517 834200668 833923492 833717880 833646545 833642578 833407288
2264.4H33407288J81503N65109l49808o73523K01874P72476M26484n8442o47277j15052
$$ 833407288 833588791 834153900 833804092 833130569 833332443 834104919 834531403 834472961 833825684 833710632
2274H33710632J48545m45557l73688n20401J37940M70657M98428L30811J54571O34385
$$ 833710632 833859177 833413620 833039932 832519531 832657471 833128128 833626556 833957367 834111938 834746323
2283.7H34746323j21308l25699n53283o92978o4621Q0414l4256m69437J22528M10462
$$ 834746323 834625015 834299316 833746033 833053055 832988434 833068848 833034592 832565155 832687683 833098145
2293.3H33098145N13763K212l89328Q1025o66657k81830k76413k81829j04218n89981
$$ 833098145 833611908 833614120 833224792 833305817 832639160 832357330 832080917 831799088 831694870 831104889
2302.9H31104889L5095J70975K12173l94973j77384Q2321k09427m27169j490403r3841
$$ 831104889 831139984 831310959 831523132 831128159 830950775 831033096 830823669 830396500 828906097 828812256
2312.6H28812256L7231q7814K20566n12543J91422o55442n12542j61362p39212r00650
$$ 828812256 828849487 828761673 828982239 828469696 828661118 828005676 827493134 827331772 826592560 825691910
2322.2H25691910j019516J26419L63998L59803q40683m08936M81720q79974j30692
$$ 825691910 824672394 824798813 825162811 825522614 824681931 824272995 824754715 823874741 823744049
2330.9H23744049N3711q43430l29132O30112r86404j780854N29404J062241j78986
$$ 823744049 823797760 822954330 822625198 823255310 822268906 820488052 821017456 822079697 821900711
2339.6H21900711m69742J077194k20489l71170J779709R39483k11181J70975J892623
$$ 821900711 821430969 822508163 822287674 821916504 823696213 824635696 824424515 824595490 826488113
2348.3H26488113J646805l21502j237412r10492j086731j000213m0360j021576k648468
$$ 826488113 828134918 827813416 826576004 825665512 824578781 823578568 823538208 822516632 819868164
2356.9H19868164j257706k7084p45468L17459J651840O81076n99670r07288P71713
$$ 819868164 818610458 818583374 817837906 818155365 819807205 820488281 819888611 818981323 819753036
2365.6H19753036J343461R31549J142959N82886N22995J007690R00956O90536J122818
$$ 819753036 821096497 822028046 823171005 823753891 824276886 825284576 826185532 826876068 827998886
2374.3H27998886P86286N45349P04269P82547J031952Q59680J214295P63092J34048
$$ 827998886 828785172 829330521 830034790 830817337 831849289 832708969 833923264 834686356 834820404
2383H34820404K07520j30539o9733O7520L75977L60946J68152K91062J96991j7548
$$ 834820404 835027924 834897385 834827652 834895172 835271149 835632095 835800247 836091309 836288300 836270752
2392.6H36270752n35126j89209R9945l56826n10560j35574L64914j4343n0965L00370
$$ 836270752 835735626 835546417 835646362 835289536 834778976 834643402 835008316 834993973 834943008 835243378
2402.3H35243378L28903M7912l16619j31684n6762j51978l09982j72730P6981l0670
$$ 835243378 835572281 835620193 835303574 835171890 835115128 834963150 834653168 834480438 834557419 834526749
2411.9H34526749l12271k70157L07083L91846K83432L6773l68500k72903J50223N1574
$$ 834526749 834214478 833944321 834251404 834643250 834926682 834963455 834594955 834322052 834472275 834523849
2421.6H34523849m83398l11050j75858J04752L26996l0823o1875j11847J00480K66418
$$ 834523849 834040451 833729401 833553543 833658295 833985291 833954468 833892593 833780746 833881226 834147644
2431.2H34147644k56271o26297l03650j21918m6616l4790j96533K61307J04446k441
$$ 834147644 833891373 833265076 832961426 832839508 832792892 832758102 832561569 832822876 832927322 832924881
2440.8H32924881O1340k31857J4801j53580l9901j42823k69394P7591j18179L6087
$$ 832924881 832986221 832754364 832769165 832615585 832575684 832432861 832163467 832241058 832122879 832158966
2450.5H32158966J36032O4163l92837n01175J33667L3035n2032q5907l42407k37885
$$ 832158966 832294998 832359161 831966324 831465149 831598816 831631851 831579819 831493912 831151505 830913620
2460.1H30913620P9422l4714k32086m7531J26038L35235K5787m56848m95910k58026
$$ 830913620 830993042 830958328 830726242 830678711 830804749 831139984 831165771 830708923 830213013 829954987
2469.8H29954987J10168K69852J05362j97449j38245L0518M5318j81808l92075k49710
$$ 829954987 830065155 830335007 830440369 830242920 830104675 830135193 830180511 829998703 829606628 829356918
2479.4H29356918L3417M7989l15552q1177K35291Q8730k43912m11377P1488J14364
$$ 829356918 829390335 829438324 829122772 829041595 829276886 829365616 829121704 828710327 828781815 828896179
2489.1H28896179k72903m18854k25677J15814J6098l88565k73285K09808n0506k42386
$$ 828896179 828623276 828204422 827978745 828094559 828110657 827722092 827448807 827658615 827608109 827365723
2498.7H27365723K746J15662J23215M654o1646j24664n9433j13297l62472n73349j77765
$$ 827365723 827368469 827484131 827607346 827612000 827550354 827425690 827366257 827252960 826890488 826317139 826139374
2509.3H26139374J49688p6828J67771J79138N1804j76087l10745j94626k22092J05515
$$ 826139374 826289062 826212234 826380005 826559143 826610947 826434860 826124115 825929489 825707397 825812912
2519H25812912p5302k55966k19803K1438K10343j30463j11084j24130K33307J77231
$$ 825812912 825737610 825481644 825261841 825283279 825493622 825363159 825252075 825127945 825361252 825538483
2528.6H25538483j39389k14386k50550p1869p12051k95258R0790j70898L49274L07998
$$ 825538483 825399094 825184708 824934158 824862289 824150238 823854980 823945770 823774872 824124146 824432144
2538.2H24432144n5542m15268J29853L34701j20468l09525p38830j81732K29568K136
$$ 824432144 824376602 823961334 824091187 824425888 824305420 823995895 823257065 823075333 823304901 823307037
2547.9H23307037k12631j01929K21863J52970R91k56042J98517K9526o96183l69873
$$ 823307037 823094406 822992477 823214340 823367310 823368301 823112259 823310776 823340302 822644119 822274246
2557.5H22274246J7853L13187J44958k31628k82898l16849j39618O7139q4229k53296
$$ 822274246 822292099 822605286 822750244 822518616 822235718 821918869 821779251 821846390 821762161 821508865
2567.2H21508865k29492L3570L51867P2937Q621j64337m94003l8834j02386m17481
$$ 821508865 821279373 821312943 821664810 821737747 821746368 821582031 821088028 821049194 820946808 820529327
2576.8H20529327K16446N20249l64685o24085k42386j28936j94092l30429J61209N6228
$$ 820529327 820745773 821266022 820901337 820277252 820034866 819905930 819711838 819381409 819542618 819598846
2586.5H19598846k78854O9809M03290J11313m71344j24741n8975j01700k25449l96804
$$ 819598846 819319992 819389801 819793091 819904404 819433060 819308319 819249344 819147644 818922195 818525391
2596.1H18525391p1259q5907O7597j52207k31933k81067l9978K21023m83703L3721
$$ 818525391 818454132 818368225 818435822 818283615 818051682 817770615 817730637 817951660 817467957 817501678
2605.7H17501678K00959l24478l68195l66745k44370l23104k1515n7297o8512J74942
$$ 817501678 817702637 817378159 817009964 816643219 816398849 816075745 816054230 815996933 815928421 816103363
2615.4H16103363M15955m9363p80105M959K43912j00479n04151o07757k66571l09143
$$ 816103363 816519318 816469955 815689850 815694809 815938721 815838242 815334091 814726334 814459763 814150620
2625H14150620J40686J96228M9133k52609k80838K64434j1673n73730p05566k72904
$$ 814150620 814291306 814487534 814536667 814284058 814003220 814267654 814255981 813682251 812976685 812703781
2634.7H12703781k17819J60980M02527j92566k78778l73306R0942L14102j85852n79376
$$ 812703781 812485962 812646942 813049469 812856903 812578125 812204819 812295761 812609863 812424011 811844635
2644.3H11844635p49969k15302J44577R8648p6675j34583l47900m24423J01013N13839
$$ 811844635 811094666 810879364 811023941 811122589 811045914 810911331 810563431 810139008 810240021 810753860
2654H10753860L25928n78613o33698k43301m77600k13394J97754j03913k60315J679
$$ 810753860 811079788 810501175 809867477 809624176 809146576 808933182 809130936 809027023 808766708 808768387
2663.6H08768387r6054r7885m79279n64346J90811J20773q3542m2343j14670p3242
$$ 808768387 808672333 808574448 808095169 807530823 807721634 807842407 807758865 807716522 807601852 807528610
2673.3H07528610k58713m61273K44293O32096j73798n31006n91278l26538m8141n6229
$$ 807528610 807269897 806808624 807052917 807685013 807511215 806980209 806388931 806062393 806014252 805958023
2682.9H05958023k4490k27509k03628N5618L88946l62396o34994k08969o41632q5068
$$ 805958023 805933533 805706024 805502396 805558014 805946960 805584564 804949570 804740601 804098969 804013901
2692.5H04013901K69241M9973m05045o43082p6p0495M5089Q8577k75039l24402k28424
$$ 804013901 804283142 804333115 803928070 803284988 803284912 803214417 803259506 803348083 803073044 802748642 802520218
2703.1H02520218j64261l40729j73187K26593K63596n56794o89926j47400n9127L95584
$$ 802520218 802355957 802015228 801842041 802068634 802332230 801775436 801085510 800938110 800878983 801274567
2712.8H01274567J56784m40445l83682k93885l34778q7967L9750j45646q087l01437
$$ 801274567 801431351 800990906 800607224 800313339 799978561 799890594 799930344 799784698 799776611 799475174
2722.4G99475174m59061O6986K99302k11411p33795p20139l41263K97089J24893q4457
$$ 799475174 799016113 799083099 799382401 799170990 798437195 797717056 797375793 797672882 797797775 797713318
2732.1G97713318j5259J50986K09198o11191o68716j34125N7831n01786n22461J22986
$$ 797713318 797698059 797849045 798058243 797447052 796778336 796644211 796702042 796200256 795677795 795800781
2741.7G95800781j51596L6164j47934l89939j54419n6915J71585k9678j25275p36084
$$ 795800781 795649185 795685349 795537415 795147476 794993057 794936142 795107727 795078049 794952774 794216690
2751.4G94216690p48291l07236j40228L95660j41449m653N06744l27530p47452m60129
$$ 794216690 793468399 793161163 793020935 793416595 793275146 793270493 793777237 793449707 792702255 792242126
2761G92242126n28335l83148M64706O32706J56097m65164o65283m55017m67377l03345
$$ 792242126 791713791 791330643 791795349 792428055 792584152 792118988 791453705 790998688 790531311 790227966
2770.7G90227966L3417L19824k00424m63333l92990q60062m25033J85394J68152j7853
$$ 790227966 790261383 790581207 790380783 789917450 789524460 788664398 788239365 788424759 788592911 788575058
2780.3G88575058l76968n20935m15421l18222m2801k35062n42602M3564l739l55148
$$ 788575058 788198090 787677155 787261734 786943512 786900711 786665649 786123047 786166611 786162872 785807724
2789.9G85807724l38821l35999j96381l59115l50800k96097j07727k06451n69992l51563
$$ 785807724 785468903 785132904 784936523 784577408 784226608 783930511 783822784 783616333 783046341 782694778
2799.6G82694778l04260k97165k47421l25699n91354o26831l47977k39410L9444J96151
$$ 782694778 782390518 782093353 781845932 781520233 780928879 780302048 779954071 779714661 779754105 779950256
2809.2G79950256l11355j039047n43366j8005k93503m17023m55170l66973p71027n01099
$$ 779950256 779638901 778599854 778056488 778038483 777744980 777327957 776872787 776505814 775734787 775233688
2818.9G75233688l74603n45883m6158p24106o55060J07117K92435J55945p24717j144790
$$ 775233688 774859085 774313202 774267044 773542938 772887878 772994995 773287430 773443375 772718658 771573868
2828.5G71573868j036988n36041l02276k27967m5776k72751n17120p96738q47778j119766
$$ 771573868 770536880 770000839 769698563 769470596 769424820 769152069 768634949 767838211 766990433 765870667
2838.2G65870667q86689m38461r72137j136094j064300r36432p10754j293488j670914
$$ 765870667 764983978 764545517 763573380 762437286 761372986 760436554 759725800 758432312 756761398
2846.8G56761398j398925j548233j578599j474304r09881o4698n95245p75528l53393
$$ 756761398 755362473 753814240 752235641 750761337 749851456 749786758 749191513 748415985 748062592
2855.5G48062592m3869J37100j95008J24741R7351l31955q02765r83658l18298k73056
$$ 748062592 748018723 748155823 747960815 748085556 748182907 747850952 747048187 746064529 745746231 745473175
2865.2G45473175o99844q56629m99954n59006n95092k61307m35868j68151m69742r00574
$$ 745473175 744773331 743916702 743416748 742857742 742262650 742001343 741565475 741397324 740927582 740027008
2874.8G40027008m87823k35978k69622m41742n83268o18972j03531j44959m42657k61765
$$ 740027008 739539185 739303207 739033585 738591843 738008575 737389603 737286072 737141113 736698456 736436691
2884.4G36436691l40118m23660r93500p39823j94244o63605n06591l74375q12759j015778
$$ 736436691 736096573 735672913 734679413 733939590 733745346 733081741 732575150 732200775 731388016 730372238
2894.1G30372238n77850k3728r2544m64478q27560q25653n30167l66211l35083l37372
$$ 730372238 729794388 729770660 729678116 729213638 728386078 727560425 727030258 726664047 726328964 725991592
2903.7G25991592m57992l19595l34244p28455l45077j01166m70963l90014p10526j303940
$$ 725991592 725533600 725214005 724879761 724151306 723806229 723705063 723234100 722844086 722133560 720829620
2913.4G20829620p61337n13229r91364o21948p29141j149750l41568k46201j242828
$$ 720829620 720068283 719555054 718563690 717941742 717212601 716062851 715721283 715475082 714232254
2922.1G14232254j049271k16674N722j01090l12500K48947L64228k8611M16108N0506
$$ 714232254 713182983 712966309 712972031 712870941 712558441 712807388 713171616 713143005 713559113 713609619
2931.7G13609619k79922J19323J36719K3575J87454N83420N81436N70755K71301J75705
$$ 713609619 713329697 713449020 713585739 713609314 713796768 714380188 714961624 715532379 715803680 715979385
2941.3G15979385P38449M84848K18430K65656q5450k98309l25088k25144j3046q2092
$$ 715979385 716717834 717202682 717421112 717686768 717601318 717303009 716977921 716752777 716739731 716657639
2951G16657639k18964q9569k47955p91398o24008L92838N02929m14962o31333O3324
$$ 716657639 716438675 716349106 716101151 715309753 714685745 715078583 715581512 715166550 714535217 714598541
2960.6G14598541O21262O65054J08185m89578M59594J030579K25220K04773K73895
$$ 714598541 715219803 715884857 715993042 715503464 715963058 716993637 717218857 717423630 717697525
2969.3G17697525O39725J251526R58557O77795R52301O42777j88904L42331Q29773
$$ 717697525 718337250 719588776 720547333 721225128 722177429 722820206 722631302 722973633 723803406
2978G23803406N32150N51147O11954P45774O19430P82471P42569M94995O94580N31387
$$ 723803406 724335556 724886703 725498657 726244431 726863861 727646332 728388901 728883896 729578476 730109863
2987.6G30109863M35639L21960N98145R57489K84347k48184J06354O00433M09928l357
$$ 730109863 730545502 730867462 731465607 732423096 732707443 732459259 732565613 733166046 733575974 733572617
2997.3G33572617k24457j2589L40271p2250l09982j49765K3346M33731K25982j00021
$$ 733572617 733348160 733335571 733675842 733603592 733293610 733143845 733167191 733600922 733826904 733726883
3006.9G33726883K26669K38190j00784j61972j25275m48837n37033o3477j62048n23453
$$ 733726883 733953552 734191742 734090958 733928986 733803711 733354874 732817841 732754364 732592316 732068863
3016.6G32068863k41470J25732j6937l41263m46396j69220L4638k19727n77621r61228
$$ 732068863 731827393 731953125 731936188 731594925 731148529 730979309 731013947 730794220 730216599 729255371
3026.2G29255371R461P01217m78363o48269l37677j90354R3536j77841l31649l52097
$$ 729255371 729264832 729966049 729487686 728839417 728501740 728311386 728404922 728227081 727895432 727543335
3035.9G27543335o30188p62177J53885J81046p47376r08584n56946j1520l57743l70788
$$ 727543335 726913147 726150970 726304855 726485901 725738525 724829941 724272995 724261475 723903732 723532944
3045.5G23532944k71378j35803K13470k65655l40424r98077j079178m41360j50681
$$ 723532944 723261566 723125763 723339233 723073578 722733154 721735077 720655899 720214539 720063858
3054.2G20063858K1591q11844n71594k3193r7275l26386o80084k64587K59781r6665
$$ 720063858 720085449 719273605 718702011 718678818 718581543 718255157 717575073 717310486 717570267 717473602
3063.8G17473602j159820l31269L4790o91986k73590n70678m14277j37863k06375m26559
$$ 717473602 716313782 715982513 716017303 715325317 715051727 714481049 714066772 713928909 713722534 713295975
3073.5G13295975o26908J28785j35270n18188o6681J77994l2807l08914k75345m45633
$$ 713295975 712669067 712797852 712662582 712144394 712077713 712255707 712222900 711913986 711638641 711193008
3083.1G11193008p02056o66352j78909k55890n50690m04205l06854l32260l27683l20434
$$ 711193008 710490952 709824600 709645691 709389801 708839111 708434906 708128052 707795792 707468109 707147675
3092.7G07147675n78843o9275k80609p45468k66723n14298k45285k82059l79638m26712
$$ 707147675 706568832 706499557 706218948 705473480 705206757 704692459 704447174 704165115 703785477 703358765
3102.4G03358765q93097J1520K87323m64172r35517q40454n15747l74298k50473k59704
$$ 703358765 702465668 702477188 702764511 702300339 701364822 700524368 700008621 699634323 699383850 699124146
3112F99124146j16120m57764n70373m88663p55997o23092o97403n91583k46659o74667
$$ 699124146 699008026 698550262 697979889 697491226 696735229 696112137 695414734 694823151 694576492 693901825
3121.7F93901825j259003p63473k51770k86026n85175p10449m8676l09600r20945o40106
$$ 693901825 692642822 691879349 691627579 691341553 690756378 690045929 689997253 689687653 688766708 688126602
3131.3F88126602l39126o77720r83123m68216l58963n01023n84869k80457k91824q80508
$$ 688126602 687787476 687109756 686126633 685658417 685299454 684798431 684213562 683933105 683641281 682760773
3141F82760773n09262o50788q90808q03604r01184o56662r32312q95920n12619m64249
$$ 682760773 682251511 681600723 680709915 679906311 679005127 678348465 677416153 676520233 676007614 675543365
3150.6F75543365m63562l85437k28729o27136j233902j032867m48380l26233p20978
$$ 675543365 675079803 674694366 674465637 673838501 672604599 671571732 671123352 670797119 670076141
3159.3F70076141j185073p05338n07507q24509n00793n14603o56586r30404o92063
$$ 670076141 668891068 668185730 667678223 666853714 666352921 665838318 665181732 664251328 663559265
3168F63559265l17078q33892j012192p40051o13404j184768j035920n78765m48075
$$ 663559265 663242187 662408295 661396103 660656052 660042648 658857880 657821960 657243195 656795120
3176.6F56795120r0408o98090p21969o53839q09250p14112j081161o71768o20041r07059
$$ 656795120 656704712 656006622 655284653 654630814 653821564 653107452 652026291 651354523 650734482 649827423
3186.3F49827423m80423k46506o33773q28782o63757j064148j025925n10559o99539
$$ 649827423 649347000 649100494 648466721 647637939 646974182 645910034 644884109 644373550 643674011
3195F43674011p08313p477o86264j387786o57578r05228p55691l03154p06139r11293
$$ 643674011 642965698 642958221 642271957 640884171 640226593 639321365 638565674 638262520 637556381 636645088
3204.6F36645088m96483m57801j292954n76096l08876j220054m44260J14632r58367
$$ 636645088 636148605 635690804 634397850 633821754 633512878 632292824 631848564 631963196 631004829
3213.3F31004829j558837l66707l03231q65783l39699m91333q74252p85904r28231
$$ 631004829 629445992 629079285 628776054 627910271 627570572 627079239 626204987 625419083 624490852
3222F24490852j119079n88761j56898k78626q34579r79996k24304m95453p27653m66996
$$ 624490852 623371773 622783012 622626114 622347488 621512909 620532913 620308609 619813156 619085503 618618507
3231.6F18618507m33426m58412q41636o85616n37796q88748r57604l61633l20053o56319
$$ 618618507 618185081 617726669 616885033 616199417 615661621 614772873 613815269 613453636 613133583 612477264
3241.3F12477264m74624n27535m10652r27620j221847m69742j01319o78558j510696
$$ 612477264 612002640 611475105 611064453 610136833 608914986 608445244 608343925 607665367 606154671
3249.9F06154671r12476r4223M7150n94902r02405l88870p43027o37245l17383k73819
$$ 606154671 605242195 605147972 605195122 604600220 603697815 603308945 602565918 601928673 601611290 601337471
3259.6F01337471o17523r58977m05846m43649n84106p29637p43256k48032k49519k68974
$$ 601337471 600719948 599760971 599355125 598911476 598327370 597597733 596854477 596606445 596356926 596087952
3269.2E96087952j62621o13518p89795k94380n03959p74613r00879p00950k49215p78427
$$ 596087952 595925331 595311813 594522018 594227638 593723679 592949066 592048187 591347237 591098022 590319595
3278.9E90319595l68766M5585n09643o03409o57921n31731n15403m62838k93464o87332
$$ 590319595 589950829 589996414 589486771 588883362 588225441 587693710 587178307 586715469 586422005 585734673
3288.5E85734673q47779l99780k52876k78702n86395o62384L1089l90472p64656l34473
$$ 585734673 584886894 584487114 584234238 583955536 583369141 582706757 582737846 582347374 581582718 581248245
3298.2E81248245m04548m33159m58908m00544p64236j018333n12543k90070m10766
$$ 581248245 580843697 580410538 579951630 579551086 578786850 577768517 577255974 576965904 576555138
3306.8E76555138o17791o60934l41835l27530r23500q39767m99878n40657n98603n40390
$$ 576555138 575937347 575276413 574934578 574607048 573683548 572843781 572343903 571803246 571204643 570664253
3316.5E70664253l27072j056251j138268n21049m98124o01196o49643m22134r35478
$$ 570664253 570337181 569280930 568142662 567621613 567123489 566522293 565872650 565450516 564515038
3325.2E64515038q58613n86242m18930k25640j139183o04934n29251j041108o80542
$$ 564515038 563656425 563070183 562651253 562425613 561286430 560681496 560152245 559111137 558430595
3333.8E58430595r21554o81458p92160o53801n55572j098900p22733n73158r45206
$$ 558430595 557509041 556827583 556035423 555381622 554826050 553727150 553004417 552431259 551486053
3342.5E51486053p76100n94482r40323n73158o58760j350212q78334o51360p81136
$$ 551486053 550709953 550115471 549175148 548601990 547943230 546593018 545714684 545063324 544282188
3351.2E44282188q46557q43430l89023k28920r70687j413918j046638q86994n87921
$$ 544282188 543435631 542592201 542203178 541974258 541003571 539589653 538543015 537656021 537068100
3359.9E37068100m79736o41137j095542j151009n73349q70552o52466m09508j112632
$$ 537068100 536588364 535947227 534851685 533700676 533127327 532256775 531604309 531194801 530082169
3368.6E30082169j260796q37364n79987r30939r66529o82259m69818l26462q97560
$$ 530082169 528821373 527984009 527404022 526473083 525506554 524824295 524354477 524028015 523130455
3377.2E23130455j123047o54297p93342o26221j65634n52178q15658q69980m56162
$$ 523130455 522007408 521353111 520559769 519933548 519767914 519215736 518400078 517530098 517073936
3385.9E17073936m20722o95801k48986q05816r19953l40767o02989p74688n17693l12729
$$ 517073936 516653214 515957413 515708427 514902611 513982658 513641891 513038902 512264214 511746521 511433792
3395.6E11433792o01387p24716o71005l32566l31192l26423K29911l56979p01752o19049
$$ 511433792 510832405 510107689 509436684 509104118 508772926 508446503 508676414 508319435 507617683 506998634
3405.2E06998634n55954j81884P1868K2355q43468r04732k27012j53275m96712l37028
$$ 506998634 506442680 506260796 506332664 506355019 505511551 504606819 504379807 504226532 503729820 503392792
3414.8E03392792K29301k1400r10530r68628M654j10054j98441K861j58348L18222
$$ 503392792 503622093 503600693 502690163 501721535 501726189 501616135 501417694 501420555 501262207 501580429
3424.5E01580429J16806m6081j09864m76303l17039L79219L05443n13001m55131J22947
$$ 501580429 501697235 501651154 501541290 501064987 500747948 501127167 501432610 500919609 500464478 500587425
3434.1E00587425Q58307j0109l39508L57895K67410M51126k89878l1510p8125n4703
$$ 500587425 501445732 501435623 501096115 501454010 501721420 502172546 501882668 501851158 501773033 501718330
3443.8E01718330R85375J027260P65152j171456q5983J147041L31955K96326J16844
$$ 501718330 502703705 503730965 504496117 503324661 503238678 504385719 504717674 505014000 505130844
3452.5E05130844M00734l33900L18184Q53271M00162J261749P23038k4605n48248O69746
$$ 505130844 505531578 505197678 505515862 506369133 506769295 508031044 508754082 508729477 508181229 508850975
3462.1E08850975J149979j01586L85170N79338L71094p7438Q66089J434478N62477
$$ 508850975 510000954 509899368 510284538 510863876 511234970 511157532 512023621 513458099 514020576
3470.8E14020576M05236J36566O67953R97429K79923K16827J262589J130218M8599
$$ 514020576 514425812 514562378 515230331 516227760 516507683 516724510 517987099 519117317 519165916
3479.5E19165916K15950O63224N45463M38843J474686J079254O22787J270600K19459
$$ 519165916 519381866 520045090 520590553 521029396 522504082 523583336 524206123 525476723 525696182
3488.1E25696182k02484K50778O88820N63660P30896J255989O98929N98411N69764
$$ 525696182 525493698 525744476 526433296 526996956 527727852 528983841 529682770 530281181 530850945
3496.8E30850945N71479N06859Q64296J047402J083374R06868l43171O77948J359177
$$ 530850945 531422424 531929283 532793579 533840981 534924355 535831223 535488052 536166000 537525177
3505.5E37525177J020546P52869J105461P98835m96635J023521J127816Q09211Q06962
$$ 537525177 538545723 539298592 540404053 541202888 540706253 541729774 542857590 543666801 544473763
3514.2E44473763P37686J203918K00081N31464Q30764O58799J518783K005120R57298
$$ 544473763 545211449 546415367 546615448 547146912 547977676 548636475 550155258 552160378 553117676
3522.9E53117676n96771K08778Q14819J191292O75469Q42399J508560J065026P99789
$$ 553117676 552520905 552729683 553544502 554735794 555411263 556253662 557762222 558827248 559627037
3531.5E59627037N08385J141548J490631J872711N646n91774J822472J162986R78699
$$ 559627037 560135422 561276970 562767601 564640312 564645958 564054184 565876656 567039642 568018341
3540.2E68018341O85692Q54034R21860J052437J227569M08936K230721L42178Q52508
$$ 568018341 568704033 569558067 570479927 571532364 572759933 573168869 575399590 575741768 576594276
3548.9E76594276J892395J285172J548347k28462K177124J457329P97310J080627q3503
$$ 576594276 578486671 579771843 581320190 581091728 583268852 584726181 585523491 586604118 586520615
3557.6E86520615K110176J276321Q28323Q88100J753655J133499M29344M449425j17226
$$ 586520615 588630791 589907112 590735435 591623535 593377190 594510689 594940033 599389458 599272232
3566.2E99272232j980209K32963M52347M054222K099114J562690J670304J989937J619796
$$ 599272232 597292023 597524986 597977333 602031555 604130669 605693359 607363663 609353600 610973396
3574.9F10973396J028824J650391N20820K051316J034622O30684K056198K096672J769257
$$ 610973396 612002220 613652611 614173431 616224747 617259369 617890053 619946251 622042923 623812180
3583.6F23812180P17048L989830Q43125k955017J710052j55029L881492L705674K629890
$$ 623812180 624529228 628519058 629362183 626407166 628117218 627962189 631843681 635549355 638179245
3592.3F38179245L47595J0529L674316j048355K421341L656235J83944K315674L68347
$$ 638179245 638526840 638537369 642211685 641163330 643584671 647240906 647424850 649740524 650108871
3601F50108871J256104K636108K320710K431793K375793J708985j101075L959961p58438
$$ 650108871 651364975 654001083 656321793 658753586 661129379 662838364 661737289 665697250 664938812
3609.6F64938812m92096Q552704J005478l354263L554458o54449M182510M351807p57370
$$ 664938812 664446716 672999420 674004898 670650635 674205093 673550644 677733154 682084961 681327591
3618.3F81327591R39712j623077R76334M023895L131027K241211K214432J519012J571656
$$ 681327591 682267303 680644226 681620560 685644455 688775482 691016693 693231125 694750137 696321793
3627F96321793N932312k830429j0814438P237014O783524O896439J283111k308655
$$ 696321793 702254105 699423676 688609238 695846252 702629776 709526215 710809326 708500671
3634.7G08500671L220826L382568K018433J39083J953507K793350K077408P79724m79507
$$ 708500671 711721497 715104065 717122498 717261581 719215088 722008438 724085846 724865570 724386063
3643.4G24386063K030334L806992N914535k879562n282593N501404k019730k248306
$$ 724386063 726416397 730223389 736137924 733258362 727975769 733477173 731457443 729209137
3651.1G29209137J34125O541290N539322M467850N175247j0659867J333619O190567
$$ 729209137 729343262 735884552 741423874 745891724 751066971 740407104 741740723 747931290
3658.8G47931290J656265J504593j55182J424560R74732J274414J417084L09295M250718
$$ 747931290 749587555 751092148 750936966 752361526 753336258 754610672 756027756 756337051 760587769
3667.5G60587769J977539k496109q99201o716919L172074Q830795Q135376l540650
$$ 760587769 762565308 760069199 759169998 752453079 755625153 764455948 772591324 769050674
3675.2G69050674j9455566M536209Q185806M310990j840134M71954K731705J968613
$$ 769050674 749595108 754131317 762317123 766628113 764787979 765259933 767991638 769960251
3682.9G69960251J342850n08271k41470M640961O708374j2174836n173034Q821869
$$ 769960251 771303101 770794830 770553360 775194321 781902695 769727859 764554825 773376694
3690.6G73376694o628800K19269O211395N28489J237258j22833r19723J191406L6697
$$ 773376694 766747894 766967163 773178558 773707047 774944305 774821472 773901749 775093155 775129852
3699.3G75129852K502518L781204o028366l374634M570771J680297O22101O62232L293075
$$ 775129852 777632370 781413574 775385208 772010574 776581345 778261642 778883743 779545975 782839050
3708G82839050M690705r568634L440094N334854j4934464N477905N225068K48108Q31604
$$ 782839050 787529755 777961121 781401215 786736069 771801605 777279510 782504578 782752686 783584290
3716.7G83584290K451248J079254m232941N04914N443573n024338m664994N902710
$$ 783584290 786035538 787114792 782881851 783386765 788830338 783806000 779141006 785043716
3724.4G85043716k02407j446915k795563M72336N292511J673813M974212m536972p817840
$$ 785043716 784841309 783394394 780598831 781071167 786363678 788037491 793011703 788474731 780656891
3733.1G80656891R733276j26495j0494537L84902K429276Q14743L667297L365555l971329
$$ 780656891 790390167 790263672 779769135 780154037 782583313 783398056 787065353 790430908 786459579
3741.8G86459579L332367J1722794j0998688k2416000J1337280Q373871O896057m018402
$$ 786459579 789791946 801514740 790516052 768100052 779437332 787811203 794707260 790688858
3749.5G90688858j3171234J2552872m995728p192459P047958N096970L737945o472167
$$ 790688858 777517624 790070496 785074768 777882309 784930267 790027237 793765182 787293015
3757.2G87293015K066650O337738r523163j504593N004273J332626M08020L998795
$$ 787293015 789359665 795697403 786174240 784669647 789673920 791006546 791414566 795413361
3764.9G95413361l677674o070251M052276N690689K47040j0254898J744843L840408
$$ 795413361 791735687 785665436 789717712 795408401 795655441 785400543 787145386 790985794
3772.6G90985794K29874N82351k62298P70645M9667K823792l4561q689423L381348
$$ 790985794 791215668 791798019 791535721 792306366 792356033 795179825 795145264 786455841 789837189
3781.3G89837189L047256M07639J517563l775940j086808J939698J410064Q88443j204834
$$ 789837189 792884445 793292084 794809647 791033707 789946899 791886597 793296661 794185104 792980270
3790G92980270o66809K48337Q28171J9455J540756L483658n325775m927597K487487
$$ 792980270 792313461 792561798 793389969 793409424 794950180 798433838 793108063 788180466 790667953
3798.7G90667953L567048M620285r020462j0013428N897674M790039N655442M385910
$$ 790667953 794235001 798855286 789834824 779821396 785719070 790509109 796164551 800550461
3806.4H00550461j3667832l962173O860809K925644M41437M44260l87955J447449O643219
$$ 800550461 786882629 782920456 789781265 792706909 793148346 793592606 793204651 794652100 801295319
3815.1H01295319j958695j7441330N143509O614227M745636R33838j8721313K594452
$$ 801295319 799336624 781895294 787038803 793653030 798398666 799332504 780611191 783205643
3822.8G83205643N830383J982727K524414L66135m077912N68009K447433L923950J330872
$$ 783205643 789036026 791018753 793543167 793909302 789831390 790399399 792846832 796770782 798101654
3831.4G98101654j0449295L066483P503662p007218r69619P840423j0232391m169312
$$ 798101654 787652359 790718842 798222504 791215286 790245667 798086090 787853699 783684387
3839.2G83684387R121781o497651Q20542P736282m515610l659133M574127K619018
$$ 783684387 792806168 786308517 787129059 794865341 790349731 786690598 791264725 793883743
3846.9G93883743o04782P23953j122665J823883P234345o186219j705780j7275314
$$ 793883743 793278961 794002914 792880249 794704132 801938477 795752258 794046478 776771164
3854.6G76771164K916183J1909790j844253j678314K876053K262573K585220n228195
$$ 776771164 779687347 791597137 789752884 788074570 790950623 793213196 795798416 790570221
3862.3G90570221J076584O872635p492981o090012M320145N890884N567017r566727
$$ 790570221 791646805 798519440 791026459 784936447 789256592 795147476 800714493 791147766
3870G91147766r300079M086761P640991M537354j1718750J212387N159149K41013K290726
$$ 791147766 781847687 785934448 793575439 798112793 786394043 787606430 792765579 793006592 795297318
3878.7G95297318M560699p575073q180390O932984Q75625J296006N039901j3761673
$$ 795297318 799858017 792282944 784102554 791035538 791911163 793207169 798247070 784485397
3886.4G84485397K360382M733582O52771M492874j656723r673386K206421M132920
$$ 784485397 786845779 791579361 792232132 796725006 795068283 785394897 787601318 791734238
3894.1G91734238j227951J383590J740494K069092M35867j0534057N593032J714783
$$ 791734238 790506287 791889877 793630371 795699463 796135330 785601273 791194305 792909088
3901.8G92909088o264877N340576k848511j764908P01218J670227K969666l13721K41241
$$ 792909088 786644211 791984787 789136276 787371368 788072586 789742813 792712479 792398758 792639999
3910.5G92639999r3841k79083J58844J28326J416473J816101l735733l856430M992218
$$ 792639999 792546158 792267075 792425919 792554245 793970718 795786819 792051086 788194656 793186874
3919.2G93186874n2719m544067K346191J520386J146927k539902k829971K511520J505814
$$ 793186874 793134155 788590088 790936279 792456665 793603592 791063690 788233719 790745239 792251053
3927.9G92251053R16138j555176p02667J928634l246460j518402J841583J96000O53228
$$ 792251053 793167191 791612015 790909348 792837982 789591522 788073120 789914703 790110703 790763931
3936.6G90763931R77707j56936k94648l28827K143097J945649n068207j442261J542740
$$ 790763931 791741638 791584702 791290054 790961227 793104324 795049973 789981766 788539505 790082245
3945.2G90082245J101379J342240k367173L48664M45175j571274J873703J18179o52465
$$ 790082245 791183624 792525864 790158691 790507355 790952530 789381256 791254959 791373138 790720673
3953.9G90720673N39474N55039n8289o31561M28161l62777K15301n18799j517944J220703
$$ 790720673 791260147 791815186 791756897 791125336 791553497 791190720 791406021 790887222 789369278 790589981
3963.6G90589981O99310m02374l7918K79923M90951r55505q02689R19342L35007O4163
$$ 790589981 791289291 790886917 790848999 791128922 791619873 790664368 789861679 790781021 791116028 791180191
3973.2G91180191N6152p27386k36588j31988Q53042Q21457p88040l20434l2273K06299
$$ 791180191 791236343 790508957 790272369 790140381 790993423 791814880 791026840 790706406 790674133 790880432
3982.8G90880432Q37097M66309m09546r5062K50320m39682l68118o45218j04065O9199
$$ 790880432 791717529 792183838 791774292 791679230 791929550 791489868 791121750 790476532 790372467 790441666
3992.5G90441666j49002N10253o38046n61294Q03833N58166M2877M88434
$$ 790441666 790292664 790802917 790164871 789603577 790407410 790965576 791008453 791496887
4000.2G91496887
$$ 791496887
##END=$$ End of the data block
