##TITLE=$$ Begin of the data block
##JCAMP-DX=5.00 $$ ACD/SpecManager v 10.08
##SPECTROMETER/DATA SYSTEM=Varian
##DATE=18 Dec 2012 14:24:22
##DATA TYPE=INFRARED SPECTRUM
##DATA CLASS=XYDATA
##ORIGIN=
##OWNER=
##NPOINTS=3735
##FIRSTX=399.26403809
##LASTX=4000.35498047
##MAXX=4000.35498047
##MINX=399.26403809
##MAXY=73.78903198
##MINY=16.23732376
##XFACTOR=1.0000000000
##YFACTOR=0.000000100000000
##FIRSTY=58.77009964
##DELTAX=0.96440572
##XUNITS=1/CM
##YUNITS=TRANSMITTANCE
##XYDATA=(X++(Y..Y))
399.3E87700996J0576859n634384M72641M459457O157799L939171l697510j0025063
$$ 587700996 598277855 592643471 593116112 597575569 603733368 607672539 603975029 593949966
407E93949966n349388J895256J834870J376228r74617j676598k152862l11585j174736
$$ 593949966 588600578 590495834 592330704 593706932 592732315 591055717 588902855 588591270 587416534
415.7E87416534j404876P190170p78961q390808M158630K81639Q341484N156899q070297
$$ 587416534 586011658 593201828 592422867 584032059 588190689 588472328 596813812 601970711 593900414
424.3E93900414p602005J376037q77304m790802N851364N351944j265030j586380l620605
$$ 593900414 586298409 587674446 586797142 582006340 587857704 593209648 591944618 590358238 586737633
433E86737633j308174O04362l239746o25267J873665r36165j486588l032112J645890
$$ 586737633 585429459 586033821 582794075 582168808 584042473 583106308 581619720 578587608 580233498
441.7E80233498M460258l967323k740784N65186K830391K742080J317215K522202j348229
$$ 580233498 584693756 580726433 577985649 578550835 581381226 584123306 585440521 587962723 586614494
450.4E86614494m170952k588996J539764J073875k140731k720452R15909N088577k561836
$$ 586614494 582443542 579854546 581394310 582468185 580327454 577607002 578522911 583611488 581049652
459.1E81049652j877823n29251N6000k419205l860397J723099P58056j705169j750336
$$ 581049652 579171829 578642578 578698578 576279373 572418976 574142075 574900131 573194962 571444626
467.7E71444626o64444K229652n54542j106491l178826j164970L996849J022415l306503
$$ 571444626 570780182 573009834 572455292 571348801 568169975 567005005 571001854 572024269 568717766
476.4E68717766l028717L179359M024201j01242k98272j930465k712288j612129j5412
$$ 568717766 565689049 568868408 572892609 572791367 572493095 570562630 567850342 566238213 566222801
485.1E66222801K978211N248565K586022p05109j520233k188339l354988l302079j35345
$$ 566222801 569201012 574449577 577035599 576330490 574810257 572621918 569266930 565964851 565829506
493.8E65829506N902290N652619j073342j601982K1935j788559j725807J073989L014908
$$ 565829506 571731796 577384415 576311073 574709091 574731026 572942467 571216660 572290649 575305557
502.5E75305557j743202l177948j455460p71141M04473j180802j286468p46231j151657
$$ 575305557 573562355 570384407 568928947 568157806 568562279 567381477 566095009 565348778 564197121
511.1E64197121J251869O19202j112595j665764q39653N16129k498818k230491Q80203
$$ 564197121 565448990 566068192 564955597 563289833 562450180 562966309 560467491 558237000 559117203
519.8E59117203J135864K79427r93042k473412r36470m59824r24186O40411r46999
$$ 559117203 560253067 560532494 559539452 557066040 556129570 555669746 554745560 555385971 554438972
528.5E54438972o22215L96996k1973M29535L59459K82707j735916j393166Q45070P38564
$$ 554438972 553816757 554213753 554191780 554621315 554980774 555263481 553527565 552134399 552979469 553718033
538.1E53718033m44031j44119R56993n94444N92460J558457j62468j694527q7089K564430
$$ 553718033 553274002 553129883 554086876 553492432 554084892 555643349 555480881 553786354 553699265 556263695
547.8E56263695M92210M98314J76430o1531J197395N99251Q79936l28560o89697j109238
$$ 556263695 556755905 557254219 557430649 557369118 558566513 559165764 560045700 559717140 559027443 557918205
557.4E57918205r19113j46217n55763J51786l01323J363945M89045j163102J46637
$$ 557918205 556999092 556852875 556297112 556448898 556147575 557511520 558000565 556837463 556984100
566.1E56984100L97950N36270j698571j211319R03550J164055m21410j270905J016846
$$ 556984100 557382050 557918320 556219749 555008430 555911980 557076035 556654625 555383720 556400566
574.8E56400566m31137r00764k54860j186180p81632m75731R87320J591110N73883
$$ 556400566 555969429 555068665 554813805 553627625 552845993 552370262 553357582 554948692 555522575
583.5E55522575k094001j435776M99267R16977J492615m94232k83623k63519j236076
$$ 555522575 553428574 551992798 552492065 553409042 554901657 554407425 554123802 553860283 552624207
592.1E52624207J07612P62482k66953j603470l10058k61765n39245j658020k324829
$$ 552624207 552731819 553494301 553227348 551623878 551313820 551052055 550512810 548854790 546529961
600.8E46529961r44405j632118k051201m900589n447044m533387o540908p233468r350509
$$ 546529961 545585556 543953438 541902237 537001648 531554604 527021217 520480309 513246841 503896332
609.5E03896332j1239853j3233147j3172912j2467766j0443535p300262l083802J741600
$$ 503896332 492656479 479423332 466250420 453782654 443339119 436038857 432955055 434696655
617.2D34696655n49354k362366m747314p933312r685211r823151p993545l598404O054077
$$ 434696655 434147301 431784935 427037621 419104309 409419098 399595947 391602402 388003998 394058075
625.9C94058075J1532707J6461601J6886750J6136512J3740349O791725K760964j731148
$$ 394058075 405590782 422052383 438939133 455075645 468815994 475607719 478368683 476637535
633.6D76637535n650902r139557q072776n931244n257187j282540M060708J1697464
$$ 476637535 470986633 461847076 453774300 447843056 442585869 441303329 445364037 457061501
641.3D57061501J4721679J7096367J7046929J4258079J1085739R566803R192963O274757
$$ 457061501 471783180 488879547 505926476 520184555 531270294 540837097 550030060 556304817
649E56304817L828888L040924L292771K120628O5880N62324J034661P86285R0561O42586
$$ 556304817 560133705 563174629 566467400 568588028 568653908 569216232 570250893 571037178 571127739 571770325
658.7E71770325K664299J766395J119919J410980M26789q81462k62032K194328R63097
$$ 571770325 574434624 576201019 577320938 578731918 579158707 578277245 578015213 580209541 581172638
667.4E81172638k379036L865738J756859r0103M7111J279030L67241n95207K5253R07898
$$ 581172638 578793602 582659340 584416199 584326096 584373207 585652237 586019478 585424271 585449524 586357422
677E86357422J469307L91846k11525J80587J164170M79736q76045r92852j808929p81708
$$ 586357422 587826729 588218575 588007050 588187637 589351807 589831543 588955498 587962646 586153717 585372009
686.7E85372009M71649Q88100r6550j248245K42157j38054j148148j989975k147941
$$ 585372009 585843658 586731758 586635208 585386963 585629120 585491066 584342918 582352943 580205002
695.3E80205002p19910p21359p1182L60679n302K09198k65885p68203p76062j71929
$$ 580205002 579485092 578763733 578692551 579053230 579047928 579257126 578991241 578223038 577446976 577275047
705E77275047N68924J318360J089744J059761J550141P52220J108246J107940J059876
$$ 577275047 577843971 579162331 580252075 581311836 582861977 583614197 584722443 585830383 586890259
713.7E86890259J371116J94474N96618J619568K077751J683579R86328J621361J302452
$$ 586890259 588261375 588455849 589052467 590672035 592749786 594433365 595419693 597041054 598343506
722.3E98343506N24368J95160k38724l72276L53050J058922k6245n13115m90837j138497
$$ 598343506 598867874 599063034 598824310 598452034 598805084 599864006 599837761 599324646 598833809 597695312
732E97695312q04595o49910k96631l77693l08800L34892m70505k37693J040763N84259
$$ 597695312 596890717 596240807 595944176 595566483 595257683 595592575 595122070 594884377 595925140 596509399
741.6E96509399j029014n52597M86374P90291K007827J431198J895523L254014K097511
$$ 596509399 595480385 594927788 595414162 596204453 598212280 599643478 601539001 604793015 606890526
750.3F06890526J507797J737518K727738K353363J370849J771393J332550J179428
$$ 606890526 608398323 610135841 612863579 615216942 616587791 618359184 619691734 620871162
758F20871162J363717J369438M28352J81389L55530J03759N26085Q9341N19180L51677
$$ 620871162 622234879 623604317 624032669 624214058 624569588 624673347 625199432 625288773 625807953 626159630
767.7F26159630j77536m60053r77745P5188n31349o06995J890869K237511Q75702J773300
$$ 626159630 625982094 625522041 624544296 624619484 624088135 623481140 625372009 627609520 628485222 630258522
777.3F30258522K286835J451797J986962J331520Q73413Q87184J476898K172165R09882
$$ 630258522 632545357 633997154 635984116 637315636 638189049 639076233 640553131 642725296 643635178
786F43635178J271057J426620N38025N09110P68280n17273q26493J219712R20257J66245
$$ 643635178 644906235 646332855 646870880 647379990 648148270 647630997 646804504 648024216 648944473 649110718
795.6F49110718n32685l14712P31125M40597j09634j100464m52347J001053J392212
$$ 649110718 648578033 648263321 648994446 649435043 649325409 648224945 647772598 648773651 650165863
804.3F50165863L93372J78756J014405M95147M9591j51901O65131O53381n60913p69806
$$ 650165863 650559235 650737991 651752396 652247543 652297134 652145233 652810364 653463745 652902832 652133026
814F52133026l53317J70288J119614J705322N27572L45612p8659m36783n52139j039810
$$ 652133026 651779709 651949997 653069611 654774933 655302505 655648117 655569458 655132675 654580536 653540726
823.6F53540726j94779q00094p36847l99628m501r89762k671432j686859k749939l115006
$$ 653540726 653345947 652545853 651809006 651409378 651404877 650415115 647743683 646056824 643306885 640191879
833.3F40191879k531357j953430j782150k612877k092018k837830l128433l009987
$$ 640191879 637660522 635707092 633924942 631312065 629220047 626382217 623253784 620243797
841F20243797k820015j900673j521530j206016j370774j092147j18409Q43277J221047
$$ 620243797 617423782 615523109 614001579 612795563 611424789 610332642 610214233 611057510 612278557
849.6F12278557J601105J439399J012612J667366J945953K633667K585640K369919
$$ 612278557 613879662 615319061 616331673 617999039 619944992 622578659 625164299 627534218
857.4F27534218K537346K276306K482948J532021J236000P85942J148491J638603Q29086
$$ 627534218 630071564 632347870 634830818 636362839 637598839 638384781 639533272 641171875 642000961
866F42000961J524735J396255P62177r0103O75964J195755K52533J102524J334533
$$ 642000961 643525696 644921951 645684128 645594025 646269989 647465744 647718277 648820801 650155334
874.7F50155334J291275N34974j37253l45307n63125j642380k915039j934509j533051
$$ 650155334 651446609 651981583 651844330 651499023 650935898 649293518 646378479 644443970 642910919
883.4F42910919j051407j433639j777420j482239j243706o30226j480293n46150K65426
$$ 642910919 641859512 640425873 638648453 637166214 635922508 635292282 633811989 633265839 633531265
892.1F33531265l51600q1597Q07419J064949L54843R35021O15272K47078k07481j109772
$$ 633531265 633179665 633098068 633905487 634970436 635325279 636260300 636875572 637122650 636915169 635805397
901.7F35805397q15315n44167k65693o55518m76952j438255k262955k174186k561379
$$ 635805397 634990082 634445915 634180222 633524704 633047752 631609497 629346542 627172356 624610977
910.4F24610977j852417k731666l020974j915474j623992j386948j210976j973266
$$ 624610977 622758560 620026894 617005920 615090446 613466454 612079506 610868530 608895264
918.1F08895264k775078k696915l254776k516060j587486j400375j293221k089538
$$ 608895264 606120186 603423271 600168495 597652435 596064949 594664574 593371353 591281815
925.8E91281815j660195r38873n20439k19765k87399m43077p95822M24613J877823
$$ 591281815 589621620 588682747 588162308 587942543 587655144 587212067 586416245 586840858 588718681
934.5E88718681J863823J742554K224922J948052J510429K375832K931442L621178
$$ 588718681 590582504 592325058 594549980 596498032 598008461 600384293 603315735 606936913
942.2F06936913K784423J728363K289544J820411J894493K094574K034493J730118
$$ 606936913 609721336 611449699 613739243 615559654 617454147 619548721 621583214 623313332
949.9F23313332J020507L95775O35071N08881r56803j1367l4028j439018r99183j178818
$$ 623313332 624333839 624729614 625364685 625873566 624916763 624905396 624871368 623432350 622433167 621254349
959.6F21254349k375107k629929k034187k282753k148857k465820k793923j772308
$$ 621254349 618879242 616249313 614215126 611932373 609783516 607317696 604523773 602751465
967.3F02751465j581001j719246j816063j504936j60904j47629j444664j374970p74688
$$ 602751465 601170464 599451218 597635155 596130219 595969315 595821686 594377022 593002052 592227364
976E92227364j090470j111755j176376j496964j199303j367111j887131j383743j411056
$$ 592227364 591136894 590025139 588848763 587351799 586152496 584785385 582898254 581514511 580103455
984.7E80103455k237969k583885k680321l216896l782921l569641m524193n828399
$$ 580103455 577865486 575281601 572601280 569384384 565601463 562031822 557507629 551679230
992.4E51679230q652115j3559647j6448059j3341331O27098J3539619J4073143Q771782
$$ 551679230 543027115 529467468 513019409 499678078 500305176 513844795 527917938 536689720
1000.1E36689720M754868J979789L12577j30234L2577K5063q20579j878624j026612
$$ 536689720 541444588 543424377 543736954 543606720 543639297 543664360 542843781 540965157 539938545
1008.8E39938545m45633j172256j458283j902885j414642j257935j251907l34893k235908
$$ 539938545 539492912 538320656 536862373 534959488 533544846 532286911 531035004 530700111 528464203
1017.5E28464203l051758j509743j342811j624298k428360k025643j396103j528206
$$ 528464203 525412445 523902702 522559891 520935593 518507233 516481590 515085487 513557281
1025.2E13557281k065315k130775j518440k049942j353455j633453k027665j699180
$$ 513557281 511491966 509361191 507842751 505792809 504439354 502805901 500778236 499079056
1032.9D99079056j741066j056175k056427j677094r46426o33507p43446j766663p67975
$$ 499079056 497337990 496281815 494225388 492548294 491601868 490968361 490224915 488458252 487690277
1041.6D87690277k07672p97310p71751L14903l36800k92434N45463K63443N08080L78914
$$ 487690277 487482605 486685295 485913544 486228447 485891647 485599213 486144676 486408119 486916199 487295113
1051.2D87295113J008186k86789J2932P70950N83687R88197j041259M7531K92892p27501
$$ 487295113 488303299 488016510 488029442 488800392 489384079 490372276 489331017 489378548 489671440 488943939
1060.9D88943939p31125k05803O91872r17435o57234r51347p45926j085548j996956
$$ 488943939 488212814 488007011 488698883 487781448 487124214 486172867 485426941 484341393 482344437
1069.5D82344437j287690j688461r57641k072869j358146p74384j505394j751862k704429
$$ 482344437 481056747 479368286 478410645 476337776 474979630 474205246 472699852 470947990 468243561
1078.2D68243561j248322j883888j376991j537171j344757r22546k603302j586838
$$ 468243561 466995239 465111351 463734360 462197189 460852432 459929886 457326584 455739746
1085.9D55739746k927589l461686m441986m669303m759408o555175o644936q963661
$$ 455739746 452812157 449350471 444908485 440239182 435479774 428924599 422279663 413316002
1093.6D13316002q420677r909630j0972519j0639229j0426674r447899j2293129j0443229
$$ 413316002 404895325 394985695 384013176 373373947 362947273 353499374 341206245 330763016
1101.4C30763016j0994606j0063801r809837j0886040r912853j0696469p340049r578763
$$ 330763016 319768410 309704609 299894772 289008732 279095879 268399410 261059361 251480598
1109.1B51480598q175602p337856o703758m982300n615444j850281l587570p83100
$$ 251480598 243304996 235967140 229263382 224281082 218665638 216815357 213227787 212444687
1116.8B12444687q56571q44841O00509N05677K832717N93739K517910Q77667K290344
$$ 212444687 211588116 210743275 211343784 211849461 214682178 215275917 217793827 218671494 220961838
1125.5B20961838K371959N21222J597557q32596J027183j238269j154423k541714l061600
$$ 220961838 223333797 223855019 225452576 224619980 225647163 224408894 223254471 220712757 217651157
1134.1B17651157k040462l866768j714478m383640k090339k318898j779937j805058
$$ 217651157 215610695 211743927 210029449 205645809 203555470 201236572 199456635 197651577
1141.9A97651577m571800k130223m753074k624035m125118l608246k571602l428688
$$ 197651577 193079777 190949554 186196480 183572445 179447327 175839081 173267479 169838791
1149.6A69838791j401043l484936l02849k261428j5297R98230P7571J805497l32146
$$ 169838791 168437748 164952812 164649963 162388535 162373238 163371468 163449039 165254536 164922390
1158.3A64922390K423019P40033L168106K412147K572956M673481L149109N950489
$$ 164922390 167345409 168085442 171253548 173665695 176238651 180912132 184061241 190011730
1166A90011730L717613N903378N074348N834885O988430O110172Q824139O864109Q453846
$$ 190011730 193729343 199632721 204707069 210541954 217530384 223640556 232464695 239328804 247782650
1174.6B47782650O872654Q251495Q724308P505303Q864593P343426R518948P738609
$$ 247782650 254655304 262906799 271631107 279136410 288001003 295344429 304863377 312601986
1182.4C12601986P338848P018318P245865P753906N855713O586991N092773O276970
$$ 312601986 319940834 326959152 334205017 341958923 347814636 354401627 359494400 365771370
1190.1C65771370N271645M861297N389557M765282O034126N114365O264343N493049
$$ 365771370 371043015 375904312 381293869 386059151 392093277 397207642 403471985 408965034
1197.8D08965034O150513O299896N479584O424828N024338N526084N323410N252152
$$ 408965034 415115547 421415443 426895027 433319855 438344193 443870277 449193687 454445839
1205.5D54445839M579391M520913M601173L589897M113579L464546M039726L304978
$$ 454445839 459025230 463546143 468147316 471737213 475850792 479315338 483355064 486660042
1213.2D86660042K809448K634583K180061L033333J947441J905212J573067J741180
$$ 486660042 489469490 492104073 494284134 497317467 499264908 501170120 502743187 504484367
1220.9E04484367J674309J327515J392326j64909O61011R42115O62346M84238M69742
$$ 504484367 506158676 507486191 508878517 508713608 509374619 510316734 510979080 511463318 511933060
1229.6E11933060J102676O69518J237869J186523J202317P66220O83403R23881M80232
$$ 511933060 513035736 513705254 514943123 516129646 517331963 518098183 518781586 519705467 520185699
1238.3E20185699Q63686M42925N16662M07524J088486J109085L31040O68220m692K26746
$$ 520185699 521049385 521492310 522008972 522416496 523504982 524614067 524945107 525613327 525608635 525835381
1247.9E25835381O4048O56548Q84056J96571N11132J62353Q42896P28645O20079M03137
$$ 525835381 525899429 526555977 527440033 527636604 528147736 528310089 529152985 529881630 530501709 530904846
1257.6E30904846J6442M97551M09469O19164M64935J057892Q71162R57298J037446
$$ 530904846 530921288 531418839 531828308 532447472 532912407 533970299 534841461 535798759 536836205
1266.3E36836205J73187Q49991Q34083Q09517R18923J429443J422539J364212J558304
$$ 536836205 537009392 537859383 538693466 539502983 540421906 541851349 543273888 544638100 546196404
1274.9E46196404R52568J793823J481857J177635J357575J306495J609154J298256
$$ 546196404 547148972 548942795 550424652 551602287 552959862 554266357 555875511 557173767
1282.7E57173767J566773J365814J709671J906509J611252J463623J237564J484490
$$ 557173767 558740540 560106354 561816025 563722534 565333786 566797409 568034973 569519463
1290.4E69519463J297988J718102J403732J154442J809235J374283J188736J501617
$$ 569519463 570817451 572535553 573939285 575093727 576902962 578277245 579465981 580967598
1298.1E80967598J360626R39408R18922R61723J035195R24034M45137N83649Q29048
$$ 580967598 582328224 583267632 584186554 585148277 586183472 587107506 587552643 588136292 588965340
1306.8E88965340R01031P78427O88896R62601O56471J58120L31764N36079M87786K02560
$$ 588965340 589866371 590644798 591333694 592296295 592952766 593110886 593442650 593978729 594466515 594669075
1316.4E94669075O10466J244888M74320L64418Q12416N91240O18591Q08334Q55942
$$ 594669075 595279541 596524429 596998749 597363167 598175583 598766823 599385414 600193748 601049690
1325.1F01049690M10919M33541N65796K55508M25682M04473L0555J7243J21689K21672
$$ 601049690 601460609 601894150 602459946 602715454 603141136 603545609 603576164 603593407 603715096 603936768
1334.7F03936768J02768m29268N5580K78663n44242k59095M62914O94885J65749l26615
$$ 603936768 604039536 603610268 603665848 603944511 603400269 603141174 603604088 604298973 604464722 604138107
1344.4F04138107j67503j53084k71301j96800J5220k81181k31209l76549m44603j33857
$$ 604138107 603970604 603817520 603546219 603349419 603364639 603083458 602852249 602475700 602031097 601897240
1354F01897240m99420m74167k47040j40801j38969O3400Q7052k33536j12763j451568
$$ 601897240 601397820 600923653 600676613 600535812 600396843 600460243 600547295 600313759 600200996 598749428
1363.7E98749428o65360R5177p35703n84983p95365j102905k87437k58713l20549n37567
$$ 598749428 598084068 598179245 597443542 596858559 596063194 594960289 594672852 594414139 594093590 593556023
1373.3E93556023j426964j140976k00997k17132p78923l58391l02238o90270l57094
$$ 593556023 592129059 590988083 590787086 590569954 589791031 589432640 589130402 588440132 588083038
1382E88083038n45311l21693J56479R90181J403503j38511M25796J151199L47405k90222
$$ 588083038 587537727 587216034 587372513 588362694 589766197 589627686 590053482 591204681 591552086 591261864
1391.6E91261864k45400K09847n68924j336632j81808J1978l39661j748085q05588
$$ 591261864 591016464 591226311 590657387 589320755 589138947 589150925 588811264 587063179 586257591
1400.3E86257591J65596m12636m37850L24020n15556j210175L1090l63198o92367l52936
$$ 586257591 586423187 586010551 585572701 585896721 585381165 584170990 584202080 583838882 583146515 582793579
1409.9E82793579k87666j67122n26428k62528k56309j78604O5460K5215Q56247k309113
$$ 582793579 582505913 582338791 581812363 581549835 581293526 581114922 581180382 581205597 582061844 579752731
1419.6E79752731n17769J486054O63757M01345q00820N29900J068344K49023J025582
$$ 579752731 579234962 580721016 581384773 581786118 580985298 581515198 582583542 582832565 583858147
1428.3E83858147J053238k78740o3477J606140J059036j9073J140938J439743n19028
$$ 583858147 584911385 584632645 584569168 586175308 587234344 587215271 588356209 589795952 589276924
1437E89276924M52843J752014L75710J31301R23500N16587Q31184L98026N49965J285209
$$ 589276924 589729767 591481781 591857491 591988792 592912292 593428879 594260063 594658089 595208054 596493263
1446.6E96493263R38263m53300L44772P56836J11313O80008N08919J106224J364784
$$ 596493263 597431526 596978226 597322998 598079834 598191147 598871155 599380074 600486298 601851082
1455.3F01851082M56276m24271j443901K070732J347084J698265J251221R62982J669007
$$ 601851082 602307358 601883087 600439186 602509918 603857002 605555267 606806488 607769470 609438477
1464F09438477m07906P12852J286316J139870R85565J084214K050437O31600M08516
$$ 609438477 609030571 609743423 611029739 612169609 613155174 614239388 616289825 616921425 617329941
1472.6F17329941J684189L177414L707428R43107P40929J865158J030311J148263Q50448
$$ 617329941 619014130 622191544 625898972 626842079 627583008 629448166 630478477 631626740 632477188
1481.3F32477188O70662J302261J404343R85222P24182j7586m01497J018525j041260
$$ 632477188 633147850 634450111 635854454 636839676 637563858 637546272 637144775 638163300 637122040
1490F37122040j987419L55568P56530k5711l18527O59943k735863O84051j44157k979927
$$ 637122040 635134621 635490189 636246719 636221008 635902481 636562424 633826561 634510612 634366455 631386528
1499.6F31386528R5406p13234j108208r32999P69120K095298k338180j0071602p34367
$$ 631386528 631481934 630768700 629660492 628727493 629496613 631591911 629253731 619182129 618447762
1508.3F18447762K276153j076126J03416j708755k810020j75019j071815m60320j697426
$$ 618447762 620723915 619647789 619751205 618042450 615232430 615057411 613985596 613525276 611827850
1517F11827850k795372R74312J902657j038513l197022p88574L10974J556892k556648
$$ 611827850 609032478 610006790 611909447 610870934 607673912 606885338 607196312 608753204 606196556
1525.7F06196556q79822j19857j539689l66859j94206k94037o42128J65176l965645
$$ 606196556 605316734 605196877 603657188 603290329 603096123 602802086 602159958 602325134 598359489
1534.3E98359489q0986L22075q2397K090187k748604n121345J264991o7176j414528
$$ 598359489 598278503 598600578 598518181 600608368 597859764 592738419 594003410 593936234 592521706
1543E92521706J354408J545181k607269R79690M84963N78689l56750j941185J546707
$$ 592521706 593876114 595421295 592814026 593793716 594278679 594857368 594500618 592559433 594106140
1551.7E94106140J393585J994400r49554j50528K935333L269806K219200n486793j893845
$$ 594106140 595499725 597494125 596544571 596394043 599329376 602599182 604818382 599331589 597437744
1560.4E97437744J689034K231826J330567J025886n33523p02896Q34312M49677J313057
$$ 597437744 599126778 601358604 602689171 603715057 603181534 602478638 603312950 603762627 605075684
1569.1F05075684k633782m28924N82046k27623K67601K80495J618004o015740o50825
$$ 605075684 602441902 602012978 602595024 602367401 602635002 602915497 604533501 598517761 597866936
1577.7E97866936L84369q01278q43734j577568l05863j741905j391563j264916j562462
$$ 597866936 598251305 597450027 596606293 595028725 594722862 592980957 591589394 590324478 588762016
1586.4E88762016j455993k269669j519165k472534j299744j998672j706505j557312
$$ 588762016 587306023 585036354 583517189 581044655 579744911 577746239 576039734 574482422
1594.1E74482422k330933j518440k562904j270714k795754k297058k065849k117233
$$ 574482422 572151489 570633049 568070145 566799431 564003677 561706619 559640770 557523537
1601.9E57523537j217804k614022j377410k390023j671295k893906k124939j793670
$$ 557523537 556305733 553691711 552314301 549924278 548252983 545359077 543234138 541440468
1609.6E41440468l212090j039123k963448j544418j783753k57759k32696p669869K22664
$$ 541440468 538228378 537189255 534225807 532681389 530897636 530639877 530407181 522737312 522959976
1618.2E22959976j580887p91244k244644j33324P2746m571647o03066j471748J08452
$$ 522959976 521379089 520587845 518343201 518209877 518282623 513710976 513107910 511636162 511744614
1626.9E11744614l079224k281990o83136q78639l99742j641426N81131k9946k746544
$$ 511744614 508665390 506383400 505700264 504821625 504421883 502780457 503361588 503331642 500585098
1635.6E00585098l142891J048355J54572K13509J110076j136207P18765o49795J099205
$$ 500585098 497442207 498490562 498645134 498858643 499968719 498832512 499551277 498901482 500000687
1644.3E00000687J714821n48707Q74901k571182K403526O73409K289886K927323L793029
$$ 500000687 501715508 501166801 502041702 499470520 501874046 502547455 504837341 507764664 511557693
1653E11557693m664993k086716L328324J053963K019043J142616J278953J464730J437759
$$ 511557693 506892700 504805984 508134308 509188271 511207314 512349930 513628883 515093613 516531372
1661.6E16531372K683983J79520K539901J206131J363373J762924K552033K445793
$$ 516531372 519215355 519394875 521934776 523140907 524504280 526267204 528819237 531265030
1669.4E31265030j30272M041557O36750K144622L174706J773338L44696K351570L259735
$$ 531265030 531134758 535176315 535813065 537957687 541132393 542905731 543250427 545601997 548861732
1678E48861732J411667K660942J351357L022652M653778J843109L47061o9885M619751
$$ 548861732 550273399 552934341 554285698 557308350 561962128 563805237 564152298 564082413 568702164
1686.7E68702164L214874K632484L212052K010498K760925K855034L109589L233451
$$ 568702164 571917038 574549522 577761574 579772072 582532997 585388031 588497620 591731071
1694.4E91731071M642792L50304K826004N193939N267143O934243m627648L883972
$$ 591731071 596373863 596724167 599550171 604744110 610011253 616945496 612317848 616201820
1702.1F16201820L945771L584060K551537K378464K183151J998672L584214K927627
$$ 616201820 620147591 623731651 626283188 628661652 630844803 632843475 636427689 639355316
1709.9F39355316J871109J809311K125015K511216M78515L42255K826538K199783m149399
$$ 639355316 641226425 643035736 645160751 647671967 648150482 648492737 651319275 653519058 649369659
1718.5F49369659J735383K385101P07702N77546j19934n23453O40106O25229L73916
$$ 649369659 651105042 653490143 654197845 654775391 654655457 654132004 654772110 655397339 655771255
1727.2F55771255Q89969K500534R00727j058884K376633L499985P18460n672989J758117
$$ 655771255 656661224 659161758 660062485 659003601 661380234 664880219 665598679 659925690 661683807
1735.9F61683807K535019J147995K406998N92499j916275K893371K744446Q35343R02633
$$ 661683807 664218826 665366821 667773819 668366318 666450043 669343414 672087860 672923203 673825836
1744.6F73825836K659455K179870J171265K257538J373977L406830J933975N188L275681
$$ 673825836 676485291 678665161 679836426 682093964 683467941 686874771 688808746 688813934 692089615
1753.3F92089615K077103K031936K644348K42386J034165K009582J793823K679749
$$ 692089615 694166718 696198654 698843002 699085388 700119553 702129135 703922958 706602707
1761G06602707o98013j182709K089233J313782Q56247J063003J280594j434250J038132
$$ 706602707 705904694 704721985 706811218 708125000 708981247 710044250 711324844 709890594 710928726
1769.7G10928726L049698L52249j187515j981964K222900J950760q10089J038895P31353
$$ 710928726 713978424 714330673 713143158 711161194 713384094 715334854 714524765 715563660 716295013
1778.3G16295013J106034Q26416j012039L46222J197433R24911m07333k28042J273040
$$ 716295013 717401047 718227463 717215424 717561646 718759079 719683990 719276657 719048615 720321655
1787G20321655Q06198j66168J047440J52130l07999p58590j064454K459946J219483
$$ 720321655 721127853 720961685 722009125 722161255 721853256 721094666 720030212 722490158 723709641
1795.7G23709641o80085O02494J520309L71933j170883J078796l42865j16348R25598
$$ 723709641 723029556 723632050 725152359 725524292 724353409 725432205 725089340 724972992 725898590
1804.4G25898590K06757N12161M22440R1857L70102J041489r30176n08346N78994K26899
$$ 725898590 726105347 726617508 727039948 727131805 727501907 728543396 727613220 727104874 727683868 727910767
1814G27910767O77719J84402Q26645J32828K72140M53797o78711M58450j91345J43738
$$ 727910767 728588486 728772888 729599533 729732361 730004501 730458298 729779587 730238037 730046692 730190430
1823.7G30190430J021728j002350l64914J122742J619721O69403k814103p7590J556625
$$ 730190430 731212158 730209808 729844894 730967636 732587357 733256760 730442657 730365067 731921692
1832.3G31921692j1292j17950L10059R29031M79889p41959Q14362N8822l8528o6147
$$ 731921692 731910400 731792450 732102509 733031540 733511429 732769470 733583832 733642654 733604126 733537979
1842G33537979M76151R30252l711243J070252J593093p8506j23978L25623M06036q8196
$$ 733537979 734014130 734944382 731233139 732303391 733896484 733817978 733694000 734019623 734425659 734337463
1851.6G34337463O24085j48544Q9111N23605P8888P3776l78112J83868J43433M73098
$$ 734337463 734961548 734813004 734902115 735425720 735504608 735578384 735200272 735384140 735527573 736000671
1861.3G36000671j19552k94113J38015j02844N02548k13852K90375k39792j177520
$$ 736000671 735881119 735587006 735725021 735622177 736124725 735910873 736201248 735961456 734783936
1869.9G34783936M06951O53382M71496n4702R6283k61765K00348M94690R7961k0294
$$ 734783936 735190887 735844269 736315765 736261063 736357346 736095581 736295929 736790619 736888580 736868286
1879.6G36868286n21011J19095K23236M09622o87j84021K77329j85852M83017p5608
$$ 736868286 736347275 736466370 736689606 737099228 737098541 736914520 737191849 737005997 737489014 737413406
1889.2G37413406j234588J43814N31235m83094O8741O06690o12107L52097L36075P5531
$$ 737413406 736178818 736322632 736853867 736370773 736439514 737046204 736434097 736786194 737122269 737197800
1898.9G37197800l2654l10440J144k68707L60870M3412j16730J21383n9356o943j14899
$$ 737197800 737165146 736854706 736855850 736587143 736948013 736991425 736874695 736996078 736936722 736929779 736814880
1909.5G36814880k60543l84217N43671j58615Q2168N45578j49307Q56705j272354j195755
$$ 736814880 736554337 736170120 736713791 736555176 736637344 737182922 737033615 737890320 736617966 735422211
1919.1G35422211O19201J96915M08402r21402n83039Q86154N59769k0294L3035r6512
$$ 735422211 736041412 736238327 736646729 735725327 735142288 736028442 736588211 736567917 736600952 736504440
1928.8G36504440j18026j33667m91715j88522k44904R1477P5912J54038M73556k90222
$$ 736504440 736386414 736252747 735761032 735572510 735327606 735419083 735494995 735649033 736122589 735832367
1938.4G35832367l15018k80151N81207J03989k037277L67126J306992Q5907j35117
$$ 735832367 735517349 735237198 735818405 735922394 733885117 734252243 735559235 735645142 735510025
1947.1G35510025J09863q5754l77579m89197J05286K03781q2855j9302l13034K12783
$$ 735510025 735619888 735534134 735156555 734667358 734772644 734976425 734893570 734874268 734561234 734774017
1956.7G34774017K30255m90341m06646P5988J84632k17896j37787k07672L8147M32663
$$ 734774017 735004272 734513931 734107285 734183273 734367905 734150009 734012222 733804550 733842697 734275360
1966.4G34275360K4643m72183m91409k04239J8692M30297K11335n6305M7073Q1635
$$ 734275360 734300003 733827820 733336411 733132172 733150864 733581161 733792496 733736191 733783264 733864899
1976G33864899j7548l37906L0365k92587n48554j68457K21405L35083l72085k72370
$$ 733864899 733847351 733509445 733539810 733247223 732698669 732530212 732751617 733086700 732714615 732442245
1985.7G32442245j87988j56555l00446n01480J70441N4703n95856k94418N26047L68347
$$ 732442245 732254257 732097702 731797256 731295776 731466217 731520920 730925064 730630646 731156693 731525040
1995.3G31525040m0131k76794n28183j81198k3880J02615k3041K05155J09710k36587
$$ 731525040 731484909 731208115 730679932 730498734 730474854 730577469 730554428 730759583 730869293 730632706
2005G30632706p6371p6599j46789p75223k40402n2643l91617Q6365M1580L1052k02713
$$ 730632706 730556335 730479736 730332947 729557724 729317322 729264679 728873062 728959427 729001007 729032059 728829346
2015.6G28829346o9428m72412j45645J84250p22580j10855J95923N32531K92740n27801
$$ 728829346 728759918 728287506 728141861 728326111 727603531 727492676 727688599 728221130 728513870 727986069
2025.2G27986069m41971k85187J87836k49329l93219l74069l82462J48926L55911K0371
$$ 727986069 727544098 727258911 727446747 727197418 726804199 726430130 726047668 726196594 726552505 726572876
2034.9G26572876m98810J9989j09711l71475k16827j02387l53164n33066N82199J49689
$$ 726572876 726074066 726094055 725984344 725612869 725396042 725293655 724940491 724407425 724989624 725139313
2044.5G25139313p0801P3395n78842k34223r6435N1193j07803j38779n2719R1934R3079
$$ 725139313 725068512 725141907 724563065 724328842 724232407 724283600 724175797 724037018 723984299 724076233 724169312
2055.1G24169312n31540l64380O180O7443o25686k08359M73938l70712l61863o1721
$$ 724169312 723637772 723273392 723279572 723347015 722721329 722512970 722986908 722616196 722254333 722192612
2064.7G22192612j26648n23529l62320k31018l72925l0136l39127l75748l77197m67911
$$ 722192612 722065964 721542435 721180115 720949097 720576172 720546036 720206909 719831161 719453964 718986053
2074.4G18986053n72586n64804j30157l7613k13623m38080J58844L12653j47019l57513
$$ 718986053 718413467 717848663 717718506 717680893 717467270 717029190 717188034 717500687 717353668 716996155
2084G16996155m89578k58866k65884n9433K99911L84369j85165j15662L23105j23215
$$ 716996155 716506577 716247711 715981827 715922394 716222305 716606674 716421509 716305847 716628952 716505737
2093.7G16505737m7989j3046K34528J60217q4381J28174Q0642M99955M53872L6545
$$ 716505737 716457748 716444702 716679230 716839447 716755066 716883240 716963882 717463837 717917709 717954254
2103.3G17954254l85666o5994P4234k73972K56043k1820J77383N51606J81121J89286
$$ 717954254 717568588 717502594 717576828 717302856 717558899 717537079 717714462 718266068 718447189 718636475
2113G18636475K23465N1727l53470j76544M883K17285J76925K3575j43509m13055J15051
$$ 718636475 718859940 718911667 718558197 718381653 718386536 718603821 718780746 718804321 718660812 718247757 718362808
2123.6G18362808j59912k56653j29394m32663l54843r8191L44162k1209r079K02331
$$ 718362808 718202896 717946243 717816849 717384186 717029343 716931152 717275314 717254105 717245026 717447357
2133.2G17447357J00784m4631k59324J00861M3335O9199q545J26953L13415L0518J35498
$$ 717447357 717548141 717503510 717244186 717345047 717388382 717457581 717449036 717575989 717889404 717919922 718055420
2143.8G18055420L7079K64816J13373k39258j39389j144L32794M96521L93677k43454
$$ 718055420 718092499 718357315 718470688 718231430 718092041 718090897 718423691 718920212 719313889 719070435
2153.5G19070435j36185R0179n3711L67585M19616J74561j98593k84043k28500r9258
$$ 719070435 718934250 719024429 718970718 719338303 719757919 719932480 719733887 719449844 719221344 719122086
2163.1G19122086J20773J84708K79769J55335l1815l51638l33939k11258J33896L73459
$$ 719122086 719242859 719427567 719707336 719862671 719830856 719479218 719145279 718934021 719067917 719441376
2172.8G19441376j08032j54648k18582l73917k71835L2882R2545j21765q2398P3700
$$ 719441376 719333344 719178696 718960114 718586197 718314362 718347244 718439789 718318024 718235626 718309326
2182.4G18309326L93524L09983K5940j25199K48642N0812l51639J81122M1275L42407
$$ 718309326 718702850 719012833 719038773 718913574 719162216 719213028 718861389 719042511 719083786 719426193
2192G19426193K96402J80359O35223K35978K20108J18789K66190K8381m0512L28522
$$ 719426193 719722595 719902954 720538177 720774155 720994263 721113052 721379242 721407623 721367111 721695633
2201.7G21695633k28195L2425J34887K55356L52936O0654J99356j23368j5487K69470
$$ 721695633 721467438 721499863 721634750 721890106 722243042 722303696 722503052 722379684 722364197 722633667
2211.3G22633667N2872k41623j44043Q6593K64588M60586L39203O3706l91999j19857
$$ 722633667 722686539 722444916 722300873 722387466 722652054 723112640 723451843 723515549 723123550 723003693
2221G23003693O0119k54898l25622k88239J44806K42081r7122k75879P7133K19574
$$ 723003693 723063812 722808914 722483292 722195053 722339859 722581940 722484818 722208939 722286072 722505646
2230.6G22505646J80588p8354l11356j0376j83105K02713Q3465j04828K09275l9444
$$ 722505646 722686234 722607880 722296524 722286148 722103043 722305756 722389221 722284393 722493668 722454224
2240.3G22454224l4943m39224R15J39313m4861J21231o7749K43836k95487j51367L0441
$$ 722454224 722419281 721980057 721980972 722120285 722075424 722196655 722128906 722372742 722077255 721925888 721956329
2250.9G21956329r7503Q392j00098N98145Q3923k53753R155Q2474J33514p3624o4697
$$ 721956329 721858826 721867218 721767120 722365265 722449188 722195435 722204590 722287064 722420578 722346954 722282257
2261.5G22282257l37448J59836K14691J75705K67181Q5297K28424k01950l51715m50745
$$ 722282257 721944809 722104645 722319336 722495041 722762222 722847519 723075943 722873993 722522278 722071533
2271.1G22071533J52970l9902k39639O71386K89459n5618m90570j65253N951r2544
$$ 722071533 722224503 722184601 721944962 722616348 722905807 722850189 722359619 722194366 722200317 722107773
2280.8G22107773K15149o5918J64261m08860k28805J67389J31073J24511k45132K69775
$$ 722107773 722322922 722257004 722421265 722012405 721783600 721950989 722082062 722206573 721961441 722231216
2290.4G22231216l31726j35574j2665m29153K29568N5390K46811m6235J1979J87606
$$ 722231216 721899490 721763916 721751251 721322098 721551666 721607056 721853867 721807632 721819611 722007217
2300G22007217k79159k39563k14920J81122j86615k49787J88294M58908J13907k41165
$$ 722007217 721728058 721488495 721273575 721454697 721268082 721018295 721206589 721665497 721779404 721538239
2309.7G21538239L45535k13394m13056k30865j11008m63180p90024M54025M34494m8065
$$ 721538239 721883774 721670380 721257324 721026459 720915451 720452271 719662247 720116272 720550766 720502701
2319.3G20502701n89218o77567L42560N50995k31171q61587J7471K19650r9487L27072
$$ 720502701 719913483 719235916 719578476 720129471 719898300 719036713 719054184 719273834 719174347 719501419
2329G19501419O15463m2572o43234q62808k34604J139145p858Q6517M75616j00937
$$ 719501419 720116882 720074310 719431076 718568268 718333664 719472809 719464951 719551468 720027084 719926147
2338.6G19926147O52619m30374n15518p1030L78876Q39767m66003j58234L21426J34735
$$ 719926147 720578766 720148392 719632874 719561844 719940720 720780487 720314484 720156250 720477676 720612411
2348.3G20612411Q28553Q63952l75213m15573L62396L28522r75113j094513M85382
$$ 720612411 721440964 722304916 721929703 721514130 721876526 722205048 721229935 720135422 720620804
2356.9G20620804J00021Q9722q37097l62625N55038q7509J503601L07617m46091M47998
$$ 720620804 720720825 720810547 719973450 719610825 720165863 720078354 721581955 721889572 721443481 721891479
2366.6G21891479p9574m88205K16064R23844O85882P90100k34146p8430M60968k09274
$$ 721891479 721811905 721323700 721539764 722463608 723149490 723939590 723705444 723627014 724087982 723878708
2376.2G23878708q5068L05J2207n9662L23868M94232L57132K15455l12577j9302K35824
$$ 723878708 723793640 723793945 723806152 723746490 724070358 724564590 724921722 725137177 724824600 724805298 725041122
2386.8G25041122o4849l33252l2502J82190j84707q2550o4926n3101L7308L14026J13296
$$ 725041122 724976273 724643021 724610519 724792709 724608002 724525452 724460526 724407425 724444733 724758759 724872055
2397.4G24872055l60718l4790k70538k39868K1667K899L94822K23465k12021r7199
$$ 724872055 724511337 724476547 724206009 723966141 723987808 723990707 724385529 724608994 724396973 724299774
2407.1G24299774L7537k71912k56882j35421j54953M8599R7198J0605l8833L4027k64969
$$ 724299774 724337311 724065399 723808517 723673096 723518143 723566742 723663940 723674545 723635712 723669739 723404770
2417.7G23404770m65012o6833K14386O8664j93481k89536o3705J84326l01514k27737
$$ 723404770 722939758 722872925 723087311 723155975 722962494 722672958 722609253 722793579 722492065 722264328
2427.3G22264328M8141j46026O5842j63422k44827j31760o0883P7744K73514L47595
$$ 722264328 722312469 722166443 722232285 722068863 721824036 721692276 721631393 721709137 721982651 722330246
2437G22330246l60947n53817l59269j0681J25809k98462k00043N2414r8953m23355
$$ 722330246 721969299 721415482 721056213 721045532 721171341 720872879 720672836 720725250 720626297 720202942
2446.6G20202942M8599K24915j63117n6762o0196k74506m03748P5226L11966L29056
$$ 720202942 720251541 720476456 720313339 720256577 720196381 719921875 719518127 719593353 719905319 720234375
2456.3G20234375K441n29022l90854l17840J91421J48239k32238l63160m92782K1210
$$ 720234375 720236816 719707794 719316940 718999100 719190521 719338760 719106522 718743362 718250580 718271790
2465.9G18271790J11084k0447k18201o8054K18582M0207l10745l39661Q5373m14810
$$ 718271790 718382874 718362427 718144226 718076172 718294754 718334961 718024216 717684555 717769928 717355118
2475.6G17355118k95716l6087k61840K3422k17285k45285j92108J30844P2860l04489
$$ 717355118 717059402 717023315 716761475 716784897 716567612 716322327 716130219 716261063 716333923 716029434
2485.2G16029434k51541l43246J52587p400j75858j1901k76719k7618j0910m03061
$$ 716029434 715777893 715434647 715587234 715579834 715403976 715392075 715115356 715087738 715076828 714673767
2494.8G14673767l57742J52511j06430k54135L01895K43378j97830l11356M5090J28250
$$ 714673767 714316025 714468536 714362106 714107971 714409866 714653244 714455414 714144058 714189148 714317398
2504.5G14317398n493o00586n97458R7427j84936p3471K75726P9041k37122k18811
$$ 714317398 714311905 713711319 713113861 713211288 713026352 712952881 713228607 713307648 713070526 712851715
2514.1G12851715j74866m91104l40957q7510P2632L9215Q545J30463J8082k57569l19595
$$ 712851715 712676849 712185745 711844788 711757278 711829910 711869125 711877670 712008133 712026215 711768646 711449051
2524.7G11449051k50778j85547K08969j15967j80130n6152k23084K25754j20773j77613
$$ 711449051 711198273 711012726 711221695 711105728 710925598 710869446 710646362 710872116 710751343 710573730
2534.4G10573730p019j71127k21329n0277J80969n76019k18964L64227n645l70636
$$ 710573730 710566711 710395584 710174255 710123978 710304947 709728928 709509964 709874191 709868546 709497910
2544G09497910n12619K1591j1139p5226p1640k0981R7656q2473k55814l72772m8218
$$ 709497910 708985291 709006882 708995743 708920517 708848877 708827896 708925552 708843079 708587265 708214493 708166275
2554.6G08166275k99149j26113P6k16751J03836k55814j01318R6741J47705J9531l55835
$$ 708166275 707867126 707741013 707741089 707524338 707628174 707372360 707271042 707367783 707515488 707535019 707179184
2565.2G07179184r4757j12991O6299L8757k42004n06058l95126J69067r765j86768
$$ 707179184 707084427 706971436 707037735 707076492 706834488 706328430 705933304 706102371 706092606 705905838
2574.9G05905838l03497k76490Q6060J49078k93960l10059Q1482j23215L0518P1640
$$ 705905838 705602341 705325851 705411911 705560989 705267029 704956970 705038452 704915237 704945755 705017395
2584.5G05017395k55661k74048j06811j97068k58865R7046k58331m80957k50473o409
$$ 705017395 704761734 704487686 704380875 704183807 703924942 704021988 703763657 703282700 703032227 703025818
2594.2G03025818Q3694j01928k66800l94593j7166m87747m12750L91769N9815l5172
$$ 703025818 703109512 703007584 702740784 702346191 702329025 701841278 701428528 701820297 701880112 701844940
2603.8G01844940m45022m07029m425m54330l45993N8975k25983n34820j20621J67465
$$ 701844940 701399918 700992889 700988464 700534134 700188141 700247116 700021133 699486313 699365692 699533157
2613.5F99533157Q4381n8517k42386n05142k27280J35041l35618j66778O866j21688
$$ 699533157 699617538 699559021 699316635 698811493 698584213 698719254 698383636 698216858 698223724 698102036
2623.1F98102036j24512j18714j62582p63397n93262j65863P3471r9640l67660j21308
$$ 698102036 697977524 697858810 697696228 696932831 696339569 696173706 696247177 696147537 695779877 695658569
2632.8F95658569j78070K05994j71967m60434o4392l23944k36206k18887k26975k99072
$$ 695658569 695480499 695686493 695514526 695054092 694989700 694665756 694429550 694210663 693983688 693684616
2642.4F93684616j26038m425j45492o6528n91660m27475o4239l68271l75290j85089
$$ 693684616 693558578 693554153 693408661 693342133 692750473 692322998 692258759 691890488 691515198 691330109
2652F91330109o1341K5330l8529n02853k26669J73874l9215j31379m29840l73382r995
$$ 691330109 691268768 691294098 691255569 690752716 690526047 690699921 690660706 690529327 690099487 689726105 689716110
2662.6F89716110k07977l86658o8054k85416m49447K289j04828j97068J84632R9182
$$ 689716110 689508133 689121475 689053421 688768005 688318558 688320847 688216019 688018951 688203583 688302765
2672.3F88302765m55704k24151k3118l29360k12174q7891q8882n81436m69208K28348
$$ 688302765 687847061 687622910 687599792 687270432 687058258 686970367 686881485 686300049 685830841 686059189
2681.9F86059189O7901l52401l48130j08947l57819k16293j56327m38613n7831P9422
$$ 686059189 686127090 685774689 685426559 685317612 684959793 684743500 684587173 684148560 684090729 684170151
2691.6F84170151j29090l13110N3711j4572o10886m45556j94245k19192j88752P4692
$$ 684170151 684041061 683727951 683781662 683767090 683156204 682710648 682516403 682297211 682108459 682183151
2701.2F82183151l45688l85818N8060j67771K52533J61591n86624n70145m33807l87497
$$ 682183151 681837463 681451645 681509705 681341934 681594467 681756058 681169434 680599289 680165482 679777985
2710.9F79777985o87j11008l54233J03379k75116k11029J96075l93219n25512l97339
$$ 679777985 679777298 679666290 679312057 679415436 679140320 678929291 679125366 678732147 678206635 677809296
2720.5F77809296k54975n40466o11649N3559L68347J03073l72620k41470j88599k24456
$$ 677809296 677554321 677013855 676402206 676455765 676824112 676927185 676554565 676313095 676124496 675900040
2730.2F75900040k28272n81970l59497o6376k73514j08337K58408o2256j66855j13068
$$ 675900040 675671768 675089798 674730301 674663925 674390411 674282074 674540482 674478226 674311371 674198303
2739.8F74198303n59234m23355r7046l14103k19268K51464j06811o38351k78931Q1558
$$ 674198303 673639069 673215714 673118668 672804565 672585297 672836761 672729950 672091599 671812668 671894226
2749.4F71894226l77960p08542O9733L02887j76392l33176m82025m08630l78189l42407
$$ 671894226 671516266 670807724 670877457 671180344 671003952 670670776 670188751 669780121 669401932 669059525
2759.1F69059525J5335j4267l02048n9967j33286n01098m52194k44980q4229l70941
$$ 669059525 669074860 669060593 668758545 668698578 668565292 668064194 667612000 667367020 667282791 666911850
2768.7F66911850l57742l18680o485K70996k41165Q3771l56522j070175p47223m47922
$$ 666911850 666554108 666235428 666228943 666499939 666258774 666342545 665986023 664915848 664168625 663720703
2778.4F63720703l128l68423o24848k94494j08414j79901k52075j68229l50494k6321
$$ 663720703 663717575 663349152 662724304 662429810 662321396 662141495 661889420 661721191 661370697 661344376
2788F61344376j72959p84683p30972l17688j72272l20740N8899j09558n08423m29230
$$ 661344376 661171417 660386734 659655762 659338074 659165802 658845062 658903961 658794403 658285980 657856750
2797.7F57856750m50286n68772o24923n36347p06711m46014l15933l56903p1946l0288
$$ 657856750 657406464 656837692 656212769 655676422 654969711 654523697 654207764 653850861 653778915 653748627
2807.3F53748627j19553q34885j241684p23800K35824J74103q50525o60629l05023
$$ 653748627 653629074 652794189 651552505 650828705 651064529 651238632 650388107 649727478 649422455
2816F49422455k70767m35486o71540n49545o70395n06897j25045q9112n22613o94046
$$ 649422455 649151688 648716202 648044662 647495117 646824722 646317825 646192780 646103668 645581055 644887009
2825.6F44887009n00260o08139o12564n43518m69131o92597j015320o61964n16357
$$ 644887009 644386749 643778610 643166046 642622528 642153397 641460800 640445480 639783516 639267159
2834.3F39267159r10454p99485o69899q28475p64962q00171q36258j301612j728707
$$ 639267159 638356705 637557220 636887321 636058846 635293884 634493713 633657455 632355843 630627136
2843F30627136j209869j093636j880188j778259j206665j877289j829834r78889o53801
$$ 630627136 629417267 628323631 626443443 624665184 623458519 621581230 619751396 618772507 618118706
2851.7F18118706m73366n30930k59666j77116j79139j05133M4899L02315j86653n18074
$$ 618118706 617645340 617114410 616854744 616677628 616498489 616393356 616438255 616740570 616553917 616035843
2861.3F16035843m62914J62125j66550j467857p08084j78185j166267j109200j61705
$$ 616035843 615572929 615735054 615568504 614100647 613392563 613214378 612048111 610938911 610777206
2870F10777206k8839o80694j004525n63125l78990n71823k98195o00243n76553l21083
$$ 610777206 610748367 610067673 609063148 608500023 608121033 607549210 607251015 606650772 606074219 605753136
2879.6F05753136o59676l66859l39432m00009m01421m27780k77367n55801p62863p70188
$$ 605753136 605093460 604726601 604387169 603987160 603585739 603157959 602880592 602324791 601561928 600791740
2889.3F00791740p49244j005211q61778k71035M0436m16221j092759q59337q92143
$$ 600791740 600042496 599037285 598175507 597904472 597944908 597528687 596435928 595576591 594684448
2897.9E94684448p91740o37245m01879j07078m94538j86157m44488n30510j23101l01017
$$ 594684448 593892708 593255463 592853584 592746506 592251968 592065811 591621323 591090813 590967712 590666695
2907.6E90666695m01154q37250m50134n44929q30918p29179j379852j028138q38585
$$ 590666695 590265541 589428291 588978157 588433228 587602310 586873131 585493279 584465141 583626556
2916.3E83626556j124229j024017q61473q98858q33664O7559r5177n79033k43912l36647
$$ 583626556 582502327 581478310 580616837 579717979 578884315 578951874 578856697 578277664 578033752 577697105
2925.9E77697105j44386M58908L95966j05400l53241k46201L96614N95665K41318L86581
$$ 577697105 577552719 578011627 578407593 578302193 577948952 577702751 578099365 578695030 578936348 579322929
2935.6E79322929N97039M30221J51024J58844L62969M89387K31972J84364L27149Q2283
$$ 579322929 579919968 580350189 580501213 580660057 581023026 581512413 581744385 581928749 582255898 582338181
2945.2E82338181J61094L8300K6741L82805j2398k02904n9776m54521m86908l30315
$$ 582338181 582499275 582537575 582564316 582947121 582934723 582731819 582672043 582217522 581730614 581400299
2954.8E81400299m52461l2730K29454j35002o31524n72128j3199L73688Q63037N62706
$$ 581400299 580947838 580915108 581144562 581009560 580378036 579805908 579792709 580166397 581029434 581592140
2964.5E81592140q125J23558M86450O17981K83699N07622P14149P23648O21224M16260
$$ 581592140 581584015 581707573 582194023 582812004 583095703 583603325 584317474 585041122 585662346 586078606
2974.1E86078606N49965N51109R66720P77932N30471N39971J6098K71149O05926Q92372
$$ 586078606 586628571 587179680 588146400 588924332 589454803 589994774 590010872 590282021 590887947 591780319
2983.8E91780319P64504M79622N71250M36173O83670N77431L25851L09982M91181O25152
$$ 591780319 592544823 593024445 593595695 594031868 594715538 595292969 595618820 595928802 596419983 597045135
2993.4E97045135L04604J43089j21040K6321O2333k89383j45836l2196J60255L65067
$$ 597045135 597349739 597492828 597371788 597398109 597460442 597171059 597025223 596993027 597153282 597518349
3003.1E97518349J23901l62434l26424J24588r384l36800J12953O20614J97372p22275
$$ 597518349 597642250 597279816 596953392 597077980 597068596 596731796 596844749 597465363 597662735 596940460
3012.7E96940460j165008j44196M33998m66690n47600l39393m49181j17187l24860
$$ 596940460 595775452 595631256 596065254 595598564 595050964 594711571 594262390 594145203 593820343
3021.4E93820343n31960k34031n06363n80292l14903o3896j02387n55534j9188M9515
$$ 593820343 593288383 593054352 592547989 591967697 591652794 591588898 591486511 590930977 590911789 590961304
3031E90961304o79665l55682j20468m36860l34472k08550r10377p20215j91345m15383
$$ 590961304 590281639 589925957 589805489 589368629 589034157 588825607 587915230 587195015 587003670 586588287
3040.7E86588287k52838m21982n43060o95572n31578j52550l82499l32604p28950q06122
$$ 586588287 586335449 585913467 585370407 584674835 584143257 583990707 583608208 583275604 582546654 581740532
3050.3E81740532l53165j40724k82364q55026n53093N4283l22113j057053q08906l27263
$$ 581740532 581387367 581246643 580964279 580109253 579556160 579610443 579288330 578231277 577422371 577095108
3060E77095108j57165k42615m17290n4092m17900j86577R8114q32672p10411n90172
$$ 577095108 576937943 576695328 576278038 576223946 575806046 575619469 575717583 574884911 574174500 573584328
3069.6E73584328r60350m98467L36723l40270j028061l4256R8571n84106m23546o676
$$ 573584328 572623978 572125511 572462234 572121964 571093903 571059647 571158218 570574112 570150566 570143890
3079.2E70143890o26220p68357k46467k46315l06626p02896l91693l15971n32303m86336
$$ 570143890 569517670 568749313 568502846 568256531 567949905 567247009 566855316 566539345 566007042 565520706
3088.9E65520706p68509n11436n64423j93977j15242m32549m24804p41310J6937J07345
$$ 565520706 564752197 564240761 563676338 563482361 563367119 562934570 562509766 561768456 561785393 561892738
3098.5E61892738j18141l28178j103440p70340o57653m48380k47154n64461n10559
$$ 561892738 561774597 561446419 560342979 559572639 558914986 558466606 558219452 557654991 557144432
3107.2E57144432n12237p7744R8572q55370j156120n31616n74913m63486L776l38134
$$ 557144432 556632195 556554451 556653023 555797653 554641533 554109917 553535004 553071518 553075294 552737160
3116.9E52737160o33240p08694q07724m75693m40407p18269l57285m39262q36869p95860
$$ 552737160 552103920 551395226 550587502 550111809 549671402 548953133 548595848 548156586 547319717 546523857
3126.5E46523857n85480j32484p10754j162568l17878q354l87154o03333q49609r62906
$$ 546523857 545938377 545805893 545095139 543932571 543614693 543606339 543219185 542615852 541766243 540803337
3136.1E40803337m85878o35757n79796l16353p16133l44353o04477j085586p04346
$$ 540803337 540317459 539681702 539101906 538785553 538069420 537725067 537120590 536035004 535330658
3144.8E35330658m59747m57497o34537n90591o26297m44298p07664q53501m16565o85386
$$ 535330658 534870911 534413414 533778877 533188286 532561989 532117691 531410027 530556526 530139961 529454575
3154.5E29454575n47944p98378j047706o02722o20575m45900o67839p52259n17005
$$ 529454575 528906631 528108253 527060547 526457825 525837250 525391350 524723511 523971252 523454247
3163.1E23454247r47686n86624o790p00569r90792o07452p80411r41848p38488m74128
$$ 523454247 522506561 521919937 521913147 521212578 520221786 519614334 518833923 517892075 517153587 516679459
3172.8E16679459l37792k46124p76711j148605m71840n89142j094742q84895n01747
$$ 516679459 516341667 516095543 515318832 514170227 513698387 513109245 512014503 511129608 510627861
3181.5E10627861m09660n22690m91867m72298l88641p86591q95347p20749r18656m80613
$$ 510627861 510218201 509695511 509203644 508731346 508342705 507556114 506660767 505940018 505021362 504540749
3191.1E04540749j65558p05796j175384p23801l83148k00462l33786j292649r09309
$$ 504540749 504375191 503669395 502494011 501770210 501387062 501186600 500852814 499560165 498650856
3199.8D98650856o38275q52738k23693j05706k71263l80440p32612j155014o56967
$$ 498650856 498012581 497159843 496936150 496830444 496559181 496178741 495446129 494291115 493634148
3208.5D93634148l72544j318626j198616l46832j1788l64609p97920m72030l45726
$$ 493634148 493261604 491942978 490744362 490397530 490385742 490021133 489223213 488751183 488405457
3217.2D88405457n58892m97856n82161q59222r30329p67059p32269q30155j78680j11580
$$ 488405457 487846565 487348709 486766548 485907326 484976997 484209938 483477669 482647514 482468834 482357254
3226.8D82357254p35283l71017m32740o46171l68462j92795m82711j105767o17027
$$ 482357254 481621971 481250954 480818214 480172043 479803581 479610786 479128075 478022308 477405281
3235.5D77405281k68097r45129r69277k75345m27703o78902j77574k53449j88598l84865
$$ 477405281 477137184 476192055 475222778 474947433 474519730 473840828 473663254 473409805 473221207 472836342
3245.1D72836342q65975p56950r13010o60057l00712m42963o94809l73955L5668k60620
$$ 472836342 471970367 471213417 470300407 469640350 469339638 468896675 468201866 467827911 467863579 467602959
3254.8D67602959n46875p34673p32956o95724k33689k63710r52873k99225j48849l70751
$$ 467602959 467056084 466321411 465588455 464892731 464659042 464395332 463442459 463143234 462994385 462623634
3264.4D62623634j48201p76138p20711k54478l74642l04946j36719k88964r24453r85031
$$ 462623634 462475433 461699295 460978584 460724106 460349464 460044518 459907799 459618835 458694382 457709351
3274D57709351r3995m2495q61168r27925k20795j20468m22974l62777m57612m99801
$$ 457709351 457615356 457572861 456711693 455783768 455562973 455442505 455019531 454656754 454199142 453699341
3283.7D53699341n06096m80576m16107l89099j24245J5641J81999m59633j005974l56979
$$ 453699341 453193245 452712669 452296562 451907463 451783218 451798859 451980858 451521225 450515251 450158272
3293.3D50158272l20473m17366l29666m38919n98450o55823n20897o26640m69017j5106
$$ 450158272 449837799 449420433 449090767 448651848 448053398 447397575 446876678 446250038 445781021 445765915
3303D45765915R9983n81703r25064l16391q9378m36326p37686o44226o18286m25911
$$ 445765915 445865898 445284195 444359131 444042740 443953362 443517036 442779350 442135124 441516838 441090927
3312.6D41090927l91388o54259o91223p32765k20528l01742n77850l38097p05757q64029
$$ 441090927 440699539 440045280 439354057 438621292 438400764 438099022 437521172 437183075 436477318 435613289
3322.3D35613289p79495n61829m05769l45459m82331q04977m11911m28619n23377l18298
$$ 435613289 434833794 434271965 433866196 433520737 433038406 432233429 431821518 431392899 430869522 430551224
3331.9D30551224q10700j042518p01256l34969m03862q52203o35452k75307l96156
$$ 430551224 429740524 428698006 427996750 427661781 427257919 426405716 425770264 425494957 425098801
3340.6D25098801m59214o73751q29010j090241r10797k86484p44514p28913k42691
$$ 425098801 424639587 423965836 423136826 422046585 421135788 420849304 420104790 419375877 419133186
3349.3D19133186l11432l71055q83942j260452o44493r2964p43332q40111m49982l34968
$$ 419133186 418821754 418450699 417566757 416306305 415661812 415568848 414825516 413985405 413535423 413200455
3358.9D13200455k01531o01883p79113j306153n32303L71666p78618r47265o81572
$$ 413200455 412998924 412397041 411617928 410311775 409779472 410151138 409372520 408425255 407743683
3367.6D07743683k48528k82898j170806j216698r22775m10538l28636l70789l37143
$$ 407743683 407495155 407212257 406041451 404824753 403901978 403491440 403162804 402792015 402454872
3376.3D02454872p74956p27424n4207m19388j041565n46341m53758l6049l22037r40056
$$ 402454872 401679916 400952492 400898285 400478897 399437332 398890991 398437233 398401184 398079147 397139091
3385.9C97139091k59819n88188n81703J96495M48036M425p61833j107330r48830l81698
$$ 397139091 396879272 396291084 395709381 395905876 396353912 396358337 395596504 394489174 393540344 393158646
3395.6C93158646j19934r6322l87382r3422J53694m38766n89485o02761j51710k59095
$$ 393158646 393038712 392942390 392555008 392461586 392615280 392176514 391587029 390984268 390832558 390573463
3405.2C90573463o75048n59884n2337M56390j35650l07923k91366k97394k44446k21481
$$ 390573463 389898415 389338531 389286194 389742584 389606934 389299011 389007645 388710251 388465805 388244324
3414.8C88244324j83869k04811J38512m77257j74026K42691k64244r8954l31230r2888
$$ 388244324 388060455 387855644 387994156 387516899 387342873 387585564 387321320 387222366 386891136 386798248
3424.5C86798248P8392L67089p9728o50978J10588K03705K64550j37368j36413L03955
$$ 386798248 386876640 387243729 387164001 386513023 386623611 386827316 387091866 386954498 386818085 387122040
3434.1C87122040R6702O7253k5672L67202K86332m13552k38075L51944J12839K96325
$$ 387122040 387218742 387285995 387260323 387627525 387913857 387500305 387262230 387614174 387727013 388023338
3443.8C88023338K80381j15929Q20503K29111k16179L68729N51986R13735K49901J99394
$$ 388023338 388303719 388187790 389008293 389237404 389021225 389389954 389941940 390855675 391105576 391304970
3453.4C91304970M39682M9896l81737K64855J051101M98085L78495L07655J95656J38893
$$ 391304970 391744652 391794548 391412811 391677666 392728767 393226852 393605347 393913002 394108658 394247551
3463.1C94247551J108131J137467n2490J81503m26331J98288J130791N77316M77677
$$ 394247551 395355682 396493149 396440659 396622162 396195831 396394119 397524910 398102226 398579903
3471.7C98579903L15628P15522P10450K56157K26631O92940O20842L60527O33125O20346
$$ 398579903 398895531 399611053 400321503 400577660 400804291 401497231 402118073 402478600 403111725 403732071
3481.4D03732071Q13293j31645L67584P50618L9101J374626J329460M45824K83470
$$ 403732071 404545364 404413719 404781303 405531921 405571022 406945648 408275108 408720932 409004402
3490.1D09004402J90354N36422O84929P56264N69382N23033L59611P54700Q25539J58653
$$ 409004402 409194756 409731178 410416107 411172371 411741753 412264786 412624397 413379097 414204636 414363289
3499.7D14363289M11644J058273R62563K56729K47536L29971L96843N68428J360779
$$ 414363289 414774933 415833206 416795769 417052498 417300034 417630005 418026848 418595276 419956055
3508.4D19956055J132202l69606O95152J276398Q51593K12173L30620J089554Q60825
$$ 419956055 421088257 420718651 421413803 422690201 423541794 423753967 424084587 425174141 426034966
3517.1D26034966J011009N87845R6931R2011R62219J627159O98852M51088L61748J292648
$$ 426034966 427045975 427633820 427730751 427822762 428784981 430412140 431110992 431562080 431923828 433216476
3526.7D33216476J030579r499K38953P59888J203003O07872P87048P82967J388168
$$ 433216476 434247055 434237556 434476509 435236397 436439400 437047272 437834320 438617287 440005455
3535.4D40005455J069260J85280J255416Q75779Q31642M22058J006660J357498R26857
$$ 440005455 441074715 441259995 442515411 443391190 444222832 444644890 445651550 447009048 447935905
3544.1D47935905J343499J49116J209030k1820L71361J481056J000061J911621l84750
$$ 447935905 449279404 449428520 450637550 450615730 450987091 452468147 453468208 455379829 454995079
3552.7D54995079P37343J296272R22089J860809L48930J246644J478462R30290M92592
$$ 454995079 455732422 457028694 457950783 459811592 460160522 461407166 462885628 463815918 464308510
3561.4D64308510R70955P02629M43878M084473J536483p82013k66113p69081L227692
$$ 464308510 465279465 465982094 466425972 470510445 472046928 471264915 470998802 470229721 473457413
3570.1D73457413J632690Q00438J919212J875496M95873M36172K119332P12852J600990
$$ 473457413 475090103 475890541 477809753 479685249 480181122 480617294 482736626 483449478 485050468
3578.8D85050468J618538k2545R62449K059860J812134m921K918396L569374r5291
$$ 485050468 486669006 486646461 487608910 489668770 491480904 491475983 494394379 497963753 497868462
3587.5D97868462J493034r34677J080780J777229K066117K196960Q42323L101883k88200
$$ 497868462 499361496 498426819 499507599 501284828 503350945 505547905 506390228 509492111 509203911
3596.1E09203911N15518K923546J40838J486550J348190J422692K233924J108361J304359
$$ 509203911 509719429 512642975 512783813 514270363 515618553 517041245 519275169 520383530 521687889
3604.8E21687889K477951K874947m82636K399941J079674j059571O309204L785782
$$ 521687889 524165840 527040787 526558151 528958092 530037766 528978195 535287399 539073181
3612.5E39073181k021293K858848p66640J970711M132576P14684J899795r8381n1651
$$ 539073181 537051888 539910736 539144096 541114807 545247383 545962067 547861862 547763481 547711830
3621.2E47711830K883263K267494J650200K529526K257576K147293O302566L947487
$$ 547711830 550595093 552862587 554512787 557042313 559299889 561447182 567749748 571697235
3628.9E71697235r076652J637878L216324N379143L805351j397438J465645K930870
$$ 571697235 562620583 564258461 567474785 572853928 576659279 575261841 576727486 579658356
3636.6E79658356K435074J215210J309585J659927K262536K256088R43947K209549
$$ 579658356 582093430 583308640 584618225 586278152 588540688 590796776 591740723 593950272
3644.4E93950272L262939M890556J59569j510429P009887J313973j856308k626457
$$ 593950272 597213211 602103767 602263336 600752907 607762794 609076767 607220459 604594002
3652.1F04594002L145294L788338L409996P427482m824333j594696M280357J466103
$$ 604594002 607739296 611527634 614937630 622365112 617540779 615946083 620226440 621692543
3659.8F21692543J188660N76286K254181J629600P46537J044235K12021L076286L057938
$$ 621692543 622881203 623457489 625711670 627341270 628087807 629132042 629344063 632420349 635478287
3668.5F35478287J389160J712608n538826J1750O427078J0022354O731720j5868454
$$ 635478287 636867447 638580055 633041229 633052979 639480057 649502411 656234131 640365677
3676.2F40365677j986466M795380M003449j508790n08346K296677J561813J068497
$$ 640365677 638379211 643174591 647178040 645669250 645160904 647457581 649019394 650087891
3683.9F50087891J88217q6441L024368O355438m009399m407349O686249m242935k297821
$$ 650087891 650276108 650189667 653214035 659569473 655560074 651152725 657838974 653596039 651298218
3692.6F51298218L847809P10220J203461J75705q31910P03431J75933J450730K845535
$$ 651298218 655146027 655856247 657059708 657235413 656403503 657106934 657282867 658733597 661579132
3701.3F61579132k583313k685699L798828K020416l25546K45056K088547L866577n702515
$$ 661579132 658995819 656310120 660108948 662129364 661803818 662048874 664137421 668003998 662301483
3709.9F62301483K888794P005844j0089569K575684L562545k42767n59921J569137
$$ 662301483 665190277 672196121 662106552 664682236 668244781 668002014 667442093 669011230
3717.7F69011230K112504l164292M883N947494j212387o171722L203583J834488N61676
$$ 669011230 671123734 667959442 667964325 673911819 672699432 666527710 669731293 671565781 672127457
3726.3F72127457j630631j593551J928329O69937N215073q57544q279267O773911L115463
$$ 672127457 670496826 668903275 670831604 671501541 676716614 675859070 667579803 674353714 677469177
3735F77469177p140503j64871K891007m7379J161652K810516m095764Q51059J0175781
$$ 677469177 670328674 670163803 673054810 673007431 674169083 676979599 672883835 673734894 683910675
3743.7F83910675k557526j7820129O229630M360275M426727j650848r147339R982071
$$ 683910675 681353149 663533020 669762650 674122925 678549652 676898804 667751465 677733536
3751.4F77733536j679459o886291M211120L664627L284760n258789R78622P176666
$$ 677733536 676054077 669167786 673378906 677043533 680328293 675069504 676048126 683224792
3759.1F83224792n677413l871155K802810Q49534O0348L293152j665802n271912J751328
$$ 683224792 677547379 673676224 676479034 677328568 677388916 680682068 679016266 673744354 675495682
3767.8F75495682N133743L118362p505111n44434K138214K19651M48761r37653k5253
$$ 675495682 680629425 683747787 676242676 675698242 677836456 678056107 678504868 677567215 677541962
3776.5F77541962N88836L176194J839065p052917N51681J602860L16620K385406j806793
$$ 677541962 678130798 681306992 683146057 676093140 676644821 678247681 678564301 680949707 679142914
3785.2F79142914o09284J596985J48010M42429r56879n42450j7623K2888l39432L26843
$$ 679142914 678533630 680130615 680278625 680721054 679764175 679221725 679204102 679226990 678887558 679214401
3794.8F79214401L508682j621856m375687N11475K587051O322174j784363q547134
$$ 679214401 682723083 681101227 676725540 677237015 679824066 686146240 684361877 675814743
3802.5F75814743J483688Q12226K859497N151062n545197m920730L360061J677475
$$ 675814743 677298431 678110657 680970154 686121216 680576019 675655289 679015350 680692825
3810.2F80692825m10232P1258j06811J77383M646988K066116j2639541K655258M577026
$$ 680692825 680282593 680353851 680247040 680424423 685071411 687137527 674497986 677153244 681730270
3818.9F81730270L629685M145126j3455276l75672L583527J200867K121963O00968
$$ 681730270 685359955 689505081 676049805 675674133 679257660 680458527 682580490 683181458
3826.6F83181458l759232n42069J011048J949234K188110p261123J221542O598587
$$ 683181458 679422226 678880157 679891205 681840439 684028549 676767426 677988968 684587555
3834.3F84587555n297318j455917Q358307l442841o097641O119538k995682k140579
$$ 684587555 679290237 677834320 686192627 682749786 676652145 682771683 679776001 677635422
3842.1F77635422M905853r72519l443069J820526J365738m64936P10373j965866j37405
$$ 677635422 682541275 681568756 678125687 679946213 681311951 680847015 681557388 679591522 679454117
3850.7F79454117N351639l656311M528961q754578m278030Q128662K61688l054199
$$ 679454117 684805756 681149445 685678406 676923828 672645798 680774460 681036148 677981949
3858.4F77981949K28348J935653L204041m100952j222077N777512k532883n734558
$$ 677981949 678210297 680145950 683349991 679249039 678026962 683804474 681271591 675537033
3866.2F75537033J865082L854523O612930k363205j0038376L19672M700546O425247
$$ 675537033 677402115 681256638 687869568 685506363 675467987 675787659 680488205 686913452
3873.9F86913452p607956k092743K829361p44552J003112L973542k225952p091294
$$ 686913452 679305496 677212753 680042114 679297562 680300674 684274216 682048264 674956970
3881.6F74956970L915024J559906M63028O131592q474198j949768J956864k90299M017029
$$ 674956970 678871994 680431900 680894928 687026520 678552322 676602554 678559418 678269119 682286148
3890.3F82286148J723023p032166N65948L238602j937561o56814K96554J876679K923736
$$ 682286148 684009171 676977005 677542953 680781555 678843994 678187180 678483734 680360413 683284149
3898.9F83284149q065491L360138L005448n639649M954148N48553k359390q50144o67800
$$ 683284149 675218658 678578796 681584244 675944595 680898743 681447296 679087906 678237762 677569962
3907.6F77569962J383132J39847M82178O7749n44510J19400m68902K05307K268982
$$ 677569962 678953094 679092941 679575119 679642868 679098358 679217758 678748856 678954163 681223145
3916.3F81223145j317444l961945K635651J287994k927017Q39081J181411J217804
$$ 681223145 679905701 675943756 678579407 679867401 676940384 677779465 678960876 680178680
3924F80178680j088256k916489L94363O90995J222229L97415O20117K551575k630158
$$ 680178680 679090424 676173935 676568298 677259293 678481522 678878937 679499054 682050629 679420471
3932.7F79420471l027496P35245n0126K09961O30112r2392j42288j53046J713639J707992
$$ 679420471 676392975 677128220 677078094 677288055 677918167 677825775 677683487 677530441 679244080 680952072
3942.3F80952072l745346j233368Q04062k72064Q74176p42569J112594P64390k321930
$$ 680952072 677206726 675973358 676777420 676505356 677379532 676636963 677749557 678513947 676192017
3951F76192017J081390N14374m03290O82983K52533j5411p73850l65524n02777L81851
$$ 676192017 677273407 677787781 677384491 678067474 678320007 678304596 677530746 677165222 676662445 677044296
3960.7F77044296J187439o24466m52423J08414j14594k8915j91574R4604J13297n9967
$$ 677044296 678231735 677607269 677154846 677263260 677148666 677119751 676928177 677022781 677136078 677076111
3970.3F77076111N14755J6403o99463l99093J88980N12924k78549K08588P54776o1036
$$ 677076111 677590866 677607269 676907806 676508713 676697693 677210617 676932068 677140656 677895432 677834396
3980F77834396o58950l10898K41165n72281k33307K54822K53372K87247k5330M08325
$$ 677834396 677175446 676864548 677105713 676533432 676300125 676554947 676808319 677095566 677070236 677478561
3989.6F77478561p69882o01578M28620N27496J132584n14603o78406L72391j75629
$$ 677478561 676708679 676107101 676535721 677063217 678195801 677681198 677002792 677375183 677199554
3998.3F77199554O4621K00196
$$ 677199554 677264175 677464371
4000.2F77464371
$$ 677464371
##END=$$ End of the data block
