##TITLE=$$ Begin of the data block
##JCAMP-DX=5.00 $$ ACD/SpecManager v 10.08
##SPECTROMETER/DATA SYSTEM=Varian
##DATE=18 Dec 2012 14:24:16
##DATA TYPE=INFRARED SPECTRUM
##DATA CLASS=XYDATA
##ORIGIN=
##OWNER=
##NPOINTS=3735
##FIRSTX=399.26403809
##LASTX=4000.35498047
##MAXX=4000.35498047
##MINX=399.26403809
##MAXY=74.04701233
##MINY=16.29425621
##XFACTOR=1.0000000000
##YFACTOR=0.000000100000000
##FIRSTY=59.31301880
##DELTAX=0.96440572
##XUNITS=1/CM
##YUNITS=TRANSMITTANCE
##XYDATA=(X++(Y..Y))
399.3 593130188 596002388 592957916 596891174 598876572 597817307 591055298 587373657 583612404
407 583612404 580965958 581368675 580541725 582494812 582387810 587289124 593292885 592259026 587611427
415.7 587611427 578990059 576253128 576495819 576706238 579471092 585003815 590236130 584425278 589036789
424.3 589036789 590420456 583393478 586172485 586163597 586686249 589308319 588137321 584813766 581706314
433 581706314 579726486 577716026 576418304 578177681 583525543 584594231 582170258 583388290 584081039
441.7 584081039 580765038 578825111 580236053 580279770 579806366 581821518 584010353 583337440 579305763
450.4 579305763 578552437 578794823 577797890 580174370 579763298 576068993 575126190 573651505 571964455
459.1 571964455 573045044 571503906 570532417 572399445 569581871 566659737 567834816 572029343 575693626
467.7 575693626 570793266 565810585 568239822 571799202 566232300 561569633 565187187 566366730
475.5 566366730 565902710 568237648 570787468 570061150 566168861 564558182 567914047 570934715 569884682
484.1 569884682 567627754 568193436 570335846 568797188 568350067 569722214 565458145 563435707 565787811
492.8 565787811 566128387 571135750 575597115 572672615 569969254 569241028 570608063 572536812 572205696
501.5 572205696 571745605 568940277 566645279 567370377 568649597 567229156 564728775 566450195 565601959
510.2 565601959 560940514 559919395 560470047 561128845 559907379 559680862 561639137 559380455 556126900
518.9 556126900 553576813 551807289 550572701 551383667 553589096 554073296 553481369 552320099 552443352
527.5 552443352 552024574 551922607 552679901 552860107 552708931 551667099 552917900 554945946 555139694
536.2 555139694 554407310 552541084 550868912 550545807 551442070 552252502 554080772 555974388 555451851
544.9 555451851 554264259 554388084 555132217 554981689 554762077 555115433 555469589 556338692 557855339
553.6 557855339 558060646 557362328 556299019 554607925 555018959 555040207 554874573 555055504 553803711
562.3 553803711 554769402 554810715 554821014 557450218 558717613 557422218 555989952 556572723 556050911
570.9 556050911 555358086 555321388 554491768 554358940 554167862 553950653 553039169 552478638 551501389 551214790
580.6 551214790 552778358 552245140 551522369 550092239 550474815 552038879 551563873 552732964 553121414
589.3 553121414 552801056 553136368 552912903 553221817 553832817 552964745 550239182 549622040 549876671 549011841
598.9 549011841 547887154 545754318 543162498 541329689 540427437 536524048 530582581 524952736 517948380
607.6 517948380 509851685 501503906 492123795 479077911 465985260 453003616 441977158 435339851
615.3 435339851 431917839 432462311 432225647 430160255 424876900 417137260 407794800 397693176 390014229
624 390014229 386655235 392214851 404051933 420830917 438003464 454250641 467550850 474823685
631.7 474823685 477155113 473944702 468295212 460928307 454218903 447359695 442157707 442072754 445208015
640.4 445208015 456161079 471685143 489317360 505876045 519110451 531129036 541934433
647.1 541934433 549244003 554261627 559645042 563775177 566551704 568795891 569737320 569689827 569787331
655.8 569787331 570806961 572961884 574724312 575638885 576289291 577260704 578723259 578903313 578674736
664.5 578674736 579671631 581629105 583045959 580185890 582089806 583228111 583150291 584039764 584904060
673.2 584904060 584899673 584506416 585114326 586621857 588291168 589491959 589097328 589129219 590384979 589783058
682.8 589783058 588853149 589554977 588649521 587209511 586979904 586514778 585955086 585181885 584820023 584542770
692.4 584542770 583005600 581261749 580222816 579333801 578335686 578437729 580106316 581306534 580717010
701.1 580717010 579521790 578741379 578607407 579208107 579204102 578966217 580560150 583231087 584500122
709.8 584500122 584533310 585337486 586304855 587060471 588355675 589765511 591101875 592128029 593151321
718.5 593151321 594812584 596653442 597596626 597601433 597982101 598428917 598222961 598883514 599248581 598997002
728.1 598997002 599137154 599290237 600083694 599060440 597227135 596659279 595535049 594463615 594599342
736.8 594599342 596227951 596844597 597039413 597989731 597011032 595856552 596249733 597821655 598934288
745.5 598934288 599767189 601506462 603073273 605042496 606662827 608170891 610433922 613370285 615408897
754.2 615408897 616120148 618271713 620212860 622044945 623941002 624638481 625681839 626552391 626547318
762.8 626547318 626667137 627117577 626397896 626307831 627612343 627567978 625921326 624913177 625494576 625222092
772.5 625222092 625178757 626821976 628724174 630189590 631717415 634619751 636699524 637171326 637334366
781.2 637334366 638401260 640155334 641458130 643269424 644730377 645880661 646926422 647343369 647321243
789.9 647321243 647786560 648275223 647952957 648792572 649422379 649631653 650278320 650402527 650441437 650574875
799.5 650574875 650314407 648886871 649082108 650578613 650535812 650819244 651940308 652835312 653766327
808.2 653766327 654490280 653944702 653890762 654514771 654150543 653716583 653340836 652854309 653678894 656237564
817.8 656237564 657159195 656073685 655382614 655129547 654818192 654048080 653550720 653178406 653241577 653144150
827.5 653144150 652484512 651288071 648792801 646707230 643852539 640600281 639152641 637558212 634397583
836.1 634397583 631143951 629194031 626856422 623260422 620134163 618322792 616508827 614060402
843.9 614060402 612609329 611994286 611387520 611249809 611334763 612837029 615349083 616720581 617548866
852.5 617548866 618659248 620706139 623397522 625077782 627026596 630548668 633785820 635843124
860.3 635843124 637528725 639006996 639692459 640787125 642269287 643673553 645354919 645846252 645682983
868.9 645682983 645921555 647280502 648857193 648697433 648066559 648859787 650553741 651813812 652355499
877.6 652355499 651583405 650713730 649292755 647212067 645496445 642800064 641303787 640747910 639389915
886.3 639389915 637868805 636985893 636631737 635729446 635181580 635227852 635617294 635194550 635121002 635941200
895.9 635941200 635536270 635582275 635971069 636722717 637035294 635593109 635086479 635659866 635403671 634489670
905.6 634489670 633846436 631977081 629986649 628320351 625760384 623816376 620962830 617638130 615548973
914.3 615548973 613539848 611872406 610788651 608753662 606083336 603533707 600717278 598377609
922 598377609 595804825 593858223 593200874 592427559 591587524 590192413 588908768 587794685 586703072
930.7 586703072 586787224 587413483 587866745 588563271 590213737 591562347 592929192 595804405 598314095
939.3 598314095 600435448 603058853 606280251 609207344 611282272 613383560 615423126 617771950
947.1 617771950 619578781 621168289 623171654 624867096 625577126 625027237 624327278 624195938 624882355
955.7 624882355 624585762 623576660 623020668 621700172 619402084 616511726 614283104 612318192 609987373
964.4 609987373 607722588 605320511 603055267 601289787 599881325 598125534 597068481 596784821 595508537
973.1 595508537 593992043 592811966 592175407 591277504 589651451 588680420 587515869 586085396 584658737
981.8 584658737 583114395 581891785 580245361 578133392 575550003 572846451 569515305 565646133
989.5 565646133 561856003 557061539 551893730 544017715 530731163 513100967 499270210 500452003
997.2 500452003 513689079 528771210 537691536 541208801 542999153 543902512 544612541 544147415 542911034
1005.9 542911034 542121162 541685638 540460281 538786392 537859917 536818542 535367241 533723106 532569199
1014.6 532569199 531364899 530237122 528523521 525625420 523736496 522065582 520511551 519067001
1022.3 519067001 516963196 514788628 513312416 512534904 511133041 508885880 506295013 504735527
1030 504735527 502854004 500414925 498721581 497482224 496455917 494225235 492699966 491880379 491007729
1038.7 491007729 489837036 488464622 488357582 487787399 487188301 486867714 486714668 486318092 486431885
1047.4 486431885 486920967 486593246 486896820 487114029 488377190 488807602 488046188 488234177 488963394
1056 488963394 489863472 489518356 489293556 488396111 488787804 489471397 487703476 486407051 485813751 486760788
1065.7 486760788 486041145 483915367 482447586 481813240 482157669 480517731 478371506 475879936 474730949
1074.4 474730949 473791962 471945572 470430603 468167038 466946831 465327415 464239883 462058907
1082.1 462058907 459626617 458416557 456490898 455227890 452092590 448590469 444029083 439786224
1089.8 439786224 435208778 427595673 420428276 411904984 403525467 393259811 382643433 372291145
1097.5 372291145 361431541 351946945 339856491 329286880 318384304 308474407 298248920 287653904
1105.2 287653904 278454552 267418900 259586220 250249062 242605495 235175533 228804893 224543667
1112.9 224543667 218704071 216091423 211751175 210977192 210348930 210166969 211468086 211635017 214199753
1121.6 214199753 214431953 217529106 219600582 221419144 222764130 223098965 224758587 223658104 224902267
1130.3 224902267 223917103 222968655 220608521 216758652 214236603 210361347 209041042 205773983 204156494
1139 204156494 201212940 198711891 196909084 192408028 190107594 185272160 182323380 178131657 175091877
1147.6 175091877 172306118 168467121 167687263 164548969 164911995 163381023 162942562 163646049 163649673
1156.3 163649673 165449715 165315990 167864761 168602295 171948757 174895916 177193413 181163483 184235497
1165 184235497 190177784 193709335 199611740 205064850 211397209 218757668 224671021 232626686 238947353
1173.7 238947353 247677727 254965343 263107491 271940842 280132942 289069195 296160660 305214691
1181.4 305214691 312058220 319841442 327709961 334754066 342681427 348897514 355313759 360310516
1189.1 360310516 366694641 371925888 377031746 383124657 388120613 394040527 399141769 405261497
1196.8 405261497 410563126 416685753 423064003 428522568 434782944 439698944 445237312 450234032
1204.5 450234032 455460968 460318375 464564133 469308128 473158035 477075577 480308495 484025040
1212.3 484025040 487270775 490299454 493446274 495858612 498685379 500540504 502129364 503517723
1220 503517723 505209770 506868896 508214645 509453888 509811440 510751991 511156311 511987343 512815552
1228.6 512815552 513059044 513840828 514337769 515437889 516342888 517625656 518580627 519200363 520170631
1237.3 520170631 520565681 521178207 521575851 522591972 523349724 524068489 524902458 525128593 525893669
1246 525893669 526224937 526332207 526186943 526823273 527446442 527809143 528970833 529296608 529939842 530419807
1255.7 530419807 530788574 531121101 531538086 532457314 532538910 532837296 533233948 534281425 535175209 535855675
1265.3 535855675 536954689 537574577 538581734 539126968 540003395 541556625 543175812 544386444 545403099
1274 545403099 546966629 548170700 549646111 550989990 552290268 553735085 555111732 556608505 558027115
1282.7 558027115 559619713 560851097 562529831 564126816 565503922 567238617 568721085 570178528
1290.4 570178528 571446114 573034363 574560318 576167717 577857246 578978310 580100060 581395111
1298.1 581395111 582879410 583990059 584856071 585808144 587046623 588224144 588610764 589035950 589622154
1306.8 589622154 590513191 591722374 592632751 593605423 594275131 594404640 594462395 594714355 595479088 596089478
1316.4 596089478 596594048 597570267 598124847 598610802 599361839 599883499 600553360 601234474 601584816 601966896
1326 601966896 602843933 603638077 604007568 604543381 605246658 605424156 605098801 604898262 604913635 605030212
1335.7 605030212 604781723 604786415 604995956 604309921 604153137 604836998 605282021 605257721 604984856 605027275
1345.3 605027275 605124664 604848976 604649239 604515991 604061661 604018745 603774834 603061409 602821236 602741661
1355 602741661 602281342 602000122 602195778 601950760 601605721 601356506 601059532 600685577 599183464 599020462
1364.6 599020462 599088364 598350182 598143997 597649002 596544456 595796967 595146523 594886169 594555779 593424644
1374.3 593424644 592240372 591838226 591803322 591173706 590715637 590514679 589865265 589269295 588550339 588444519
1383.9 588444519 588898506 589887276 591295891 591174278 591554298 592624969 592799911 592518616 592314644
1392.6 592314644 592692604 592101746 590602646 591022949 590918427 590052834 588442459 587701721 587882690
1401.3 587882690 587684898 587265091 586765518 585898247 585633392 585992851 585742950 584699593 584214973
1409.9 584214973 584056664 583361320 582747993 582538071 582372017 582488441 582302017 581971893 582844238 581299057
1419.6 581299057 580813522 581822510 582079964 582418175 582092896 582920303 583955154 584146690 585265770
1428.3 585265770 585828094 585238457 585628624 586645699 587131424 587621536 589277725 590611534 589213905
1437 589213905 589870491 592059593 592910347 593195190 594058495 594573288 595288582 595796928 596592255 597698898
1446.6 597698898 598386574 597990112 597996483 598695984 599127464 599728279 600159531 601210747 602258606 602261963
1456.2 602261963 601510620 600854263 603797379 605277596 606610985 607745476 608896904 611082726 611553993
1464.9 611553993 611838188 612876701 613745766 614404907 615366478 617272987 618171234 618745003 620222778
1473.6 620222778 623325577 626476707 627469292 629030762 631177711 632033386 632608948 633515511 634751663
1482.3 634751663 636060715 637279587 637977333 638593216 638644257 637983665 638964081 637873192 636440735
1491 636440735 637317467 637789307 637374916 637197456 638028984 634349747 634537392 634220734 631753540 632506218
1500.6 632506218 632089882 631018372 630190468 630629539 631287918 627203598 621166916 620612411 621771088
1509.3 621771088 620175667 620405540 619088440 616393623 616195984 615257454 614494209 612596016 610280914
1518 610280914 611231689 613279037 612995300 609805679 608432732 608777351 610115089 606894531 606152725
1526.6 606152725 606719894 605386162 604556847 604311523 603906860 602901382 602616234 599032974 599893837
1535.3 599893837 600441246 600156403 602295380 601151009 597433281 596916695 595305748 593539848 595381432
1544 595381432 596759682 594806671 596219482 596148262 596416779 596295815 594482155 595840912 596934853
1552.7 596934853 598756752 597913399 598245888 600768814 602512741 602115440 595509872 598302841 600485497
1561.4 600485497 602700195 604095993 605275459 605260849 604676704 605509987 605937996 607184753 604338646
1570 604338646 603850327 604568062 604253998 604628639 605110054 605602875 598544464 599136086 599786530 598741493
1579.7 598741493 597891998 596470795 596147690 594682083 593507156 592075005 590446091 588841362 586394386
1588.4 586394386 584873199 582515488 581297417 579005051 577023201 575491600 573296089 571793633
1596.1 571793633 569032784 567335434 564492645 562673683 560460243 558061447 556967545 554373093
1603.8 554373093 552988205 550393181 548598862 545623512 543189049 541205444 538166733 537150574
1611.5 537150574 534199257 532921333 530869217 530419998 530311317 521680450 522415352 521372604 520690002
1620.2 520690002 518404732 517814980 516815948 512210960 512238846 511403923 511890907 508409576 506275864
1628.9 506275864 505733185 504743423 504253235 502681427 503118935 502084122 499382133 497845726 499412460
1637.5 499412460 498938370 498571243 499822807 498697968 499720879 499087448 500031357 501799355 500338745
1646.2 500338745 501664009 499557114 501765327 502584839 505221481 507727432 504068794 503703079 504685860
1654.9 504685860 509078331 510573120 512363586 513169327 514276466 515963326 517712021 520756531
1662.6 520756531 520929298 523494225 524811859 526298637 528252220 530079460 531851959 532440987 536602669
1671.3 536602669 537703743 539839020 542618294 544284630 545217133 547209778 550453148 552560081
1679 552560081 555400200 556307068 558999710 563451271 565424805 565893898 566002617 570801659 574459877
1687.7 574459877 576993484 579426117 581226234 584380798 587339134 590268593 593522758 597925682
1695.4 597925682 598409348 601296349 606045532 610624123 612385101 610347481 617339211 622076759
1703.1 622076759 625661240 628271790 630676346 632975769 635334854 638773460 641275406 642991791
1710.8 642991791 645063400 647190704 649407654 650268402 650550385 653181763 655974503 651526031 652824326
1719.5 652824326 655116501 655922852 656588135 656623993 656142654 656719513 657587891 658040466 658745575 660722961
1729.1 660722961 661088562 660862808 663955002 667230377 665876541 661198120 663847809 666471329 667705917
1737.8 667705917 670167542 670942154 668891296 671876755 674961472 675717392 675982132 677933807 680167389
1746.5 680167389 682233658 684271240 685032654 688853226 690987473 690501099 693846283 696165924 698166122
1755.2 698166122 700597534 700853271 702290039 704490967 706093903 708517532 707548752 706254425 708482513
1763.9 708482513 710021133 711160889 712612305 714057083 712367706 713127213 715807724 715847092 714879150
1772.5 714879150 713267899 715533371 717246552 716182480 717264786 718311234 719737396 720614319
1780.3 720614319 719464264 719729614 720717545 721413116 721185150 720926361 721803894 722594757 722997131
1788.9 722997131 724468918 724732056 724366989 722755280 721718597 724520493 725645523 725407181 726370010
1797.6 726370010 727728577 727886963 726603317 727773819 727304993 726955109 727857361 728266983 729062042
1806.3 729062042 729437256 729512253 729854126 730539627 729736176 729638062 730164948 730153809 730722656 731035767
1815.9 731035767 731921158 731950455 732169342 732596359 732031326 732429428 732039261 732551117 733844299 732231445
1825.6 732231445 731740723 733187943 735084076 735789032 732838211 732748795 734349670 734524689 734204559
1834.3 734204559 733986053 734688492 735286713 734858322 735566483 735582047 735800171 735687332 736569824 738417358
1843.9 738417358 734094620 734697723 736631393 736776657 736406631 736688309 737119904 736620483 736865082
1852.6 736865082 736824570 736987076 737317886 737379532 737739563 737874069 738313675 738264694 738427887 737967453
1862.2 737967453 737433701 737460327 737514343 738253098 738073273 738523026 738442612 737354431 737812424 738473053
1871.9 738473053 739006500 738827667 738940811 738822632 738881226 739281235 739298782 739214325 738743973 738791046
1881.5 738791046 738994141 739428177 739196396 738909531 739441452 739326096 739708252 739518967 738290329
1890.2 738290329 738494720 738906021 738653259 738909149 739385376 738754196 738946228 739294281 739478607 739721527
1899.8 739721527 739611282 739362335 738993530 739183121 739445267 739838257 740019684 739800644 739415054 739143982
1909.5 739143982 738693619 738143387 738783722 738619843 738616333 739274597 739626007 740470123 738766937 737653732
1919.1 737653732 738234253 738349991 738763275 738019867 737310104 737975769 738674088 738886719 739186783 739170227
1928.8 739170227 738631897 738117905 737959290 737887344 737550430 737879639 737895126 737976685 738348160 738229294
1938.4 738229294 738068466 737466507 738052368 738304901 736519089 736731339 737732849 737856293 737708359
1947.1 737708359 737953186 737887726 737698822 737253113 736717377 736754532 736985321 737221909 737161255 737482529
1956.7 737482529 737694016 737332458 736975632 736778488 736763840 736531601 736353607 736054916 736294556 736771698
1966.4 736771698 736242828 735689545 735737000 736087112 736030045 736108704 736363220 736229172 735856857 735553436
1976 735553436 735959702 736082687 735621414 735457535 735528183 735188141 734903183 735065002 735135422 734994812
1985.7 734994812 734541702 734370041 734012146 733636093 733844376 733875580 733127747 732469559 733264465 733729324
1995.3 733729324 733438644 733329620 733206253 733243484 732938995 732783203 732627411 732709122 732922134 733048019 733066330
2005.9 733066330 732505875 732366867 731871185 731640854 731784134 731515427 731546936 731467743 731463470 731255646
2015.6 731255646 731331940 731144180 730792694 730737534 730224304 730323029 730351562 730547485 730596848 730071564
2025.2 730071564 729786835 729385223 729412537 729370804 729230499 728887329 728655777 728851929 728998947 729166489
2034.9 729166489 728869247 728821869 728415070 727805939 727821884 727968292 727937698 727614059 727802429 727700195
2044.5 727700195 727669373 727648010 727202377 727101669 726697388 726596298 726804657 726864548 726634827 726508865
2054.1 726508865 726399689 726002045 726082153 725907822 725765533 725401917 724958878 724976883 724751892 724778366
2063.8 724778366 724581909 724337387 724297333 724222794 723954010 723391571 723119507 722798309 722443542 722131119
2073.4 722131119 721775742 721268616 720972595 720878067 720730667 720562744 719844437 719747543 720146713 719987030
2083.1 719987030 719366684 718709030 718732376 718870392 718835220 718770828 719136810 719530792 719430161 719362869
2092.7 719362869 719202347 719058304 719120331 719556351 719672699 719608383 719712296 719870682 720355377 720373917
2102.4 720373917 720369492 720420685 720455322 720351562 719941635 720164871 720726395 721207199 721130142 721256485
2112 721256485 721794357 721980057 721850891 721473923 721422501 721266022 721434097 721596832 721382294 721194458
2121.6 721194458 720859070 721138535 721253052 720919342 720444870 720186844 720035248 719868622 720145340 720007401
2131.3 720007401 719981613 719865265 720011978 720420151 720327606 720450058 720225143 720317459 720381393 720424347
2140.9 720424347 720694199 720669861 721072159 721079025 721212540 721405258 721318970 721294861 721150360 721535645
2150.6 721535645 721887589 722117081 722278137 722334900 722142563 721961899 722203674 722317963 722378922 722154770
2160.2 722154770 722415161 722774811 722458878 722399902 722546158 722709732 722518997 722216110 722231674 722255707
2169.9 722255707 721809616 721394119 721450424 721716003 722133102 721923141 721824875 721870041 721619568 721550064
2179.5 721550064 721301270 721399078 721438446 721390381 721689072 721865768 721842346 721676407 721536026 721667252
2189.1 721667252 722266846 722357788 722322006 722808075 723182907 723341370 723226471 723432999 723703537 724024811
2198.8 724024811 724337082 724403458 724783554 724908600 724908066 724895477 724841537 725194016 725592041 725672302 725606918
2209.4 725606918 725471497 725461426 725666199 725411148 725136566 725154800 725633621 726178360 726126328 726471176
2219 726471176 726501770 726142654 725986023 725753784 725849075 725780716 725402222 725295563 725329895 725098190 725447006
2229.7 725447006 725943985 725709152 725432053 725351486 725760040 725858841 725685120 725589600 725308609 725387726
2239.3 725387726 725488739 725478210 725406876 725417633 725387497 725432281 725441132 725315323 725318451 724985809 725097198
2249.9 725097198 725117569 725039368 725161819 724985657 725403519 725474777 725240097 725276489 725423813 725592651
2259.5 725592651 725592957 725549774 725181274 725313721 725603638 725783310 725869827 725743027 725911026 725879059 725732346
2270.2 725732346 725364227 725281525 725431137 725522842 725545120 725417786 725594177 725346451 725439835 725489044
2279.8 725489044 725222321 725186234 724990845 725319824 725284958 725001450 724952698 725309143 725479507 725160141
2289.4 725160141 725298462 724891052 724970474 724979324 724471893 724658051 724743042 725020905 725015030 724943924 724901352
2300 724901352 725073242 725319901 725005112 725130844 724836426 724492111 724579086 724777451 724982071 724604721
2309.7 724604721 724156723 723953018 724325714 724337997 724125671 723701477 723104706 723423386 723401642 723117599
2319.3 723117599 722538681 721960831 722273865 722889557 723113251 722769165 722719879 722403183 721847382 721889801
2329 721889801 722463531 722738113 723034821 723038559 722720184 723346252 723243484 723245926 723367462 722707138 722007751
2339.6 722007751 721298370 721759567 721971817 722269592 723088379 723276215 723288040 723580627 723997955 724562454
2349.2 724562454 725497971 725425797 725071030 724919510 723809509 723021240 723266678 724187469 723953171 723717499
2358.9 723717499 722962494 722511749 723308563 723173828 724592667 725249176 724681854 725040207 725278168
2367.6 725278168 725137405 725312881 726027832 725913696 725751877 726495895 727570953 727670288 727219391 727071533
2377.2 727071533 727024765 727268677 727300949 727287750 727476044 728283310 728723755 728170013 728107376 728279572
2386.8 728279572 728476257 728386993 728234100 728277969 728052979 728171539 728152008 727925034 727807922 727951889
2396.5 727951889 728065948 727843857 727743454 727605209 727646179 727539291 727418823 727384872 727429504 727728958
2406.1 727728958 727728195 727866287 727672653 727216873 727046967 726893845 726851959 726921616 727168427 727258377 727212448
2416.7 727212448 726793671 726594391 726815033 726739731 726847839 726545563 726049271 726129379 726267395 726146317
2426.4 726146317 726077576 725861893 725456467 725551758 725499725 725346451 725142212 724929199 725028687 724977264
2436 724977264 725125656 725168228 725278015 725164185 724721222 724661026 724446411 724540710 724800415 724662247
2445.7 724662247 724105911 723537979 723558044 723628311 723640976 723706589 723596954 723342209 723244095 723070145
2455.3 723070145 722960510 723016129 722850266 722794571 722712250 722685699 722671890 722629013 722378845 721971436 722039871
2465.9 722039871 721980667 721929398 721787643 721534348 721588745 721732254 721865463 721447144 721160507 721088333
2475.6 721088333 720729828 720494461 720441437 720425339 720373688 720192719 719607620 719726639 720133514 719802170
2485.2 719802170 719641953 719429626 719090729 719000931 719240799 719149551 718726807 718891373 719029083 718735352
2494.8 718735352 718253860 717831726 717593231 717513962 717546463 717701721 717667999 717413483 717602997 717840042
2504.5 717840042 717853851 717548447 717183685 716932068 716613388 716723785 716721420 716496353 716376038 716577148
2514.1 716577148 716573181 716039505 715857391 715398712 715176926 715632019 715829010 715817032 715667114 715543976
2523.8 715543976 715480652 715229111 714870682 714838104 714520569 714131775 714203491 714142685 714250565 714152603
2533.4 714152603 714001694 714121628 714118423 714003067 713962250 713905182 713337402 713261414 713648224 713704987 713295135
2544 713295135 712907333 713122711 712923431 712631302 712501068 712615891 712788391 712553253 712518768 712253036
2553.7 712253036 712010269 711585388 711305847 711491394 711298676 711163330 710984879 711173325 711361313 711130676
2563.3 711130676 711078568 711084976 711079559 710591812 710327072 710551071 710541458 710307541 709981842 709733047 709694443
2573.9 709694443 709966354 709722137 709083023 709024429 708990479 708630447 708772659 709060593 708759384 708514175
2583.6 708514175 708291626 708056335 707935257 707861023 707826614 707711029 707516251 707051544 707148819 707430878
2593.2 707430878 707260361 707172775 706870117 706556625 706342239 706158142 705878830 705772629 705886383 705694275
2602.9 705694275 705649872 705411072 704840851 704477692 704251556 704156342 704175949 703867645 703329086 703256226
2612.5 703256226 703321686 703290329 703128052 702681656 702159271 702063293 702274933 702227325 702217789 701997833 701850510
2623.1 701850510 701630020 701097031 700922318 700494385 700217133 700367889 700307465 699902725 699705658 699670258
2632.8 699670258 699190369 698958664 698720627 698766251 698809280 698344650 698304596 698185196 698173294 697964325
2642.4 697964325 697530365 697445450 697228622 696977005 696464615 696037979 695841675 695677414 695588989 695613861
2652 695613861 695748672 695449677 694981766 694590683 694539185 694562607 694205475 693969498 693540192 692971344
2661.7 692971344 692762833 692643738 692751694 693020325 692642746 692178879 692063446 691884613 692079391 692320786
2671.3 692320786 692028885 691271286 690867157 691030350 690985870 691030807 691186600 691027832 690546265 689969254
2681 689969254 689567642 689490280 689357910 689262390 689488220 689208069 688920441 688722687 688347473 688132248
2690.6 688132248 687771988 687827072 687894516 687655258 687368546 686954041 686711731 686382599 685980148 685845871
2700.3 685845871 685977936 685744171 685514984 685417404 685019073 685155182 685344162 685131302 684870682 684737625
2709.9 684737625 684607315 684399261 684110718 683370361 683089371 682959061 682564468 682476196 682165985 682092972
2719.5 682092972 682441330 682273560 681289139 680720978 680998230 680834045 680459595 680340729 679974060 679686050
2729.2 679686050 679862976 679981842 679622040 678930054 678680267 678572998 678255539 678503418 678306885 677686462
2738.8 677686462 677601547 677533646 677235184 676950455 677088928 676959610 676552353 676287460 675935516 675860443
2748.5 675860443 675815659 675603714 675254059 674922638 674879150 674946289 674715652 674273758 674045944 673756561
2758.1 673756561 673463135 673248901 673109512 672977371 672742081 672542648 672172241 671615906 670951996 670856552
2767.8 670856552 671079788 670812759 670402679 670052109 669996643 669951248 669633255 669064560 668532486 668110199
2777.4 668110199 667635803 667698441 667637711 667031784 666679153 666717300 666404495 665828629 665683212 665407867
2787 665407867 665391388 665387726 664536743 663742218 663343124 663083038 663002319 663034058 662772217 662475891 662116623
2797.7 662116623 661521225 661149673 660473099 659624329 659164810 659020462 658719635 657992096 657461243 657378845
2807.3 657378845 657463608 656991501 656235580 655937881 655734940 655351028 654708557 653893204 653232956 652990570
2816.9 652990570 652697830 652220840 651690979 650688782 650242996 650641022 650213242 648930969 647992325
2825.6 647992325 647579727 647239761 646795197 646570435 646296234 645541611 644925461 644463272 643647766 642562408
2835.3 642562408 641662445 641082077 640534439 639706535 638260651 637157173 636445541 635008583 633414078
2843.9 633414078 631899109 630377960 629206619 627887650 625809669 623796349 622749786 621980438
2851.7 621980438 621388550 621255684 620863037 620255852 619948387 619911537 620506210 621118469 620440102 619622612
2861.3 619622612 619782295 620044823 619506836 618176994 617336998 617164192 616119957 614712830 614503174
2870 614503174 614721642 614227676 613246613 612747688 612558899 611692963 610875435 610490189 610262413 609812126
2879.6 609812126 608989410 608817177 608847084 608318634 607453041 606563568 606098442 605779343 605207100 604429932
2889.3 604429932 603694839 602971497 602631035 602443047 601428452 600620041 600227928 599231644 598427162
2897.9 598427162 598079987 597513199 597031059 596926994 596678619 595948257 595257339 594909058 594529228 594086189
2907.6 594086189 593545418 592881165 592148437 591453438 591032028 590303879 589139366 588041611 587213669
2916.3 587213669 586474609 585592041 585016518 584418373 583416862 582582321 582274475 582333832 582119293 581607590
2925.9 581607590 581488380 581787148 582013741 582325439 582422295 582320824 582627296 582691193 582679405 582930641
2935.6 582930641 583411865 584078217 584393158 584685631 584993858 585453110 585792656 585857086 586685143 587335739
2945.2 587335739 587036896 586749725 586711617 586769295 586666641 586591911 586820030 586330986 585499573 585537300
2954.8 585537300 585422516 584811058 584593658 584757881 584606819 584473228 584863853 585198021 585537376 585606422
2964.5 585606422 585383644 585111618 585265503 586483231 587469215 587900887 588126450 588624420 589561157
2973.2 589561157 590174332 590818481 591085854 591513519 592777176 594171791 595126343 595315399 595824013
2981.8 595824013 596342964 596434937 596786728 597416916 598245354 598742065 599106789 599272156 599503632 600420723
2991.5 600420723 601029854 600994072 601026497 601777534 602385368 601951523 601618004 601735077 601911163 602189217
3001.1 602189217 602365456 602311401 601887093 601652412 601980667 601953430 601557655 601321602 601355247 601603279
3010.8 601603279 601477509 601017036 600657692 600581551 600481987 599920273 599756622 599966354 599683990 599355850
3020.4 599355850 598875771 598278008 597997322 597621765 597264519 596870308 596619911 596473160 595797691 595328331
3030.1 595328331 595046501 594676361 594732742 594537659 593816299 593508911 593552322 592988968 592090836 591612434
3039.7 591612434 591616745 591276245 590518570 590300713 589883347 589124184 589046707 589050446 588309708 587464943
3049.4 587464943 587082634 586897240 586604195 585686913 584945717 584882660 584642258 584210625 583626900 582809792
3059 582809792 582154999 581884689 581255684 580887489 581074791 580715828 580747147 580401917 579058838 578365860
3068.6 578365860 578157997 577744064 577133636 576926384 576766739 576197739 575904427 576216049 576218681 575571442
3078.3 575571442 575252037 574578323 573696785 573383408 573269577 573175735 572532692 571975594 571641579 570814705
3087.9 570814705 570125427 569887352 569430885 568854179 568511086 567995872 567976418 568008652 567324600 567082634
3097.6 567082634 567120361 566759682 565857430 564637032 563908577 563789444 563620987 563343925 563003960 562395859
3107.2 562395859 561659279 561228790 561449394 560921135 559745102 559131775 558711243 558665848 558154602 557323341
3116.9 557323341 556834183 556157303 555799522 555606194 555215797 554385490 553346100 552558212 551906204
3125.5 551906204 551452370 550979729 550513115 550437851 550426865 549697533 548864288 548058853 547043915 546152573
3135.2 546152573 545408897 545690765 545638275 544569664 543824692 542892189 542069931 541814384 541616287 540876236
3144.8 540876236 540052605 539701691 539080887 538488350 538285675 537733688 536537819 535635223 535186539
3153.5 535186539 534561195 533749542 532692070 531931610 531434784 530742683 530092812 529364510 528642273
3162.2 528642273 528322525 527982254 527280731 526560135 525806274 525078773 524269638 523400726 522752724 522448349
3171.8 522448349 522096367 521338844 520977402 520240288 519019318 518377800 517985382 517516899 516556396
3180.5 516556396 515758209 514981613 514178162 513704224 513115425 512940750 512131920 511053238 510626831
3189.2 510626831 509903221 508959236 508223839 507691689 506982994 506507454 505736847 505061913 504978104 504141006
3198.8 504141006 503416977 502856026 502355461 501690140 500509796 500195122 500331154 499682617 498103676
3207.5 498103676 497461166 497828560 497187843 496055603 495358353 495281715 494601402 493420525 493135109
3216.2 493135109 492691154 491943207 491421776 490713959 489990883 489198456 488469582 488031044 487419891 487178154
3225.8 487178154 486919174 485980110 485528526 485136147 484279556 483816032 483555069 482741547 482016945 481795464
3235.5 481795464 481312752 480666008 479921417 479286079 478670387 478057365 477979355 477849236 477465515 476845436
3245.1 476845436 476364670 476135521 475326538 474099884 473444862 473127441 472228737 471672592 471359100
3253.8 471359100 470857391 470902672 470613480 469568367 468777847 468743591 468361282 467495537 467131348 466965370
3263.4 466965370 466716423 466405563 465900154 465101166 464512825 464334297 464329529 463752747 462728119 462328529
3273.1 462328529 461894836 461743050 461520157 460808029 460507774 459756470 458866653 458445435 458363647 458357048
3282.7 458357048 457855911 457040863 456585579 456357079 455541611 454839325 454494324 454448090 454329796 454022408
3292.4 454022408 454181633 453863792 453550110 453052902 452004318 451123924 450523872 450469894 449866257 449249535
3302 449249535 449018707 448573189 448227272 447817802 447756844 447430878 446715508 446057129 445239639 444872246
3311.7 444872246 444632645 443664627 442844124 442751923 442331924 441675110 440915184 440189056 439660454 438776512
3321.3 438776512 438132248 437791367 437667580 437525787 437012444 436127968 435068359 434559250 434181252
3330 434181252 433647766 432911758 432287674 431686020 431030655 430862427 430124397 429227715 428634605 427920303
3339.6 427920303 427408333 427051773 426459198 425151672 424202576 423678246 423038940 422522736 421816254
3348.3 421816254 421089020 420591927 420621147 420254898 419137726 417932472 416528969 415614281 415363808
3357 415363808 415182953 414682312 413974075 413410416 412630730 411566963 411166992 411195602 410345573 409220390
3366.6 409220390 408572235 408255196 407767792 406750793 405670853 404754791 404352188 404094315 403564720
3375.3 403564720 403394318 403019257 401438828 400323067 400617828 400360641 399594421 399084663 398682213
3384 398682213 398099976 397057457 396534271 396374474 396017342 395880280 395840912 395594826 395284576 394491539
3393.6 394491539 393575745 393710594 393750458 392862320 392221413 392128868 392043953 391654434 391321182 391292000
3403.3 391292000 391005402 390362396 389992218 389766808 389907990 389804955 389244308 389327621 389041977 388612404
3412.9 388612404 388539085 388134117 387388573 386960258 387302437 387332764 387088852 386360397 386019173 386535301
3422.6 386535301 386502151 386571426 386662903 386976013 386818161 386282501 386837730 387015533 386312752 385741959
3432.2 385741959 386099815 386371727 386206627 386208076 386052246 386467476 387034683 387286797 387562866 387998810
3441.8 387998810 388081589 387927589 387876778 388151283 389335976 389080276 388527184 389159546 389632568 390027657
3451.5 390027657 390138741 390619278 391012650 391587563 392408638 392442970 392712593 393326721 393700790 393734856
3461.1 393734856 394205246 394637756 395087242 395888062 396290245 396556473 396436501 397084999 397976608 398717995
3470.8 398717995 399496613 399260712 399712143 400292549 400511131 401410408 402255630 402348976 402186890 403155899
3480.4 403155899 404206085 404714279 405187569 406041565 407128296 407220116 407646027 408956757 409316025
3489.1 409316025 409351006 410234871 411234169 411957664 412200241 412380981 413125916 413547630 413662758 414165611
3498.7 414165611 415237579 416091995 417170296 418093185 417784271 418117752 418598404 419450989 420493774
3507.4 420493774 421381645 422279854 422410088 423199463 423975105 424454308 424944534 425824852 426896782
3516.1 426896782 427306290 428091125 428954391 429713326 430043106 431217270 432844276 432771530 433437843
3524.8 433437843 434557915 435987663 437057419 437134209 436708794 436943932 438337708 438925476 439706459
3533.5 439706459 440683136 442721596 444317093 443828888 444647446 445638618 447077942 447803230 448240166
3542.1 448240166 449451752 450549088 451862335 451868515 452756424 452544556 453093147 454946213 456101265
3550.8 456101265 458223305 458275414 459113960 460496216 461514435 463335876 463489265 464412956 465912819
3559.5 465912819 467274551 467660522 468668976 470062485 470278664 473616600 475289230 475417557 476106644
3568.2 476106644 475211983 477500191 478784027 479971771 481720390 483155327 483701324 484327240 486648293
3576.9 486648293 487490120 489312897 491137695 491301308 492592773 494523048 496401062 496459122 498539925
3585.5 498539925 501314850 501681709 503767471 502667122 503951225 506608582 509180298 511111107
3593.2 511111107 511257095 513603020 513475151 515215607 518461342 518411484 520393677 521618538 522854614
3601.9 522854614 525062065 525941849 527098198 529498672 532864838 532801361 535686913 536417313 534712524
3610.6 534712524 541649895 545380478 543180046 546589394 545960350 547929916 551626740 552022476 554349136
3619.3 554349136 554776726 554586029 557344780 560028877 561948357 564048271 565641441 567738419 574215927
3628 574215927 578730240 570354805 572085266 575103798 579640961 583326111 583045311 584338684 586567535
3636.6 586567535 589255447 590831337 592388153 594370461 596491394 598767624 599265213 601432533
3644.4 601432533 605093994 610274010 611741180 607027245 611474953 616666908 616485138 612643509
3652.1 612643509 615374336 619153900 622146683 628677101 624271965 623403702 627787361 629222183
3659.8 629222183 630354385 631132202 633564148 634874420 636167259 637924309 637592583 640662460 644204254
3668.5 644204254 644800034 645233612 640643845 641632004 647383881 655671158 661005402 646680832 644953384
3677.1 644953384 650114822 654902878 654458389 653870850 655381470 657089539 658874435 658975143 658260498
3685.8 658260498 661319580 668114395 663069687 657513504 664714813 662672729 660065994 662988129
3693.5 662988129 663474731 664359055 664232178 663526154 664542999 664853363 666867981 670418243 667626419
3702.2 667626419 664630814 667977829 669886475 669963150 670614319 672488174 675998535 671085205 673399429
3710.9 673399429 679902344 669703140 671711655 675585861 676069794 676171646 677566376 679582443
3718.6 679582443 676732101 676170425 681233444 679005356 673801498 677409973 678689880 679791031
3726.3 679791031 678585205 676956940 678727493 679033585 684200821 683910904 676152802 682742233 686485443
3735 686485443 680294724 678540955 680019073 679356232 680370026 683866501 680840607 681751938 691737289
3743.7 691737289 690232468 673679352 678955002 681920853 686495819 686207962 676282578 686180649
3751.4 686180649 685068741 677372055 680800476 684584122 688665161 683453217 683544006 689923172 685129471
3760.1 685129471 681802826 684227066 685052414 685103378 688057938 686599579 682528076 684179382 687974854
3768.8 687974854 690062256 683783112 684237213 686603088 687136536 687708130 686915894 686804047 686659012
3777.4 686659012 689449234 690886078 683802185 684609985 686375732 686635056 688773727 687478714 686505814
3786.1 686505814 687911606 688410873 688650131 687863922 687521057 688132401 688760071 688035965 687726517
3794.8 687726517 690703354 689270325 685374985 686404114 688855591 693540344 691513596 684310837
3802.5 684310837 684844513 685103302 688263245 694870071 689941406 683614273 687171860 688818054 688006516
3811.2 688006516 688263092 688378601 688882370 693572769 696122742 683246765 684702225 689213486 692998886
3819.9 692998886 695888443 681523056 681966934 686020050 688154221 691202545 691893158 687749100
3827.6 687749100 686746140 687709427 690081406 693314972 686058197 686403427 692814636 687052536 685746765
3836.3 685746765 693825912 689472275 683987122 690486298 688065796 685753174 691251678 690622635
3844 690622635 686338730 687723312 688364029 687907410 689209595 688221207 688975372 695708084 694382782
3852.7 694382782 696457291 685168610 681248322 689308777 688950043 686202545 687257309 688844986
3860.4 688844986 691614075 687811813 686803818 693058243 690607910 683411713 684974289 689533691
3868.1 689533691 696583633 693724594 682561035 683523102 688719559 694141083 686296387 684459534
3875.8 684459534 687818451 687878571 689022217 692866516 689696198 682763748 687241440 689234543 690023117
3884.5 690023117 696056290 687029266 684668732 686832199 686557846 690411301 692800217 685208130
3892.2 685208130 684801407 687996674 686445312 685958099 686433716 689031982 692394028 684444733 687514420
3900.9 687514420 689833298 685322952 690267410 688894958 686285248 686107712 686343536 688028336 687642593
3909.6 687642593 687652130 688057480 687569962 686904221 686768417 687738647 689951630 688243179 684330750
3918.2 684330750 687234726 688100891 684925766 686366425 687666245 688213272 687361221 685250549 686072693
3926.9 686072693 686792145 687415237 687491837 687540817 689798050 687581635 684825134 686117935 686432037
3935.6 686432037 686829529 686820755 686302261 686642609 685622864 686028519 687503052 684848328 684106522
3944.3 684106522 685164413 685993271 687434464 685860138 686290970 687562256 684929123 685391693 686421204
3953 686421204 686185760 686300735 686225815 686404877 685977173 686008835 685476990 685693130 686867523 685781784
3962.6 685781784 685222168 685133667 685140305 685863876 686230927 687011414 686947937 686129303 686597672 686846466
3972.2 686846466 686259995 685765762 685507126 685271530 684946747 685901642 686654663 686081009 685871887 685813141
3981.9 685813141 685870667 685763016 685970917 686080399 685470352 685195236 685126572 685967636 685935516 685380783
3991.5 685380783 686047287 685913849 685640259 685186615 684985733 685662155 685684967 685420456 685669708
4000.2 685669708
##END=$$ End of the data block
