##TITLE=$$ Begin of the data block
##JCAMP-DX=5.00 $$ ACD/SpecManager v 10.08
##SPECTROMETER/DATA SYSTEM=Varian
##DATE=18 Dec 2012 14:02:50
##DATA TYPE=INFRARED SPECTRUM
##DATA CLASS=XYDATA
##ORIGIN=
##OWNER=
##NPOINTS=3735
##FIRSTX=399.26403809
##LASTX=4000.35498047
##MAXX=4000.35498047
##MINX=399.26403809
##MAXY=85.23141479
##MINY=37.52457809
##XFACTOR=1.0000000000
##YFACTOR=0.000000100000000
##FIRSTY=69.36577606
##DELTAX=0.96440572
##XUNITS=1/CM
##YUNITS=TRANSMITTANCE
##XYDATA=(X++(Y..Y))
399.3F93657761J3971939K3792953J2310868m755555m608459r75189l43628N573959
$$ 693657761 707629700 731422653 743733521 738977966 734369507 733394318 733050690 738624649
407G38624649q477554o701737k750473K686844R954453n40085j1065064j4373016L812027
$$ 738624649 730147095 723445358 720694885 723381729 733336182 732796097 721731033 707358017 711170044
415.7G11170044J3655624J0782547l441162k3335876J5599899P471314O339492j995620
$$ 711170044 724825668 735608215 732167053 708831177 724431076 731902390 738241882 736246262
423.4G36246262r089280m235153j546325N67626J158143M830017J774826k559586K86789
$$ 736246262 727156982 722921829 721375504 721943130 723101273 727931290 729706116 727146530 727433319
432.1G27433319L432617m32510r50852r78469o968689j132584l94974K185517K693405
$$ 727433319 730865936 730433426 729482574 728504105 721535416 720402832 720007858 722193375 724886780
440.7G24886780J559753L741226m291763j547012j841278r14917J623611j504516n22919
$$ 724886780 726446533 730187759 725895996 724348984 722507706 721592789 723216400 721711884 721188965
449.4G21188965L26691L694686r55047j155014k50473j379700K662964K466812P91550
$$ 721188965 721515656 725210342 724255295 723100281 722849808 721470108 724133072 726599884 727391434
458.1G27391434q244324r66034J782532m021988j733551n15595K604142J251907K46124
$$ 727391434 719147110 718181076 719963608 715941620 714208069 713692474 716296616 717548523 717794647
466.8G17794647j749954m299850P66983O180725N925369p874603m718399J268310J330719
$$ 717794647 716044693 711744843 712511826 718692551 724617920 716743317 712024918 713293228 714623947
475.5G14623947J901169j790619J296921M217834N460282k020569n073776k33002J48620
$$ 714623947 716525116 714734497 716031418 720249252 725709534 723688965 718615189 718382187 718530807
484.1G18530807j472930n215073n36041J603164j907882l05863J164475Q08410M84772
$$ 718530807 717057877 711842804 711306763 712909927 711002045 710696182 711860657 712669067 713153839
492.8G13153839L697357K047653N24903J150665L76968j255264l417053m70505K086640
$$ 713153839 716851196 718898849 719423752 720574417 720951385 719696121 716279068 715808563 717895203
501.5G17895203L241958j176071m664841k5405L654861M66309k749176k828980l507538
$$ 717895203 721137161 719961090 715296249 715270844 718925705 719392014 716642838 713813858 710306320
510.2G10306320k76489N54581l821030k200699M714203K894516n603104j809997J787567
$$ 710306320 710029831 710584412 706763382 704562683 709276886 712171402 706568298 704758301 706545868
518.9G06545868k195740r71680L30048o57120k024536n11246J848908R22852m33198
$$ 706545868 704350128 703378448 703708496 703051376 701026840 700515594 702364502 703287354 702854156
527.5G02854156q65554M38842J153870K11258k34833j151504k257996n08575Q83407
$$ 702854156 701988602 702427444 703581314 703792572 703557739 702406235 700148239 699639664 700523071
536.2G00523071J38169l81165o36139J622009J704178O36139J403733q46100j190186
$$ 700523071 700661240 700280075 699643936 701265945 702970123 703606262 705009995 704163895 702973709
544.9G02973709M91943R28193m8447j144791j155548n07812J494446J574172R12323
$$ 702973709 703465652 704393845 704345398 703200607 702045059 701537247 703031693 704605865 705518188
553.6G05518188J186829J349411M31366m27399j62506Q9340J07804k410736j550751
$$ 705518188 706705017 708054428 708485794 708058395 707895889 707985229 708093033 705682297 704131546
562.3G04131546J873093M38690n07126K11563J698990J758957p96509r98306k3194
$$ 704131546 706004639 706443329 705936203 706147766 707846756 709605713 708809204 707810898 707787704
570.9G07787704j250915j689301k80227L31115m87747j389160K94800J302872Q11538
$$ 707787704 706536789 704847488 704567261 704898376 704410629 703021469 703316269 704619141 705430679
579.6G05430679Q60291r38263J94092J450576r46655j228943j619644j173172O13022
$$ 705430679 706290970 705352707 705546799 706997375 706050720 704821777 703202133 702028961 702641983
588.3G02641983o9809Q45718J564637P50045J235962L36457j099015j110153q89511
$$ 702641983 702572174 703417892 704982529 705732574 706968536 707304993 706205978 705095825 704206314
597G04206314j384506j586151r98078j256790n11856k35748j670151k988129l836135
$$ 704206314 702821808 701235657 700237579 698980789 698468933 698233185 696563034 693574905 689738770
605.6F89738770l177948l578187n254364p108764q842163r364853r956741j0777894
$$ 689738770 686560822 682982635 677728271 670619507 661777344 652412491 642455750 631677856
613.4F31677856q478889n006218j462707L05366m92134o04782k580910m235458o778946
$$ 631677856 623198967 618192749 616730042 617035408 616543274 615938492 613357582 609122124 602343178
622F02343178p305298l826065Q42285P812347J0634423J1399307J1760864J2507401
$$ 602343178 595037880 591211815 592054100 599866447 610500870 621900177 633661041 646168442
629.8F46168442R017410L748016J360398j528626l080215n485306o580276n077401
$$ 646168442 655185852 658933868 660294266 658765640 655685425 650200119 643619843 638542442
637.5F38542442m086723k482758J563797Q018341J1496277J3384476J2028732J0852127
$$ 638542442 634455719 631972961 633536758 641555099 653051376 666435852 678464584 689316711
645.2F89316711R329682O196594M159622L020172K688752K955322J806717N81589O82373
$$ 689316711 698646393 704842987 709002609 712022781 714711533 717666855 719473572 720055161 720737534
653.9G20737534O24542R93805J187057J057892P21130J593552J292267j224213n78537
$$ 720737534 721362076 722355881 723542938 724600830 725321960 726915512 728207779 726983566 726405029
662.5G26405029J607361J921463J141739J543884q35342r303818O214218M488831J487121
$$ 726405029 728012390 729933853 731075592 732619476 731784134 722480316 728694534 733183365 734670486
671.2G34670486n33676l35617K070771J022415k02408k04926K70233m72946r44214
$$ 734670486 734136810 733801193 735871964 736894379 736691971 736487045 736757278 736284332 735340118
679.9G35340118J541291J254043k94723J5335O41708N93643q64410j822052j880188
$$ 735340118 736881409 738135452 737840729 737856064 738497772 739091415 738227005 736404953 734524765
688.6G34524765j575241n92041k29340j98669p30362j366959m22439o41556j106720
$$ 734524765 732949524 732357483 732128143 731929474 731199112 729832153 729409714 728768158 727661438
697.3G27661438j40610k93579q54263q55789j26801K31629k53373M64783J374054J168213
$$ 727661438 727520828 727227249 726372986 725517197 725390396 725622025 725368652 725833435 727207489 728375702
706.9G28375702J231766J344146O92749J022416J679763J030655P46460R77249N22843
$$ 728375702 729607468 730951614 731644363 732666779 734346542 735377197 736123657 737100906 737623749
715.6G37623749K14844J209564K113571J979523O23931N95170J318817j04294M2572
$$ 737623749 737838593 739048157 741161728 743141251 743765182 744360352 745679169 745574875 745617447
724.3G45617447N42145O58035o29273k598876m67835J32828r58252o3629J279907Q26797
$$ 745617447 746159592 746817627 746188354 743589478 743121643 743254471 742296219 742232590 743512497 744339294
733.9G44339294p92846j071244n36880N89828q85772j564713p9269p14340l7308Q43735
$$ 744339294 743546448 742475204 741938324 742528152 741642380 740077667 739998398 739284058 739246750 740090485
743.6G40090485O98928J538849K624894K605056K096558K257385J844025J111679M75540
$$ 740090485 740789413 742328262 744953156 747558212 749654770 751912155 753756180 754867859 755343399
752.2G55343399J338730J458206N28488J589051L213958L484955K174454K074203J605759
$$ 755343399 756682129 758140335 758668823 760257874 763471832 766956787 769131241 771205444 772811203
760.9G72811203R52682k13317j796189n09872m42887j479721k237243p36161J097565
$$ 772811203 773763885 773550568 771754379 771244507 770801620 769321899 767084656 766348495 767446060
769.6G67446060J043091J181870j9379O07605J128387R24225J140671j09406k16903
$$ 767446060 768489151 769671021 769651642 770259247 771387634 772311859 773452530 773343124 773126221
778.3G73126221M19464J670608K065201K473145K893600K594681J927032L79410M07257
$$ 773126221 773545685 775216293 777281494 779754639 782648239 785242920 787169952 787549362 787956619
787G87956619p59048m38462N43442n54046m53034j40152L62168n05219m16183J242828
$$ 787956619 787197571 786759109 787302551 786748505 786295471 786155319 786517487 786012268 785596085 786838913
796.6G86838913J802978J631241N66178j85700j157913j107025m78363j253739j516723
$$ 786838913 788641891 790273132 790839310 790653610 789495697 788388672 787910309 786656570 785139847
805.3G85139847P3318J407776J707001J099625R15985J466598n6152K97470R61227
$$ 785139847 785213165 786620941 788327942 789427567 790343552 791810150 791753998 792051468 793012695
814G93012695n34134j495437j431809O12870N62439L36227L6850l37830J136246J274643
$$ 793012695 792478561 790983124 789551315 790164185 790726624 791062851 791099701 790761871 791898117 793172760
823.6G93172760O94504j651154k200241j915436k171020j937256k704773k056045k127305
$$ 793172760 793867264 792216110 790015869 788100433 785929413 783992157 781287384 779231339 777104034
832.3G77104034j464614j006241j301346j225662k113572j909713k822953l387374
$$ 777104034 775639420 774633179 773331833 772106171 769992599 768082886 765259933 761872559
840G61872559k862778k219238j964112k731781j013717J062698N79529l01209J62049
$$ 761872559 759009781 756790543 754826431 752094650 751080933 752143631 752723160 752421951 752584000
848.7G52584000J428222J962052J582946R70841N74798J208649K931137K656784K027893
$$ 752584000 754012222 755974274 757557220 758528061 759102859 760311508 763242645 765899429 767927322
857.4G67927322K190247J351776J394425K157058K767868J804886P96890N18341K41929
$$ 767927322 770117569 771469345 772863770 775020828 777788696 779593582 780390472 780908813 781150742
866G81150742K69241L02734O4087r28726N10330J457215J378784P07016m8752J524353
$$ 781150742 781419983 781722717 781786804 780858078 781368408 782825623 784204407 784911423 784862671 786387024
875.7G86387024P92389M73785n66940j260758q45108k388687j780319j916885j208191
$$ 786387024 787179413 787653198 787086258 785825500 784980392 782591705 780811386 778894501 777686310
884.4G77686310n99060r67484p95898j527100j006393m42200P71179k29339j332093
$$ 777686310 777087250 776119766 775323868 773796768 772790375 772348175 773119354 772890015 771557922
893G71557922l83682l82919J062927J123123L30963P03354R46198m04282j354370n4474
$$ 771557922 771174240 770791321 771854248 772977371 773308334 774011688 774957886 774553604 773199234 773144760
902.7G73144760p03812j059265q4533m26407j599274j863251k171554k235260j327362
$$ 773144760 772440948 771381683 771297150 770870743 769271469 767408218 765236664 763001404 761674042
911.4G61674042k201615k244644j795730j713715j071167j859665k294922j882400
$$ 761674042 759472427 757227783 755432053 753718338 752647171 750787506 748492584 746610184
919.1G46610184j644287j627961j699142j798401j939392j114883l50342j062317j180954
$$ 746610184 744965897 743337936 741638794 739840393 737901001 736786118 736435776 735373459 734192505
927.8G34192505o11801j064911q39615K93732Q20312N35889N66101J418686K017288
$$ 734192505 733580704 732515793 731676178 731969910 732790222 733326111 733892212 735310898 737328186
936.4G37328186J923218J724701K724457K743225J501007K238464L042755K819824
$$ 737328186 739251404 740976105 743700562 746443787 747944794 750183258 753226013 756045837
944.2G56045837J917725K003174K173385J041031J639176J267013N90058O51626N28260
$$ 756045837 757963562 759966736 762140121 763181152 764820328 766087341 766677399 767329025 767857285
952.8G67857285K92892n59921J37329Q1405p42874j760177k293396j973801k012176
$$ 767857285 768150177 767590256 767727585 767808990 767066116 765305939 763012543 761038742 759026566
961.5G59026566r28650j203537k457047k473221j818466j603165j652526j151200j003189
$$ 759026566 758097916 756894379 754437332 751964111 750145645 748542480 746889954 745738754 744735565
970.2G44735565n42602m85077q43582l68042m05426j323777j173095Q5678J30691p88116
$$ 744735565 744192963 743707886 742864304 742496262 742090836 740767059 739593964 739679642 739810333 739022217
979.8G39022217j257324q01239q49839j532592j538773j182251j207504k352219k504425
$$ 739022217 737764893 736963654 736113815 734581223 733042450 731860199 730652695 728300476 725796051
988.5G25796051k046585k392349k541123l273315n360794q394547j0782776q725814
$$ 725796051 723749466 721357117 718815994 715542679 710181885 701787338 691004562 682278748
996.2F82278748J1291P962341Q743668M433594J033935K16751J65711N20477r3613
$$ 682278748 682290039 690252380 698996048 703429642 704463577 704680328 704846039 705366516 705272903
1004.9G05272903j049118r61837j177369o03714j08032j089172j332016j002274r81674
$$ 705272903 704223785 703261948 702084579 701480865 701372833 700283661 698951645 697949371 696967697
1013.6F96967697o40716j025315j884308j650924j267929j922837k404403j879883
$$ 696967697 696326981 695301666 693417358 691766434 690498505 688575668 686171265 684291382
1021.3F84291382j530686j924591k367096j243515j108169j930161j023788j658783
$$ 684291382 682760696 680836105 678469009 677225494 676117325 674187164 673163376 671504593
1029F71504593k234039j802216j479416j426239j841736j403885j298294j156158j461182
$$ 671504593 669270554 667468338 665988922 664562683 662720947 661317062 660018768 658862610 657401428
1037.7F57401428j174927j514358j151733M36554o93512j05134p4539m31060K12020
$$ 657401428 656226501 654712143 653560410 653996964 653303452 653198318 653123779 652692719 652904739
1046.4F52904739j94244N71289J005707J501007Q92563K82364O93664R51767M91715
$$ 652904739 652710495 653281784 654287491 655788498 656681061 656963425 657657089 658608856 659100571
1055.1F59100571l06321M34952M88510K14386l48892J98593J76468j770630q04825
$$ 659100571 658794250 659229202 659717712 659932098 659583206 659781799 659958267 658187637 657382812
1063.7F57382812M18625K83280m14276q44422j348190q45871K9526j022873q13675
$$ 657382812 657801437 658084717 657670441 656826019 655477829 654631958 654661484 653638611 652824936
1072.4F52824936j015930p41196q51059o83365L77655m51355m94613j805344r30557
$$ 652824936 651809006 651067810 650216751 649533386 649911041 649459686 648965073 647159729 646229172
1081.1F46229172M02603n96085o52694r33075j128617k446441k043343j908836k283173
$$ 646229172 646631775 646035690 645382996 644449921 643321304 640874863 638831520 636922684 634639511
1089.8F34639511k342567m253502m547882n292511o180191p158661p482186q277015
$$ 634639511 632296944 628043442 623495560 618203049 612022858 604864197 597382011 589104996
1097.5E89104996q626366p828865r144707r011230j1046639j0387802r736442r518357
$$ 589104996 580478630 572649765 563505058 554493828 543447189 533059387 523322945 513804588
1105.2E13804588q648529j1325531r769134j0414658r679413r512825p916755n960350
$$ 513804588 505156059 493830528 484061394 473646736 463967323 454454498 446537743 440577393
1112.9D40577393o679497l974381m812965p64237q0757m7149O17485L96614L266182
$$ 440577393 433897896 429923515 425110550 424346313 424265556 424218407 424835892 425232506 428498688
1121.6D28498688P83729K079735J683235J983910J211815L70025J156083j446343M65164
$$ 428498688 429282417 431362152 433045387 435029297 436241112 436611137 437767220 436320877 436786041
1130.3D36786041j060333j58348j427689l589744k929535m357758k677002m348564
$$ 436786041 435725708 435567360 434139671 430549927 427620392 423262634 420585632 416237068
1138D16237068k643509l724365l178673k889900n337715k273903m309921k835617m117508
$$ 416237068 413593559 409869194 406690521 403800621 398462906 396189003 391879082 389043465 384925957
1146.7C84925957k958184j202850k596588p83615k138939J692162K12669M33311J362305
$$ 384925957 381967773 380764923 378168335 377384720 375245781 376937943 377150612 377583923 378946228
1155.4C78946228J263580L631134K007561M080963K188568L207665L517761L865624
$$ 378946228 380209808 383840942 385848503 389929466 392118034 395325699 398843460 402709084
1163.1D02709084N307083L892936N603943L860398N899314N903473O540909P633553
$$ 402709084 408016167 411909103 417513046 421373444 427272758 433176231 439717140 447350693
1170.8D47350693P036171Q815727P154808Q556862P782249P997437P831116P156562
$$ 447350693 454386864 463202591 470357399 478914261 486696510 494693947 502525063 509681625
1178.5E09681625P972947O151580P469902O942978O806603O119003N717773O101494
$$ 509681625 517654572 523806152 531276054 538219032 545025635 551144638 556862411 562963905
1186.2E62963905N228615N529976L928528M776230M517784L905639L642693L099213
$$ 562963905 568192520 573722496 577651024 582427254 586945038 590850677 594493370 597592583
1193.9E97592583M307480L606834M482651M301681M499741M698219L891220M431839
$$ 597592583 601900063 605506897 609989548 614291229 618790970 623489189 627380409 631812248
1201.6F31812248L950043L758850K763329K973251K695312K056122K563782K091827
$$ 631812248 635762291 639521141 642284470 645257721 647953033 650009155 652572937 654664764
1209.4F54664764K004776J502610K398605K324524J961670K266769J273880J175690
$$ 654664764 656669540 658172150 660570755 662895279 664856949 667123718 668397598 669573288
1217.1F69573288N37338Q45490J036606R08355R74732K93579Q20007Q67920R98917
$$ 669573288 670110626 670956116 671992722 672901077 673875809 674169388 674989395 675857315 676856232
1225.8F76856232R45587J058044R32541L05939Q10699N81971K98004k4262J21384O77414
$$ 676856232 677801819 678859863 679792404 680098343 680909042 681491013 681789017 681764755 681886139 682563553
1235.4F82563553Q15811O68488M73251J011887P99331Q61283P17926L18527J74484
$$ 682563553 683379364 684047852 684521103 685532990 686332321 687193604 687911530 688230057 688404541
1244.1F88404541j09558L87802M29916L82538j4267K62146P75528N46189N70907K82898
$$ 688404541 688294983 688682785 689112701 689495239 689480972 689743118 690518646 691064835 691635742 691918640
1253.7F91918640O20117M16565J99814k6245k17133M92249L83224M19159N55039J042175
$$ 691918640 692538757 692955322 693155136 693128891 692911758 693404007 693787231 694206390 694761429 695803604
1263.4F95803604P58743L44086R58786R23691Q33282M01459N34210P75681O92520Q35037
$$ 695803604 696562347 696906433 697865219 698788910 699622192 700023651 700557861 701333542 702026062 702861099
1273G02861099Q60901J316300J576538J515350J415329J563568R65042Q61969J107178
$$ 702861099 703722000 705038300 706614838 708130188 709545517 711109085 712074127 712936096 714043274
1281.7G14043274Q11768J561660J425705J084595J181488J081696J612854J748886
$$ 714043274 714855042 716416702 717842407 718927002 720108490 721190186 722803040 724551926
1289.4G24551926J317062J039429J264572J209259J263962J451568J029969O28662
$$ 724551926 725868988 726908417 728172989 729382248 730646210 732097778 733127747 733756409
1297.1G33756409O87942J149216J205292J025695R89609R71298P57828L77197O56968
$$ 733756409 734444351 735593567 736798859 737824554 738814163 739785461 740543289 740920486 741577454
1305.8G41577454N11779J97297N59463J47781K99988Q25577L75900K06604K76642M74777
$$ 741577454 742089233 742286530 742845993 742993774 743293762 744119339 744495239 744701843 744978485 745453262
1315.4G45453262P60193R07746O90307m57687l38822Q30079N41839O08368Q77914K75650
$$ 745453262 746213455 747121201 747811508 747353821 747014999 747845078 748386917 748995285 749873199 750148849
1325.1G50148849M15574O06765J056061J071549K32162K07672k80609k49329l9978
$$ 750148849 750564423 751171188 752227249 753298798 753530960 753738632 753458023 753208694 753168716
1333.8G53168716k23159n1194j42822N84107L23333q65936j034393N75332J263504
$$ 753168716 752945557 752894363 752751541 753335648 753658981 752793045 751758652 752333984 753597488
1342.4G53597488K55280J6403l12042o87103n66712j02920N5389l01208K16827j89743
$$ 753597488 753852768 753869171 753557129 752870026 752303314 752200394 752255783 751954575 752171402 751981659
1352.1G51981659P706J50985p88574n07507J31836k70844q64410L39126j12075p50733
$$ 751981659 751989365 752140350 751351776 750844269 750976105 750705261 749840851 750179977 750067902 749317169
1361.7G49317169q74557k139969J277771J120453k13852M08859j014404j995850o88248
$$ 749317169 748442612 746302643 747580414 748700867 748487015 748895874 747881470 745885620 745197372
1370.4G45197372m26178r0866n99136k768173j775971N76935J115112j15737n83497
$$ 745197372 744771194 744680328 744081192 741313019 739537048 740113983 741229095 741113358 740529861
1379.1G40529861J19172n60837j166535j651001p33718L96881J752548J364364k145004
$$ 740529861 740649033 740088196 738921661 737270660 736536942 736933823 738686371 740050735 737905731
1387.8G37905731R01718J912918O98777K45208O19278J650772j671295l803634P97271
$$ 737905731 738807449 740720367 741419144 741664352 742283630 743934402 742263107 738459473 739256744
1396.4G39256744J535645J80511l950882j636962J340179J55411L36303R43375k275848
$$ 739256744 740792389 740972900 737022018 735385056 736725235 736880646 737216949 738160324 735884476
1405.1G35884476p07398J504441R3841j77231q69674p03354p57370o35529P55615L1815
$$ 735884476 735177078 736681519 736775360 736598129 735728455 735025101 734267731 733632202 734387817 734419632
1414.8G34419632M84467P93151J281128J690598o556702J41831L353881J427002K27204
$$ 734419632 734904099 735697250 736978378 738668976 732112274 732254105 735607986 737034988 737262192
1423.4G37262192k977677N19104K109528O1951J428222J058121j315155Q34503J884308
$$ 737262192 734284515 734803619 736913147 736975098 738403320 739461441 738146286 738980789 740865097
1432.1G40865097P72018L69568K702561K410583p414169p60346L733521J391220K38648
$$ 740865097 741637115 742006683 744709244 747119827 739705658 738945312 742678833 744070053 744308701
1440.8G44308701N53970M20837J451645J047516O36673J885223l02963l312454J110153
$$ 744308701 744862671 745283508 746735153 747782669 748419342 750304565 750001602 746689148 747799301
1449.5G47799301J874390p7057m93317R60770K741394K715912L03955m618301k910386
$$ 747799301 749673691 749596634 749103317 750064087 752805481 755521393 755825348 751207047 748296661
1458.2G48296661K430954K065201K814560Q84247Q41827K676316m012757j291198K645721
$$ 748296661 750727615 752792816 755607376 756491623 757333450 760009766 755997009 754705811 757351532
1466.8G57351532J520462J327744J872329M272385K173004l171539k226563L370514
$$ 757351532 758871994 760199738 762072067 766344452 768517456 765345917 763119354 766489868
1474.6G66489868M480210l096619K51312L166351J425171J717606k10571L12194J672516
$$ 766489868 770970078 767873459 768124771 771291122 772716293 774433899 774223328 774535522 776208038
1483.2G76208038J095353J359710K206497j004486j947403K991257l880691o106186
$$ 776208038 777303391 778663101 780869598 779865112 777917709 780908966 777028275 770922089
1491G70922089K399520K653962J284637J829300Q76846q185119L574753J9683n188446
$$ 770922089 773321609 775975571 777260208 779089508 779966354 771781235 775355988 775375671 770187225
1499.6G70187225K377854j27640j043549Q0643K529373L848114o147766j4245682O81382
$$ 770187225 772565079 772437439 771393890 771474533 774003906 777852020 771704254 757458572 758139954
1508.3G58139954L478698P3777K900161j849212l784638K338639k6627n7221n851364
$$ 758139954 761618652 761692429 764592590 762743378 758958740 761297379 761270752 761213531 755362167
1517G55362167o051864O819305N301972k991410p269897j240692L235244L482819m809570
$$ 755362167 749310303 756129608 761431580 758440170 751170273 749929581 753164825 756647644 751838074
1525.7G51838074p43637J589126l158798n03235J157379Q56552R20258k345657q105622
$$ 751838074 751094437 752683563 749524765 749021530 750178909 751035461 751955719 749610062 741504440
1534.3G41504440K486878K952881K959976M557342m575958j0051193J256943j049500
$$ 741504440 743991318 746944199 749904175 754461517 749885559 739834366 741091309 740041809
1542.1G40041809j152191L258514q83255m078445L762970K051163K000351j743546
$$ 740041809 738889618 742148132 741264877 737186432 740949402 743000565 745000916 743257370
1549.8G43257370m299011L464966L039779K926102n900803j82190P145005M813995
$$ 743257370 738958359 742423325 745463104 748389206 742488403 742306213 749451218 754265213
1557.5G54265213J87683j6792221k742081Q751068M997178K618026J353379k871476
$$ 754265213 754452896 737660675 734918594 743669662 748666840 751284866 752638245 749766769
1565.2G49766769q35876L138733K933502O485j1032410K689743L304978K38571J369781
$$ 749766769 748930893 752069626 755003128 755009613 743977203 746666946 749971924 750210495 751580276
1573.9G51580276K808762J261978j4667663K841644K871017n84335m97131j310120
$$ 751580276 754389038 755651016 740983353 743824997 746696014 746111679 745614548 744304428
1581.6G44304428j51214j435624j059723j557540j439820n70679j532287r62296k196121
$$ 744304428 744153214 742717590 741657867 740100327 738660507 738089828 736557541 735595245 733399124
1590.3G33399124j091003k131119j174240j017914k839813j390915k396927r43069
$$ 733399124 732308121 730177002 729002762 727984848 725145035 723754120 721357193 720414124
1598G20414124j564179j071701k026901k389679j173477l075867r55811j378631j364517
$$ 720414124 718849945 717778244 715751343 713361664 712188187 709112320 708156509 706777878 705413361
1606.7G05413361k557526j079254j609802l227234j54724j947785l93066j231995J543579
$$ 705413361 702855835 701776581 700166779 696939545 696784821 694837036 694443970 693211975 694755554
1615.4F94755554N23834j5312957K577896K04696J06736r93805R79919n67550q122101
$$ 694755554 695279388 679966431 682544327 682749023 682855759 681861954 682841873 682274323 674152222
1624F74152222J385116L40958J186294m381790l157348J010666j019364J31683q05130
$$ 674152222 675537338 675878296 677064590 672682800 669525452 670536118 669516754 669648437 668843307
1632.7F68843307K398072K633667r633866l158950J831131R39483J130600Q65784q63876
$$ 668843307 671241379 673875046 664241180 661082230 662913361 663852844 664983444 665849228 664985352
1641.4F64985352J040649j65100K437515L604660l417892l025513l027115L269577
$$ 664985352 666026001 665860901 668298416 671903076 668485184 665459671 662432556 665702133
1649.1F65702133L177338M857712O081619n842819j6703720O501617P283859K862549
$$ 665702133 668879471 673737183 679818802 673975983 657272263 663773880 671057739 673920288
1656.8F73920288J669159J494064J289368K187119K873535N1803l355789L818512K741013
$$ 673920288 675589447 677083511 678372879 680559998 683433533 683485336 680129547 683948059 686689072
1665.5F86689072K064590L702698K784195l219986j85013L844833m66766M250107O144028
$$ 686689072 688753662 692456360 695240555 692020569 691835556 695680389 695213623 699463730 705607758
1674.2G05607758j087800m014739M481887M553223K849579K155533j038971M064789
$$ 705607758 704519958 700505219 704987106 709540329 712389908 714545441 713506470 717571259
1681.9G17571259P516784N15137j5295334M959259Q994751M480667Q30155K202606
$$ 717571259 725088043 725603180 710307846 715267105 724261856 728742523 729572678 731775284
1689.6G31775284P09686L053665L289643L487777N848999M039307r415512L878326
$$ 731775284 732484970 735538635 738828278 742316055 748165054 752204361 742788849 746667175
1697.3G46667175Q097458P767182m221268j1334610J2101288P757797L251724O85883
$$ 746667175 754764633 762531815 758310547 746975937 759077225 766835022 770086746 770772629
1705G70772629J458969r93881K062835M839020J711731K05460K547760L239517L112335
$$ 770772629 772231598 771237717 773300552 778139572 779851303 780056763 782604523 785844040 788956375
1713.7G88956375j521835p07092O217880K009277j4465866M179840N726318K656098
$$ 788956375 787434540 786727448 792945328 794954605 780488739 784668579 790394897 793050995
1721.4G93050995J842117k87247p79571J514282J078644M72717J309738K933274j888962
$$ 793050995 794893112 794605865 793826294 795340576 796419220 796891937 798201675 801134949 799245987
1730.1G99245987j374207N659027L745270p601242j0069351P605667N200882J593247
$$ 799245987 797871780 803530807 807276077 799674835 789605484 797211151 802412033 804005280
1737.8H04005280L160629l480988m322052O337967L544159k919845J52893M284057
$$ 804005280 807165909 803684921 799362869 805700836 809244995 806325150 806478043 810762100
1745.5H10762100K613526J362533l18680l34015M678040k653427k841721N504990K642212
$$ 810762100 813375626 814738159 814419479 814085464 818763504 816110077 813268356 818773346 821415558
1754.2H21415558K511139K522812l585816P67441K680512K496871L322754n997848
$$ 821415558 823926697 826449509 822863693 823631134 826311646 828808517 832131271 826133423
1761.9H26133423k163086M202042J515045Q82415K321320O44531m676056L875885O134491
$$ 826133423 823970337 828172379 829687424 830569839 832891159 833535690 828859634 832735519 838870010
1770.6H38870010j60446q339996l736496O525650J808166k519149K312545J180268
$$ 838870010 838709564 830369568 826633072 833158722 834966888 832447739 834760284 835940552
1778.3H35940552J542434n68389l213044J379395K485199J539764j921615r27277K010269
$$ 835940552 837482986 836914597 833701553 835080948 837566147 839105911 837184296 836257019 838267288
1787H38267288L50418P71256K096786M8065n86471n440903n35965N468827J125640
$$ 838267288 838617706 839388962 841485748 841533813 840947342 835506439 834970474 840439301 841564941
1795.7H41564941k075119J311264K624054j190796k322235J836701j520920l4714K173538
$$ 841564941 839489822 840801086 843425140 842234344 839912109 841748810 840227890 840193176 842366714
1804.4H42366714M2115L67279J74179m10233J434708J202316k329559n26505P46689
$$ 842366714 842408829 842776108 842950287 842540054 843974762 845177078 842847519 842321014 843067703
1813H43067703K68097K10724l04642O33011q63724L17231J417236j0376P58133k32239
$$ 843067703 843335800 843546524 843241882 843874893 843011169 843328400 844745636 844735260 845493393 845261154
1822.7H45261154J819916J702805n359345l51791L212890K673950j235351q037415
$$ 845261154 847081070 848783875 843424530 843072739 846285629 848959579 847724228 839686813
1830.4H39686813K202454L528748J30157M57001O91528J018448n72128j280289P49588
$$ 839686813 841889267 845418015 845548172 846005173 846696701 847715149 847143021 845862732 846612320
1839.1H46612320l4714N04914P96661K704544l28598r369507L527374M040223m65165
$$ 846612320 846577606 847082520 847879181 850583725 850255127 840885620 844412994 848453217 847988052
1847.8H47988052j148910O47125R73892r9640P1259m71573k18658k50626O8131P19680
$$ 847988052 846839142 847486267 848460159 848360519 848431778 847960205 847741547 847490921 847559052 848278732
1857.4H48278732K26364J07804l77197K97088K2507J34506K27661K40936R67484j29471
$$ 848278732 848505096 848612900 848235703 848532791 848555298 848689804 848917465 849158401 850125885 849996414
1867.1H49996414N11017k948761l388214K298202K070237P35244l0670L49732K36892
$$ 849996414 850507431 847558670 844170456 846468658 848538895 849274139 849243469 849593201 849830093
1875.7H49830093o2103m96826n41382J7166j38321L56675j21155J28174o2943j58157
$$ 849830093 849767990 849271164 848729782 848746948 848608627 848965302 848844147 848972321 848909378 848751221
1885.4H48751221P38830O61545K162552p00913m496688R46121J320267k83966O75354
$$ 848751221 849490051 850151596 852314148 851613235 847116547 848062668 849382935 849098969 849774323
1894.1H49774323n59617j255264Q49381N27649K66723M19007n0889j97219j19706O1112
$$ 849774323 849214706 847959442 848808823 849336472 849603195 850022202 849971313 849774094 849654388 849715500
1903.7H49715500p64923k23923N79224K6703J04141K6245j119843N8213J419220j15967
$$ 849715500 848950577 848726654 849305878 849332581 849436722 849462967 848343124 848401337 849820557 849704590
1913.3H49704590J17416j71203N33905J652984l992538j700669K007370J196061J179733
$$ 849704590 849822006 849650803 850184708 851837692 847845154 846144485 848151855 849347916 850527649
1922H50527649k168045j394730J489258N77164J78451L46299k11106m16260k08206
$$ 850527649 848359604 846964874 848454132 849031296 849209747 849556046 849344940 848928680 848720474
1930.7H48720474k37121k90985m70810k7619K53601L88565J86081J56327J81045p553
$$ 848720474 848483353 848192368 847721558 847693939 847947540 848336105 848522186 848678513 848859558 848852005
1940.3H48852005J565475j138916l606414J575241J052856r45816l62472M66461O09970
$$ 848852005 850417480 849278564 845672150 847247391 848300247 847354431 846991959 847458420 848068390
1949H48068390K8992j66626j39695L37067L43018m16336p23496j57776k05917m17023
$$ 848068390 848097382 847930756 847791061 848128128 848471146 848054810 847331314 847173538 846967621 846550598
1958.7H46550598L41721K59247p2861j97296K78701R54514O66351L4638j495896j108474
$$ 846550598 846892319 847151566 847078705 846881409 847160110 848114624 848780975 848815613 847319717 846211243
1968.3H46211243L64380r7886j66320J83563l2349j97143N1574O59485O20957o8894
$$ 846211243 846575623 846477737 846311417 846494980 846462631 846265488 846317062 846976547 847597504 847528610
1978H47528610l80554l84598j44424k24838q10318n52903M197N0888K51922L14560
$$ 847528610 847148056 846763458 846619034 846394196 845583878 845030975 845035172 845086060 845337982 845652542
1987.6H45652542l88565j83029J734314Q72650k558823j051330N66177k9983j75553
$$ 845652542 845263977 845080948 846815262 847687912 845129089 844077759 844643936 844613953 844438400
1996.3H44438400k90222l6774j08413J61819M06799K70539O72607j27029p99790p74993
$$ 844438400 844148178 844111404 844002991 844164810 844571609 844842148 845514755 845387726 844587936 843812943
2005.9H43812943k36969L07235l60565r7656K27966o7978J00556L72619J26496j29548
$$ 843812943 843575974 843883209 843522644 843424988 843652954 843584976 843685532 844058151 844184647 844055099
2015.6H44055099q5220m85535l68347n61294j75705J86691m74701k30942j92718K69775
$$ 844055099 843969879 843484344 843115997 842554703 842378998 842565689 842090988 841860046 841667328 841937103
2025.2H41937103O25305Q7357n8670M0054m8828l70865n2261l83835m10004N1270j90811
$$ 841937103 842562408 842649765 842591095 842631149 842582321 842211456 842159195 841775360 841365356 841416626 841225815
2035.8H41225815l19290m33350K76184P08389O38962k47955o95877j37558n92270P172
$$ 841225815 840906525 840473175 840749359 841457748 842096710 841848755 841152878 841015320 840423050 840430222
2045.5H40430222j6480m79202j09101J6556J09024l02353Q6670J40992O2942J00403
$$ 840430222 840413742 839934540 839825439 839841995 839951019 839648666 839735336 839876328 839939270 840039673
2055.1H40039673p9880J16501m87824l90243k50702k21100p1411j57852N47409K66266
$$ 840039673 839959793 840076294 839588470 839198227 838947525 838726425 838655014 838497162 839044571 839310837
2064.7H39310837o71997l86582J87531m4480q9645m86679q79745q4763l73764o21567
$$ 839310837 838638840 838252258 838439789 838395309 838305664 837818985 836939240 836854477 836480713 835859146
2074.4H35859146l11127j28555K98386Q9493L9367J84021M349k59399k60315k66343
$$ 835859146 835548019 835419464 835717850 835807343 835846710 836030731 836035080 835775681 835515366 835249023
2084H35249023m99115n49316k37350q1864R92K04773k77405J94016M84161j70059n7450
$$ 835249023 834749908 834200592 833963242 833881378 833882370 834087143 833809738 834003754 834487915 834317856 834260406
2094.6H34260406j02920K30103M1885k63596K289j68991K81906N38788J65329p2937
$$ 834260406 834157486 834387589 834429474 834165878 834168167 833999176 834281082 834819870 834985199 834912262
2104.3H34912262K68707M10919J62278J2359j76162k33078n86548k03781K41546J31684
$$ 834912262 835180969 835591888 835754166 835766525 835590363 835357285 834770737 834566956 834808502 834940186
2113.9H34940186J09787L82843O30111m8752n0735K54440L95050n2108o89927k73513
$$ 834940186 835049973 835432816 836062927 836014175 835963440 836217880 836612930 836560822 835870895 835597382
2123.6H35597382n78461k42081J70441j58081n7984k00271J70975M83932K51617M8752
$$ 835597382 835018921 834776840 834947281 834789200 834731216 834530945 834701920 835185852 835437469 835486221
2133.2H35486221M578k24838l49274N4398J86538r4909k33231R6512J55105K33384
$$ 835486221 835490799 835265961 834916687 834971085 835157623 835062714 834829483 834925995 835081100 835314484
2142.9H35314484K31323M50821M66080l84446k00653j02691m6158P8430l1128J90964
$$ 835314484 835545807 835996628 836462708 836078262 835877609 835774918 835728760 835807190 835776062 835967026
2152.5H35967026R15L24097K29721J14594N6839k65809l05J57547L70865j93481k80304
$$ 835967026 835967941 836292038 836521759 836636353 836693192 836427383 836427078 836584625 836955490 836762009 836481705
2163.1H36481705J4724J5030J39389k08358p096j09100o9656P0953k7695j56326m54941
$$ 836481705 836496429 836511459 836650848 836442490 836435394 836326294 836256638 836327591 836299896 836143570 835688629
2173.7H35688629k7923j28327o6986m806k45285k04010n9433M72717K33459K22779
$$ 835688629 835660706 835532379 835465393 835460587 835215302 835011292 834951859 835424576 835658035 835880814
2183.4H35880814K66800K9296j17950k53067Q1100l03878k27585K14157K28500M63639
$$ 835880814 836147614 836176910 836058960 835805893 835886993 835583115 835355530 835569687 835798187 836261826
2193H36261826J93176N9814N72815N53665L0518P63j50299r0103O2408j05209L3035
$$ 836261826 836455002 836514816 837087631 837641296 837671814 837672577 837522278 837432175 837494583 837389374 837422409
2203.6H37422409J62048Q3237k32010L71323O07300M0359k3727k23084l9673r1552
$$ 837422409 837584457 837667694 837435684 837807007 838414307 838454666 838430939 838207855 838168182 838076630
2213.3H38076630k00272o5613J86386K70691j24283l0822j831J02844J11084K24609
$$ 838076630 837876358 837810745 837997131 838267822 838143539 838112717 838110886 838213730 838324814 838549423
2222.9H38549423J14670k76489k62299m26330M1351p9117j56479L21274J24817j88065
$$ 838549423 838664093 838387604 838125305 837698975 837740326 837661209 837504730 837826004 837950821 837762756
2232.5H37762756k58636L85971J58691j23748j6251r2773J23367q5602j40610k41317
$$ 837762756 837504120 837890091 838048782 837925034 837908783 837816010 837939377 837853775 837713165 837471848
2242.2H37471848n2338j99967j16043K47040J02081K98996k35443p0495r4300l78723
$$ 837471848 837419510 837219543 837103500 837350540 837452621 837751617 837516174 837445679 837351379 836972656
2251.8H36972656J49689J0605J6174p0419L2730k7161J23368J11007j87759K63595
$$ 836972656 837122345 837132950 837149124 837078705 837111435 837084274 837207642 837318649 837130890 837394485
2261.5H37394485J17341J19094k14843o2485K23617k83966j57241J3122M12445j602
$$ 837394485 837511826 837630920 837416077 837353592 837577209 837293243 837136002 837149124 837561569 837559967
2271.1H37559967j75400J5946n6839j5946j04065N15595O6833m39300k69013J70212
$$ 837559967 837384567 837400513 837343674 837327728 837223663 837739258 837806091 837366791 837097778 837267990
2280.8H37267990K76108J4114J84098m16718O8131j50223o18439J97754M98047N17883
$$ 837267990 837544098 837558212 837742310 837325592 837393723 837243500 836625061 836822815 837320862 837838745
2290.4H37838745l94211k11792l22952j73111O39267J08032j70669o35605K17361L49503
$$ 837838745 837444534 837232742 836909790 836736679 837375946 837483978 837313309 836677704 836895065 837244568
2300H37244568J17569K66571k52304O1035n53131J02386O8589m06342J29852l47900
$$ 837244568 837362137 837628708 837376404 837437439 836884308 836986694 837055283 836648941 836778793 836430893
2309.7H36430893O5460l33481J89591q316p85828j92261j54876Q11615j57700p13577
$$ 836430893 836496353 836162872 836352463 836344147 835558319 835366058 835211182 836022797 835865097 835151520
2319.3H35151520R2392j5564j08719n23987k75497k36664M97360P75909L60032p95136
$$ 835151520 835243912 835228348 835119629 834595642 834320145 834083481 834580841 835356750 835716782 834921646
2329H34921646j488342l23868J373k05688r38797O48041J304550k18125k48870K94952
$$ 834921646 833433304 833109436 833110809 832905121 831966324 832614365 833918915 833700790 833451920 833746872
2338.6H33746872K8610j697388m75997M30679J072540J008530j233521K48795j81351
$$ 833746872 833775482 832078094 831602097 832032776 833105316 834113846 832880325 833129120 832947769
2347.3H32947769P73544L556138J980667j395722j446075r4147j70746j258621o20804
$$ 832947769 833721313 837277451 839258118 837862396 836416321 836322174 836151428 834892807 834272003
2356H34272003M50897q54034m77524o71615j664734p2708p10679K55051J872025J076278
$$ 834272003 834722900 833868866 833391342 832719727 831054993 830982285 830271606 830526657 832398682 833474960
2365.6H33474960M02069p21511l41568N59692K93732j4572O28738P43332j9989k45896
$$ 833474960 833877029 833155518 832813950 833373642 833667374 833652802 834281540 835024872 835004883 834758987
2375.3H34758987L03116Q01850L44085K21176M19236J62735J42898P05414M80347k53678
$$ 834758987 835062103 835863953 836208038 836429214 836848450 837011185 837154083 837859497 838339844 838086166
2384.9H38086166J58539K68021j06735k47956j49002K01187K24152J49231j35269k12860
$$ 838086166 838244705 838512726 838405991 838158035 838009033 838210220 838434372 838583603 838448334 838235474
2394.6H38235474j068K43530N7449k13089p5531n18265k98767K04773J20011L4027
$$ 838235474 838234406 838477936 838535385 838322296 838246765 837728500 837429733 837634506 837754517 837788544
2404.2H37788544o1951L0670j17035J40076J93481j24740k81067m91333m39148l91083
$$ 837788544 837726593 837757263 837640228 837780304 837973785 837849045 837567978 837076645 836637497 836246414
2413.8H36246414L91388M90723k41013p934K72140L75672j2818m65393j92795j9455
$$ 836246414 836637802 837128525 836887512 836879578 837151718 837527390 837514572 837049179 836856384 836836929
2423.5H36836929j67236k86560l68500j00860L68042M28085J92947k36435j70364k57111
$$ 836836929 836669693 836383133 836014633 835913773 836281815 836709900 836902847 836666412 836496048 836238937
2433.1H36238937n74340m0665K11563P8888j06278k14920k01873q545J6937m97818
$$ 836238937 835664597 835623932 835835495 835914383 835808105 835593185 835391312 835382767 835399704 834901886
2442.8H34901886o790L45688N2032M1275k88315j7776M5166n91507l10974k7237l35693
$$ 834901886 834895096 835240784 835292816 835334091 835045776 835028000 835073166 834481659 834170685 834143448 833807755
2453.4H33807755O0653L43323q6517j66474O3858K12631m1427l29132k26441J8311
$$ 833807755 833868408 834211731 834125214 833958740 834022598 834235229 834193802 833864670 833638229 833656540
2463H33656540j96076n13229j49155k5329j5640J18332J52130K26822K31933M7608
$$ 833656540 833460464 832947235 832798080 832772751 832757111 832875443 833027573 833254395 833486328 833533936
2472.7H33533936o44303o87713l34778l07999l3646p5225j67694L71627P13501R0180
$$ 833533936 832889633 832201920 831867142 831559143 831525497 831450272 831282578 831654205 832367706 832457886
2482.3H32457886k31324j32751k80228j40991k45743n98526n93338k06680R2468K03019
$$ 832457886 832226562 832093811 831813583 831672592 831426849 830828323 830234985 830028305 830120773 830323792
2492H30323792j8921j41373M43039K60620l29742k11640O3324j65558n20172k70462
$$ 830323792 830304871 830163498 830606537 830867157 830537415 830325775 830389099 830223541 829703369 829432907
2501.6H29432907o2866M883j40305j56708k8762R9792L15018r1553p0877K060k98309
$$ 829432907 829370041 829374924 829234619 829077911 829049149 829148941 829463959 829372406 829301529 829303589 829005280
2512.2H29005280l62397l78570m9286N5847k136k36740R1171O73675n4092m10690q0796
$$ 829005280 828642883 828264313 828215027 828270874 828268738 828031998 828123169 828796844 828742752 828332062 828251266
2522.8H28251266j4572k17209o21490m27704K80533K08054m93317k89230L35464K61078
$$ 828251266 828236694 828019485 827397995 826970291 827250824 827458878 826965561 826676331 827011795 827272873
2532.5H27272873j83868j11313J27563K0294l585k45896l86581m01383k87246l1815
$$ 827272873 827089005 826977692 827105255 827125549 827121964 826876068 826489487 826088104 825800858 825769043
2542.1H25769043j11771o6986k4872L55912L94668k85034l06015k20947L1585J84021
$$ 825769043 825657272 825590286 825565414 825921326 826315994 826030960 825724945 825503998 825535583 825719604
2551.7H25719604l94973m32129M0588L54843L38288j41983m96140n2948K99683j99509
$$ 825719604 825324631 824892502 824933090 825287933 825626221 825484238 824988098 824935150 825234833 825035324
2561.4H25035324j47171R8648l89480m99802k71912j64261j18255L11889M01307k83432
$$ 825035324 824888153 824986801 824597321 824097519 823825607 823661346 823543091 823854980 824256287 823972855
2571H23972855j45188m4632k62909J5259J76468O3782l72162n47180n27344n5847K92892
$$ 823972855 823827667 823783035 823520126 823535385 823711853 823775635 823403473 822856293 822328949 822273102 822565994
2581.6H22565994k1057R7351l7613K5482J9989k37426K4414j56250k57263l68729j25961
$$ 822565994 822544937 822642288 822604675 822630157 822650146 822412720 822437134 822280884 822023621 821654892 821528931
2592.2H21528931O4926o56052n71213k7542M07715M74472J22833q9492k84195j46332
$$ 821528931 821593857 820937805 820366592 820339050 820746765 821221237 821344070 821254578 820970383 820824051
2601.9H20824051m60968n22385o9351n86395l97110K83584q5678o4087N9739n7984
$$ 820824051 820363083 819840698 819771347 819184952 818787842 819071426 818985748 818921661 818981400 818923416
2611.5H18923416N01175L90091n43060n10788k41242n55038n28717k16751J38015N5848
$$ 818923416 819424591 819814682 819271622 818760834 818519592 817964554 817435837 817219086 817357101 817412949
2621.2H17412949o0730L19671J52970M9209j94015n73044k70844j28097p0496m33502
$$ 817412949 817352219 817671890 817824860 817874069 817680054 817107010 816836166 816708069 816637573 816204071
2630.8H16204071o79855m21906j62048Q3084q3389M7607L32871N38406M654p31659
$$ 816204071 815524216 815102310 814940262 815023346 814939957 814987564 815320435 815858841 815863495 815131836
2640.5H15131836l13492l38135m67834k74506l47595k04010K55356L18222j42059l5248
$$ 815131836 814818344 814480209 814012375 813737869 813390274 813186264 813441620 813759842 813617783 813582535
2650.1H13582535K3346r1553k90909l62167l24326o14013k24533k96402j45417M00696
$$ 813582535 813605881 813514328 813223419 812861252 812536926 811922913 811698380 811401978 811256561 811657257
2659.8H11657257j13678j71051J18866K70233J6327m79965n41153j12839J70517n36041
$$ 811657257 811543579 811372528 811491394 811761627 811777954 811297989 810756836 810643997 810814514 810278473
2669.4H10278473n24445k7160j57929N1041K59704l662j42822K23770J72501l25928
$$ 810278473 809754028 809726868 809568939 809619980 809879684 809876022 809733200 809956970 810129471 809803543
2679H09803543k95181k99301n41764l99093m00315l30276j59836k29340K57493M62799
$$ 809803543 809508362 809209061 808667297 808268204 807867889 807537613 807377777 807148437 807405930 807868729
2688.7H07868729N19485J43738p11289m32663n03158m01077o4698n63202k36816J77460
$$ 807868729 808388214 808531952 807820663 807388000 806884842 806483765 806419067 805855865 805619049 805796509
2698.3H05796509r384J55029K98767n2567k72521o57959m25339M72946j14059o95725
$$ 805796509 805787125 805942154 806240921 806188354 805915833 805257874 804832535 805305481 805191422 804495697
2708H04495697m99725j15738N340k77939J25275J19705k4719j9913l6468Q8348m41131
$$ 804495697 803995972 803880234 803885574 803607635 803732910 803852615 803827896 803807983 803771515 803859863 803418732
2718.6H03418732m65317k68707o43769o57653j08262K47345Q4763o1111j32676q2626
$$ 803418732 802953415 802684708 802040939 801383286 801275024 801522369 801607132 801546021 801413345 801330719
2728.2H01330719l2730n6305l44772q06733m43038K67105j51749n87540n9890j19477
$$ 801330719 801297989 801241684 800896912 800090179 799647141 799914246 799762497 799174957 799115067 798995590
2737.9G98995590P4005M31519o9351L4942L5324l99856m25644k09580k29415m92859
$$ 798995590 799069595 799501114 799431763 799466705 799502029 799102173 798676529 798466949 798237534 797744675
2747.5G97744675k09961L6468k03476j28555N875k42920Q1100K36206k47421j56555
$$ 797744675 797534714 797571182 797367706 797239151 797245026 797002106 797083206 797319412 797071991 796915436
2757.2G96915436k77939o36673o43768l17078k09579l13111N9052J59759K19651J24435
$$ 796915436 796637497 796000824 795357056 795039978 794830399 794517288 794576340 794736099 794955750 795080185
2766.8G95080185O1264M3716m23050l85131n39551o26984l42026l74069l79562k29950
$$ 795080185 795141449 795185165 794762115 794376984 793837433 793210449 792868423 792494354 792114792 791884842
2776.4G91884842J98975J98059q316J08947k62069p04117k52457l11966q22754k25296
$$ 791884842 792083817 792281876 792273560 792382507 792120438 791416321 791163864 790851898 790029144 789803848
2786.1G89803848p8582k72370k76260k47269K48489N036l32489j89285n3101l63922
$$ 789803848 789725266 789452896 789176636 788929367 789177856 789182892 788850403 788661118 788608017 788244095
2795.7G88244095p52793m11376m67148o04096l59802k04391j43052R0027J77231k91290
$$ 788244095 787491302 787079926 786612778 786008682 785648880 785444489 785301437 785391464 785568695 785277405
2805.4G85277405j6632n0507o76117n28717o44073p00913m20074n59388p63549n39780
$$ 785277405 785260773 785210266 784534149 784005432 783361359 782660446 782240372 781680984 780917435 780377655
2815G80377655j63040J04599M14276M81949n7831j013870r44901k54821l89176p94449
$$ 780377655 780214615 780319214 780733490 781215439 781157608 780143738 779198837 778944016 778554840 777760391
2824.7G77760391j018371m05960J20773k78473n12772l66516K85950P1411r60617q68912
$$ 777760391 776742020 776336060 776456833 776178360 775665588 775299072 775585022 775656433 774695816 773826904
2834.3G73826904m69360n63278p81555q20237r94644r53750o43082j065140r88159
$$ 773826904 773357544 772794266 772012711 771192474 770197830 769244080 768600998 767535858 766547699
2843G66547699m41666o49032j040802j081543j273346k060089k027130j456528j160202
$$ 766547699 766106033 765457001 764416199 763334656 762061310 760001221 757974091 756517563 755357361
2851.7G55357361o71234m12751J01853M84466K57264N4550n0431K25525K47498o02646
$$ 755357361 754686127 754273376 754375229 754859695 755116959 755171509 755121078 755346603 755594101 754991455
2861.3G54991455j201324n33905p9499l98864l04795k65198j94244m50287r42917o02569
$$ 754991455 753790131 753256226 753176727 752777863 752473068 752207870 752013626 751563339 750620422 750017853
2870.9G50017853m56314l90320k00882m29077n35355l58124q0948l92150q76542m93621
$$ 750017853 749561539 749171219 748970337 748541260 748005905 747647781 747566833 747174683 746298141 745804520
2880.6G45804520P4005L9215r9182j0300m44183n14298p5683r15757j405334n93491
$$ 745804520 745878525 745917740 745818558 745808258 745364075 744849777 744774094 743858337 742453003 741859512
2890.2G41859512k62527k89230l59803o12106o88248n11551m89425l29209N4703n38483
$$ 741859512 741596985 741307755 740947952 740335846 739647598 739136047 738646622 738317413 738372116 737833633
2899.9G37833633q54797l04794o30646p42264n48401q12149k67029K71912p6599m91867
$$ 737833633 736978836 736674042 736043396 735301132 734752731 733940582 733673553 733945465 733868866 733376999
2909.5G33376999o35910n97992n12467l43093o26297j018372q25043q21685p56836
$$ 733376999 732741089 732143097 731630630 731287537 730661240 729642868 728817825 727996140 727239304
2918.2G27239304m03443n46646r38873n78156j16348n24979k61001L93066J79596R2697
$$ 727239304 726835861 726289215 725350342 724772186 724655838 724130859 723869858 724262924 724442520 724535217
2927.8G24535217J62201r9563l01438k27356j92489J25885M66003J35574N4245L13034
$$ 724535217 724697418 724597855 724296417 724069061 723876572 724002457 724468460 724604034 724658279 724971313
2937.5G24971313M93927N97764O46591N62896J27106J12381J48316p8965J24970K07443
$$ 724971313 725465240 726063004 726709595 727272491 727399597 727511978 727660294 727581329 727706299 727913742
2947.1G27913742J17645L0899j04904l5019l81698q61283m86984k1439M349n50689
$$ 727913742 728031387 728062286 727957382 727922363 727540665 726679382 726192398 726170959 726175308 725624619
2956.8G25624619p65839j8158j2131J75247N84565o943k26593J95999O68945N44052
$$ 725624619 724858780 724840622 724828491 725003738 725588303 725581360 725354767 725550766 726219711 726763763
2966.4G26763763L52250N7983O7291J213455J198960N08423M47998M33578L19672K89306
$$ 726763763 727116013 727173996 727241287 728454742 729653702 730162125 730610123 731043701 731363373 731652679
2976.1G31652679P18613P08771N61981N73273N49545L53622J55640O54984Q51898P98797
$$ 731652679 732371292 733080063 733642044 734215317 734764862 735118484 735274124 735929108 736781006 737579803
2985.7G37579803L87726K48947N00336n2414M21906P93457J76849K08283o6529o1645
$$ 737579803 737967529 738216476 738716812 738664398 739086304 739879761 740056610 740264893 740198364 740136719
2995.3G40136719L99933K49023L66135l0136n22385L68729L85894k55966l30353m12368
$$ 740136719 740536652 740785675 741151810 741121674 740599289 740968018 741353912 741097946 740767593 740355225
3005G40355225j27564P8125K09503K89612K56653J11237J25427J8692n07584n41458
$$ 740355225 740227661 740305786 740515289 740804901 741061554 741172791 741298218 741316910 740809326 740267868
3014.6G40267868p68814j67389L24173l82767l37524m59595o88095l97263K57340K24228
$$ 740267868 739499054 739331665 739655838 739273071 738935547 738475952 737787857 737390594 737647934 737872162
3024.3G37872162l22418k75574p73544l52936M58603K60849k52304j010361m60587
$$ 737872162 737549744 737274170 736500626 736147690 736606293 736867142 736614838 735604477 735143890
3033G35143890J26038l36990k59323k61918n69000k37427l40728m55170j58310l79715
$$ 735143890 735269928 734932938 734673615 734411697 733842697 733605270 733264542 732809372 732651062 732271347
3042.6G32271347j05133j51443l80631k61307p96661j058579o97784n5466q6288l87192
$$ 732271347 732166214 732014771 731634140 731372833 730576172 729517593 728819809 728764343 728678055 728290863
3052.2G28290863l99475j87225K68173m69513r67026k05765l63845r36432m22821p7134
$$ 728290863 727891388 727704163 727972336 727502823 726535797 726330032 725966187 725029755 724606934 724529800
3061.9G24529800L44620N50690o96716l85361l7384p24106l55225n92651p23038n13077
$$ 724529800 724874420 725425110 724728394 724343033 724305649 723581543 723226318 722633667 721910629 721397552
3071.5G21397552m13513k15683r4528K22168k2430l92380o6300J00403p53402p93686
$$ 721397552 720984039 720768356 720673828 720895996 720873566 720481186 720414886 720515289 719761887 718968201
3081.2G18968201k86789m41742r6741k5024m07029p36236k94190K89917j90429n21012
$$ 718968201 718681412 718239670 718142929 718117905 717710876 716974640 716680450 716970367 716779938 716258926
3090.8G16258926m87060p60040r61762l8605J91346n13230m03747l25699k01111p95670
$$ 716258926 715771866 715011826 714050064 714011459 714202805 713689575 713285828 712960129 712759018 711963348
3100.5G11963348q04367J97449k66037n55649k04315l90320j60751J43356k89078m94384
$$ 711963348 711158981 711356430 711090393 710534744 710330429 709940109 709779358 709922714 709633636 709139252
3110.1G09139252j004563j073074j24359L9673q1177q12531q06961M81491j00555j329422
$$ 709139252 708134689 707061615 706937256 706976929 706895752 706083221 705276260 705757751 705657196 704327774
3119.8G04327774m38156L40195r61914j053162k43301o24772p74917o66123L1128M52271
$$ 704327774 703889618 704229813 703267899 702214737 701971436 701346664 700571747 699905624 699936752 700389023
3129.4G00389023k54898p78961n09568p28607j131363n69534m11530l99322l79639
$$ 700389023 700134125 699355164 698845596 698116989 696985626 696416092 696004562 695605240 695225601
3138.1F95225601j85089l46298j016312m44717l74832p55768o14472m61578k54364
$$ 695225601 695040512 694694214 693677902 693233185 692858353 692102585 691488113 691026535 690772171
3146.8F90772171n81055p81097o15997k91367m25720q26492n13688n41381q45108k62757
$$ 690772171 690191116 689410019 688794022 688502655 688076935 687250443 686736755 686195374 685350266 685087509
3156.4F85087509o6376m80804j69601n06821j157150r09653n08652m97513o69403l65677
$$ 685087509 685021133 684540329 684370728 683863907 682706757 681797104 681288452 680790939 680121536 679755859
3166F79755859o90918j006622p46612n79911k60467l05252n04685n75332l98026p03201
$$ 679755859 679064941 678058319 677311707 676731796 676471329 676166077 675661392 675086060 674688034 673984833
3175.7F73984833n66712n38940j321488n33676j01318j10931m86298p86209k12631
$$ 673984833 673418121 672879181 671557693 671024017 670922699 670811768 670325470 669539261 669326630
3184.4F69326630p54242q96759j117249p22427J53503m97055o09589m15573k38266
$$ 669326630 668572388 667675629 666558380 665835953 665989456 665492401 664882812 664467239 664228973
3193F64228973k04620m43344p35931r27506r87549j099624o15998n58548m48379p99179
$$ 664228973 664024353 663581009 662845078 661917572 660930023 659830399 659214401 658655853 658207474 657408295
3202.7F57408295j098252l81N9128p38755n92956J12533o34384j108780l96728l84445
$$ 657408295 656310043 656309662 656368790 655630035 655037079 655149612 654515228 653406448 653009720 652625275
3212.3F52625275j27030r23309j327896l76206k02102k40555p82471o54526J40763
$$ 652625275 652498245 651574936 650247040 649870834 649668732 649428177 648645706 647991180 648131943
3221F48131943j80130n51224m62570n29862m36325m78592r81369j114196r11179l76587
$$ 648131943 647951813 647400589 646938019 646408157 645971832 645493240 644511871 643397675 642486496 642109909
3230.7F42109909J86310J3504m48608m57612m19006o95267o97288m44870o07224j108474
$$ 642109909 642296219 642309723 641861115 641403503 640984497 640289230 639591942 639147072 638539848 637431374
3240.3F37431374n39742Q7471J04675j21421j267395p03774P0229n30663l80669n33981
$$ 637431374 636891632 636979103 637083778 636962357 635694962 634991188 635061417 634530754 634150085 633616104
3249.9F33616104l07464m4480o75926q29811j014366q55561m30145n32074K29607N18684
$$ 633616104 633308640 633264160 632588234 631758423 630744057 629888496 629458351 628926277 629155884 629674568
3259.6F29674568p37037j173630o39191L548l30887l95126K327p13768o08216o68030
$$ 629674568 628937531 627763901 627124710 627128258 626797371 626402245 626404572 625690804 625082588 624414558
3269.2F24414558m79736p0534l19099l34816j171951k04506J58806r83544j39160K5635
$$ 624414558 623934822 623864288 623545189 623210373 622038422 621833916 621992722 621009178 620870018 620895653
3278.9F20895653m74167o53191o86149l89519L5934j69639o79207m79126n96237n13573
$$ 620895653 620421486 619768295 619082146 618692627 618728561 618558922 617879715 617400589 616804352 616290779
3288.5F16290779o3362K28958k73971r03893q82034q77877k41241q4267k58331l78723
$$ 616290779 616227417 616456375 616182404 615278511 614396477 613518600 613277359 613193092 612934761 612556038
3298.2F12556038n17502l98979j91307p7248p65800o43311m71687k86865L5476l27110
$$ 612556038 612038536 611639557 611448250 611371002 610605202 609961891 609490204 609203339 609238815 608911705
3307.8F08911705l91998r34716n94825k33040m58450o86112l92074n3788j617088p95174
$$ 608911705 608519707 607584991 606990166 606757126 606298676 605612564 605220490 605166702 603549614 602754440
3317.4F02754440M89388o16455p42836j72119j46790q44574o44874o57425p15142m63028
$$ 602754440 603243828 602627373 601884537 601712418 601565628 600721054 600076180 599418755 598703613 598240585
3327.1E98240585o30989k30674l40119n74264j372605j070785r8687k12554p1297j005898
$$ 598240585 597609596 597378922 597038803 596464539 595091934 594021149 593922462 593709908 593638611 592632713
3336.7E92632713q61969j4076n28335j096802p25060m0741o19964o76041p06863m73900
$$ 592632713 591770744 591756668 591228333 590131531 589406471 589365730 588745766 588069725 587362862 586888962
3346.4E86888962J66130n70412j074219r95369o43081k36244l7384n12352r75457q31756
$$ 586888962 587055092 586484680 585410461 584415092 583772011 583535767 583498383 582986031 582010574 581178818
3356E81178818r33838q03299o95572l73764n14717j001091n91049j03188l03612j065635
$$ 581178818 580244980 579441681 578746109 578372345 577857628 576856537 576265488 576162300 575858688 574793053
3365.7E74793053q39043m81071o30799n91316p38945p18803n72892l93791m57420q05245
$$ 574793053 573954010 573472939 572842140 572250824 571511879 570793076 570220184 569826393 569368973 568563728
3375.3E68563728p60650K784m18205j029434J1139q0948l38821k77710o45562p21435
$$ 568563728 567803078 567805862 567387657 566358223 566369362 566288414 565949593 565671883 565026321 564304886
3384.9E64304886q53272k59285j64489l16086l25394n08690j50070p10831j164245
$$ 564304886 563451614 563192329 563027840 562711754 562386360 561877670 561727600 561016769 559852524
3393.6E59852524m08783K50053L0175r05915p24983l54996k96440K88048l5896o27251
$$ 559852524 559443741 559693794 559723969 558818054 558093071 557738075 557441635 557729683 557693787 557066536
3403.3E57066536o29768m56963j82991j45912o5918p47414q07113J3580O676J06353
$$ 557066536 556436768 555979805 555796814 555650902 555584984 554837570 554030457 554044037 554050713 554157066
3412.9E54157066k73399k98882J16845J9378l73840o08673r8915o83747n36499K11831
$$ 554157066 553883667 553584785 553701630 553721008 553347168 552738495 552639580 551955833 551419334 551631165
3422.6E51631165J34582K47879n6877M31404K21901o95000k72407P8888l90854j24474
$$ 551631165 551765747 552013626 551956749 552388153 552610054 551915054 551642647 551721535 551330681 551206207
3432.2E51206207K15340k54250L31879J97067J52169L24363k98423N0048M77944O89277
$$ 551206207 551421547 551167297 551499176 551696243 551848412 552172775 551874352 551924400 552402344 553091621
3441.8E53091621p43446l68385R26742O94084J29586k397003j15509J766624Q13217
$$ 553091621 552348175 551979790 552906532 553600616 553730202 551333199 551217690 552984314 553797531
3450.5E53797531P14874l71589M501M42772K67830K66647O66809P02172m00925j97029
$$ 553797531 554512405 554140816 554145317 554588089 554855919 555122566 555789375 556491547 556090622 555893593
3460.2E55893593L10592R38797J85433Q6327J001968K83699k27852k08168J218262
$$ 555893593 556204185 557142982 557328415 557414742 558416710 558700409 558472557 558264389 559482651
3468.8E59482651R06372j54686M54903M09355P42798N85365K6817J02120M18319K92435
$$ 559482651 560389023 560234337 560689240 561098595 561841393 562426758 562453575 562555695 562974014 563266449
3478.5E63266449P33681J354294M90417o79436p74765J139756J039428Q05245J384697
$$ 563266449 564000130 565354424 565844841 565165405 564390640 565530396 566569824 567375069 568759766
3487.2E68759766o03905n35164P46803O94390N50041J205063J040954J92261N54047
$$ 568759766 568155861 567620697 568367500 569061890 569611931 570816994 571857948 572050209 572604256
3495.8E72604256j41449L8795O97251P13806Q16230J142083P83195r03511N34439J492691
$$ 572604256 572462807 572501602 573198853 573912659 574728889 575870972 576654167 575750656 576285095 577777786
3505.5E77777786P74727Q59375J409721R9221j523743N89714Q80509J101875J016273
$$ 577777786 578552513 579411888 580821609 580920830 579397087 579986801 580867310 581969185 582985458
3514.2E82985458l6811Q65097J161003J004104J6022r7160J632347K392578J14746
$$ 582985458 582948647 583813744 584974747 585978851 585994873 585897713 587530060 589922638 590037384
3522.9E90037384j802406R37195J563148P80907N24025K55661k48261K84538J040154
$$ 590037384 588234978 589172173 590735321 591516228 592040253 592295914 592047653 592332191 593372345
3531.5E93372345R60693J402321R38988J621475O1340j044693J372757Q78487J136589
$$ 593372345 594333038 595735359 596674347 598295822 598357162 597312469 598685226 599563713 600700302
3540.2F00700302J117134J164818R20410J306420J131248q80547M33426q85200J619339
$$ 600700302 601817436 602982254 603902664 605209084 606340332 605459785 605893211 605008011 606627350
3548.9F06627350K054520J642875K256317k788582K41852J211853J776390K156220
$$ 606627350 608681870 610324745 612581062 609792480 610034332 611246185 613022575 615178795
3556.6F15178795m59442K000808P73468j70555O58570K441177J020660M40484N811996
$$ 615178795 614719353 616720161 617493629 617323074 617981644 620422821 621443481 621883965 627695961
3565.3F27695961j697540l640137r87701o14548M796333J853600K189293K171058P14493
$$ 627695961 625998421 622358284 621370583 620756035 625552368 627405968 629595261 631766319 632480812
3574F32480812j45645M90913J347733k91710K509079N86777L47709K726136J561203
$$ 632480812 632335167 632826080 634173813 633882103 636391182 636977959 637325668 640051804 641613007
3582.6F41613007J48773P01065O443634J717987m802246k010498k087784N106888L756408
$$ 641613007 641761780 642462845 648906479 650624466 645822220 643811722 641723938 646830826 650587234
3591.3F50587234L384476M58451K12478L304596l744049L203812M100265K85721K525940
$$ 650587234 653971710 654430161 654642639 657947235 654203186 657406998 661507263 661792984 664318924
3600F64318924j659241j0376K010422J292801K220154M243927K589264k804184K522659
$$ 664318924 662659683 662649307 664659729 665952530 668172684 672416611 675005875 672201691 674724350
3608.7F74724350l877564Q81501J0037002j847076k965546M169388j680603O013641
$$ 674724350 670846786 671728287 681765289 679918213 676952667 681122055 679441452 685455093
3616.4F85455093M920884j358872j27869m485092J151429M602584K726288J799545
$$ 685455093 690375977 689017105 688889236 684404144 685555573 690158157 692884445 694683990
3624.1F94683990L528367L320312K724457P273407p888718j6405792P839813Q556061
$$ 694683990 698212357 701532669 704257126 711530533 703641815 687236023 695075836 703631897
3631.8G03631897Q505173j057358m070282L647156M282303K012634p95746J899109
$$ 703631897 712137070 711079712 707009430 710656586 714938889 716951523 716155777 718054886
3639.5G18054886K761459K279740K75802R8267L577728N527191O978760n450134n150833
$$ 718054886 720816345 723096085 723371887 723470154 727047882 732575073 739553833 734103699 728952866
3648.2G28952866O939392l854828p835388P17849Q304291M947739N620041L019256
$$ 728952866 735892258 732037430 724202042 724919891 733224182 738171921 743791962 746811218
3655.9G46811218j4276581N254822O853485Q18329R60007K54898K134552K74353J120834
$$ 746811218 732534637 737789459 744642944 745461273 746421280 746676178 748810730 749085083 750205917
3664.6G50205917J596985J345139N766144K238311k107086l351669j0293121O466140
$$ 750205917 751802902 753148041 758914185 761152496 759045410 755693741 745400620 751866760
3672.3G51866760J2850189J1218491r198685l0208892R991760J2740631N522537m952698
$$ 751866760 764716949 775935440 766736755 736527863 746519623 759260254 764782791 759830093
3680G59830093O71540M524002J998977O24924q03757J183472O302796O318359j5800171
$$ 759830093 760501633 765025635 767024612 767649536 766845779 768029251 774332047 780650406 764850235
3688.7G64850235k560272P516632j2212067L907929O984710n60073J392440K92359
$$ 764850235 762289963 769806595 757594528 761502457 768487167 767927094 769319534 769611893
3696.4G69611893M41589J030426O74439L881988K121201j0254517j516342P425232
$$ 769611893 770053482 771083908 771758347 775640335 777761536 767507019 765990677 773415909
3704.1G73415909J507950J26953P19070M117737L239975j0579605P030716O63910j7553635
$$ 773415909 774923859 775050812 775769882 779887619 783127594 772547989 779578705 780242615 762688980
3712.8G62688980Q555451N101470K35978J479492L451004k78168n689468L250427P380066
$$ 762688980 771244431 776345901 776581879 778061371 781512375 781234207 775544739 778795166 786175232
3721.5G86175232p792816n258713P762375L88946j813583m453354J566315N613022
$$ 786175232 778382416 773123703 780886078 781275024 779461441 775008087 776574402 782187424
3729.2G82187424K262726P350769q363190p915573J2506866m646530j2969360K734070
$$ 782187424 784450150 791800919 783437729 775522156 788029022 783382492 770413132 773147202
3736.9G73147202L927688K44904L785629L957443l582916P050705J2224502k8551788
$$ 773147202 777074890 777319794 781105423 785062866 781479950 788530655 800755157 772203369
3744.7G72203369j2508392J8067322R307632P422485q726577q950272J4281006j7903214
$$ 772203369 759694977 777762299 787069931 794492416 785765839 776815567 791096573 773193359
3752.4G73193359p210540J1061630Q314285K987595q482514N055390M711303j4623336
$$ 773193359 765982819 777044449 785358734 788346329 779863815 784919205 789630508 775007172
3760.1G75007172L69033O947327K081604J596527M614029o129608o554642N986786
$$ 775007172 775376205 782323532 784405136 786001663 790615692 784486084 777931442 783918228
3767.8G83918228P118836k910996j3940124M087600M395295O08749J147079l20129
$$ 783918228 791037064 788126068 774185944 778273544 782668839 783277588 784424667 784104538
3775.5G84104538J720657J425171L222809m158478j0836639N289307L434219K581940
$$ 784104538 785825195 787250366 790473175 786314697 775478058 780767365 784201584 786783524
3783.2G86783524K147750n859832j217118J536484R60999J09329n42450O20117n9585
$$ 786783524 788931274 783071442 781854324 783390808 784351807 784461136 783918686 784538803 784479218
3791.9G84479218Q83483L42942K898864L684006p247619l996506M506912O672058N770188
$$ 784479218 785362701 785705643 788604507 792288513 785040894 781044388 785551300 792223358 797993546
3800.6G97993546j6861573j3481750Q525314O726914P746810L940125k0225296j347199
$$ 797993546 781131973 767650223 776175537 782902451 790649261 794589386 774364090 773016891
3808.3G73016891R796677K793884M26941M29612J51290L720856Q025589r595718j8286896
$$ 773016891 782813568 785607452 786034393 786464005 786615295 790336151 798361740 788766022 770479126
3817G70479126J1975250Q720169O411972k536010k8977051O657638Q466568M063340
$$ 770479126 782454376 791174545 797586517 795050507 766073456 772731094 781197662 785261002
3824.7G85261002L790435k323837o544342J801987M183883N138855j040649j1784439
$$ 785261002 789051437 786727600 780183258 781985245 786169128 791307983 790267334 778482895
3832.4G78482895P143555P657623j0548782L162689J0182876j7376098j324768J0825882
$$ 778482895 785626450 793284073 782735291 785897980 796080856 778704758 777379990 788205872
3840.1G88205872j0404053K100754P922744o556091l610611N647736K190323O37817
$$ 788205872 777801819 779902573 787825317 781269226 777658615 783306351 785496674 786134491
3847.8G86134491K871475j505661M568100Q125916j0322571p992783k7787933J4942627
$$ 786134491 789005966 787500305 792068405 800194321 789871750 781878967 754091034 769033661
3855.6G69033661J5302429l029861r89991M131928M310760J811600q000564K266693
$$ 769033661 784336090 781306229 780316238 784448166 788758926 790570526 782569962 784836655
3863.3G84836655O407241j4291000m282150R341049R473267P576065j8627930j1672211
$$ 784836655 791243896 776952896 772670746 782011795 791485062 799061127 780433197 768760986
3871G68760986R399109J0045624N77316j6127166N202407O154404J035233M478912
$$ 768760986 778160095 788205719 788783035 772655869 777858276 784012680 785047913 789526825
3878.7G89526825M727097j2982407p593384J0887680J797257L528595K013244k1992416
$$ 789526825 794253922 781271515 773678131 784565811 786363068 789891663 791904907 769912491
3886.4G69912491O154709P584381L144378N445481n730438j2225266N392609M291839
$$ 769912491 776067200 783651581 786795959 792241440 786511002 774285736 779678345 783970184
3894.1G83970184k423324K542190J785660L457031j218414j2190323R944077J8005
$$ 783970184 781546860 784089050 785874710 789331741 788113327 775923004 785867081 785885086
3901.8G85885086o060562O468201p220612l021393L55149L081131M133758l98025J18713
$$ 785885086 779824524 786292725 779072113 776050720 776405869 779487000 783620758 783222733 783341446
3910.5G83341446j35880J11847k60849K68402K910538J206131p271118k710648O532898
$$ 783341446 783205566 783317413 783056564 783324966 786235504 787441635 780170517 777459869 783992767
3919.2G83992767k380447m285660M558182K432632L49045n689926l099518M824753
$$ 783992767 781612320 777326660 781884842 784317474 784666519 778976593 775877075 780701828
3926.9G80701828K965546N98755k003708R99298K498855n121460k259979J759415O53229
$$ 780701828 783667374 784266129 782262421 783261719 785760574 780639114 778379135 780138550 780791779
3935.6G80791779J368942K40707j214218J55716Q99429K527619q1635o569137J53732
$$ 780791779 782160721 782401428 781187210 781342926 782242355 784769974 784688339 778119202 778272934
3944.3G78272934K676926K330169J149063l373794J166839j379699k536774L370056
$$ 778272934 780949860 783280029 784429092 781055298 782222137 780842438 778305664 781675720
3952G81675720j36184j075821M96902P96204p9041j373367J03607j450J458817k28043
$$ 781675720 781539536 780463715 780960617 781756821 781677780 780304413 780408020 780406570 781865387 781637344
3961.6G81637344k224731R27048L03421j5412N49469j52359M0131m13742K00729J079560
$$ 781637344 779412613 780339661 780643082 780627670 781177139 781024780 781064911 780651169 780851898 781931458
3971.3G81931458j001435j528244O92215P91016k78473l71933L58734p5073n32761
$$ 781931458 780930023 779401779 780093994 780885010 780606537 780234604 780593338 780518265 779985504
3980G79985504L42178J4115n43213K56653M70657m29382o5079K27738M05731N29632
$$ 779985504 780327682 780341797 779798584 780055237 780525894 780096512 780031433 780259171 780664902 781194534
3989.6G81194534o48269n39475n79452O42395R85794j091309M4403N35050k9221l68500
$$ 781194534 780546265 780006790 779427338 780069733 781055527 779964218 780008621 780543671 780514450 780145950
3999.2G80145950q16574
$$ 780145950 779329376
4000.2G79329376
$$ 779329376
##END=$$ End of the data block
