##TITLE=$$ Begin of the data block
##JCAMP-DX=5.00 $$ ACD/SpecManager v 10.08
##SPECTROMETER/DATA SYSTEM=Varian
##DATE=18 Dec 2012 14:02:32
##DATA TYPE=INFRARED SPECTRUM
##DATA CLASS=XYDATA
##ORIGIN=
##OWNER=
##NPOINTS=3735
##FIRSTX=399.26403809
##LASTX=4000.35498047
##MAXX=4000.35498047
##MINX=399.26403809
##MAXY=85.51384735
##MINY=37.59237289
##XFACTOR=1.0000000000
##YFACTOR=0.000000100000000
##FIRSTY=67.50138092
##DELTAX=0.96440572
##XUNITS=1/CM
##YUNITS=TRANSMITTANCE
##XYDATA=(X++(Y..Y))
399.3 675013809 687913055 705885544 718611603 722835312 720561981 716966019 720449219 732222214
407 732222214 726882935 717009659 718163757 720300293 723164062 720596313 711671143 708425140 713825912
415.7 713825912 715698318 711478043 697866592 683977280 704249496 720107117 727865448 725363083
423.4 725363083 720874939 717961578 712733078 709720688 712866440 716822510 715312805 713468170
431.1 713468170 715710220 720970840 719315109 714270248 712873230 709381714 709608688 711771927 717078018
439.8 717078018 719395370 716331711 716661224 715367966 715276947 714674149 714944077 716928635 715220184
448.4 715220184 710765991 709394073 715840607 717262955 709268188 702904434 706903000 715001755
456.2 715001755 711428833 701707993 704228745 711341782 712723618 709345169 709872589 711037750 709645996
464.8 709645996 703575439 705222015 703405228 698261642 704451981 708495407 712031937 704154358
472.6 704154358 695990601 701089554 704515305 707995377 708806381 707709808 710569077 715678482 714020309
481.2 714020309 712556534 716389236 715211182 710949936 707810516 707971954 708122253 705300446 706752930
489.9 706752930 708923950 707009888 708393173 712056503 709960937 708478165 711732635 714122086
497.6 714122086 713144073 711355057 710927811 710528336 710568314 709040604 708640137 710342178 711658096
506.3 711658096 710571442 706821060 707118759 708156967 706325226 702977448 699127274 699880295 703961258
515 703961258 706107788 703539658 701156082 699764862 695992889 696982193 699405899 698537903 696309204
523.7 696309204 696173706 697997665 696981812 696467590 697363586 697307968 698470459 701070404 701228180
532.4 701228180 698428802 695741501 696482849 698373947 696496048 694106369 694478302 697002869 699567184
541 699567184 700518570 701042328 701447296 702491608 702147064 699938660 698890076 699649734 699902954 699302444
550.7 699302444 701162109 703247299 703989639 703190155 702371597 703745728 703700256 702371750 701580734
559.4 701580734 701345062 700848541 700479813 701373749 701255264 702382431 704129486 704214249 703982468 702958984
569 702958984 703212051 704130249 703579025 702730026 702168503 702818222 702935410 701137695 699835739 699103622
578.6 699103622 699646835 700351181 699978027 701727066 703104248 700845947 698556900 698890533 700790558
587.3 700790558 700879669 699860382 701084671 701916962 701386566 702425613 703095093 701478958 700578690
596 700578690 700350342 698922653 698286057 697702560 696050797 694171371 692128830 691353989 689980850
604.7 689980850 686493073 682819748 679002762 674084320 667178879 659073029 649814529 638945580
612.4 638945580 628500252 621028290 615352287 613378181 614408455 614258003 613928795 610248985 604498711
621.1 604498711 598403397 592189713 588358536 589381142 598098793 609579659 621958542 633374901
628.8 633374901 644133606 652542725 656855011 658182755 655828781 652680206 647485657 640954666
636.5 640954666 635370827 630947609 629808044 632375412 640540161 651788330 664904099 677427216
644.2 677427216 687849274 696750336 704157257 708953552 710396576 711225433 713089523 715333405
651.9 715333405 718285675 720027542 720796967 722072678 722604523 723674850 725438538 727305222 728017883
660.6 728017883 728057861 728804321 729108963 730054855 730769882 732357254 731091995 717304764 726585159
669.3 726585159 732447968 733255768 733663635 734828644 736125412 736152802 736394348 736344681 736707611 736658707
678.9 736658707 735708084 737315445 739338760 739749298 739406357 738844147 738027344 737631454 737449875
687.6 737449875 736099472 734819794 733582916 731798248 730441589 730046463 729927216 729611206 729700546
696.3 729700546 729476395 728903809 727968369 726982117 726832581 726195526 725776367 725974503 725901642 727315140
705.9 727315140 729030075 729908600 731512680 732675629 733546677 735022812 735623474 735689926 736231461
714.6 736231461 737296753 738734894 740082474 740896225 742044144 744387817 746829758 748051910 748339310
723.3 748339310 748952942 748498154 747092438 745881271 744860458 745109100 744664230 743748169 744013824
732 744013824 744400635 744631500 744552994 744406509 744834900 744796143 742841797 741649628 742221909 741947784
741.6 741947784 740817337 740329361 741303940 742819366 745364990 749052887 751755905 753277969 754574051
750.3 754574051 756202621 757493820 759058838 760582962 761281281 762243195 764566193 768271179 770782547
759 770782547 772302246 773648911 774794006 774823380 773032837 772266541 771865082 770723267 769617462
767.7 769617462 769153290 769225998 769625626 770105820 770468063 772089005 773477631 774425278 775314713 774941254
777.3 774941254 774201050 774820404 777012177 778643646 781278915 784137421 785531311 786980057 787965088
786 787965088 788849258 788772659 788655319 788506165 788388596 788857269 787985306 787044067 786952744 788201370
795.6 788201370 789729996 791285248 793400650 793858871 792480011 791118927 790801163 789396515 787683487
804.3 787683487 786609879 786204605 787682114 789687500 791192169 792057266 793274307 793657837 792886047
813 792886047 792154999 791885986 792059326 791212540 791029053 791021500 790983505 791199722 791364365 792548218
822.6 792548218 793460007 794248505 793796234 792369156 790155258 787830429 786350632 783500519 780662689
831.3 780662689 777842865 775533600 774107742 773258743 772460709 769720764 767389069 765091095 762674942
840 762674942 760772171 757989044 755453262 752809219 751105347 751697617 752974548 753468781 753235016
848.7 753235016 754450989 756529617 757653198 758628769 760020447 761499786 763491211 765958405 767931366
857.4 767931366 769194946 770856934 773611145 776161041 778509445 780558929 781776581 782490005 782151642
866 782151642 781180420 781704102 783082123 782710876 782885895 784024658 784907150 785675125 785812302 786611328
875.7 786611328 787423477 787980576 787518616 785911636 784206772 782710037 782000198 780357819 778482513
884.4 778482513 776521149 775092316 775189896 774567261 773331680 773174210 773843536 772714005 771474762
893 771474762 771972046 772324142 772591934 772747650 773420410 774026108 773810196 773743286 774048843 774141388
902.7 774141388 773313828 771902237 770373459 769435959 768629532 767891464 766910706 765107880 763017273
911.4 763017273 760793457 758972931 756750107 754455032 752723007 751085205 748937454 746481628
919.1 746481628 745129929 743952942 742533340 740667267 738535004 737136383 736077576 735852890 735109940
927.8 735109940 733306046 732407379 732102051 732391052 733093033 733260040 733582993 734789963 737075272
936.4 737075272 739568634 741804581 744187851 746341476 748333206 750446243 752862701 755868912
944.2 755868912 758287125 759925232 761268616 762189255 763727188 765415421 766524811 766957703 767164612
952.8 767164612 767030411 766310959 766219254 766176910 765716248 764446640 763127518 761927872 759681778
961.5 759681778 757606735 755538101 753236008 751367645 749838104 748148804 746549377 745631943 744521561
970.2 744521561 743340378 742751083 742648010 742446671 741194229 740101166 740075607 739932098 739386063
978.9 739386063 738430176 737772217 737367630 735832443 733991394 732295914 731150665 730195312 727799530
987.6 727799530 725373688 723404846 720539322 717188187 713902740 708558044 700153656 689799423
995.3 689799423 681699753 682732162 690675201 698842468 703444824 705002213 705473709 705350037 705173645
1004 705173645 703951569 702698441 702514420 701785202 701162491 700900574 699978638 698888168 697877502
1012.6 697877502 696960831 695958481 693789520 692118073 691276474 689787445 688312302 686563797 684933548
1021.3 684933548 683054810 681098709 679250793 677122421 675780640 674739990 673410187 670792007
1029 670792007 668445282 667207336 665667572 663711777 662005157 661028366 659052505 657640991 656802216
1037.7 656802216 655590973 654298706 653269424 653408432 652840118 653184280 653403702 652683945 652708130
1046.4 652708130 653073349 653888779 654220428 655331726 656118469 656858215 658157272 658554001 658824768
1055.1 658824768 658621140 658531342 658392792 658729935 658843231 658583832 658713608 658094559 657905731 657947540
1064.7 657947540 658281097 657704544 656978760 656712341 655337524 655003357 654440308 652961578 651221008
1073.4 651221008 649871140 649604416 649937057 649609833 648260422 647899246 646810532 646473541 646565094
1082.1 646565094 645196228 644070129 642771378 641806335 640169525 638556175 636107292 632916565
1089.8 632916565 630364189 626583595 621797676 615483208 609214134 602389946 595383949 587804108
1097.5 587804108 579356346 571489182 561433716 551842766 540958672 530564423 521134911 511138382
1105.2 511138382 502315941 491318741 481339302 471646614 463027763 453422279 444876709 439021568
1112.9 439021568 432512894 428927689 425306587 424834137 424241295 423813934 424519539 424265289 426043930
1121.6 426043930 427512093 430842094 431830482 433302650 434875717 435368614 436549644 435069618 435450020
1130.3 435450020 434522743 433721275 431217384 428217583 426592026 422171822 419247398 415064087 412050095
1139 412050095 407870827 404238434 401660042 397231293 394912262 390396347 387515869 383669586 381232491
1147.6 381232491 380316048 378174095 377702065 375923729 377244797 377211266 378601265 380328293 381628532
1156.3 381628532 384921722 386436920 390646858 392927475 396362076 400295715 404263382 408975792
1164 408975792 412656212 418704987 422925186 428881493 434502106 441395302 449070663 455416031 463713493
1172.7 463713493 470487671 478818245 486202431 494486580 502935791 510182495 518398018 525056267
1180.4 525056267 532628517 539188118 546069412 552131805 558004417 564347839 568961296 574698029
1188.1 574698029 579244347 584155312 588339577 592019615 596365128 599584312 603591347 607400360
1195.9 607400360 611847954 615954628 620691910 625532494 629082642 633281097 636910057 640544128
1203.6 640544128 643732834 646966629 649828033 652322845 654887924 656390533 658440628 660268631
1211.3 660268631 662413406 664634552 666511841 668661346 670585175 671999588 671829453 672792664 674345551
1220 674345551 674934464 675483856 675948334 676973953 677408524 677936172 678864441 680042267 680757904 680654297
1229.6 680654297 681364822 682029724 682212067 681873016 682104721 683019562 684139023 685198669 685514603
1238.3 685514603 686306381 686884308 687534561 688328018 688905029 689105148 688797913 689458923 689894257 689950104
1247.9 689950104 689949417 690385437 691139145 691524963 692401505 692638245 692705994 693060150 693455734 693427277
1257.6 693427277 693274078 694096146 694442825 694795074 695545044 696450500 697207642 697651062 698451920 699513702
1267.2 699513702 700451965 700778275 701357422 701655807 702112198 703473282 704755783 706021652 707138977
1275.9 707138977 708701324 709939346 711060028 712508240 713873215 715417557 716544876 717612686
1283.6 717612686 718604736 720204163 721702423 722133865 723310242 725112457 726723709 727695618 728737640
1292.3 728737640 730204926 731309814 732528076 733591080 734308243 735282898 736503525 737686539 738858261
1301 738858261 739976730 740840378 741598969 742104797 742418900 742622452 742839813 743455429 743758469 744227142
1310.6 744227142 745191116 745460510 745663223 745487747 744932861 746980743 749984512 750487137 749584885
1319.3 749584885 748994293 749774551 750526733 750727463 750928116 750943527 751891479 752813950 753598633 754503555
1328.9 754503555 754854202 754950790 754213791 753929138 754111862 754489670 754635468 753905792 754393616 754867477
1338.6 754867477 754079132 752666550 753369904 755281754 755756073 755660324 755131073 754384155 753526382
1347.3 753526382 752955933 752830276 752803040 753445511 753390961 753636093 753849487 753178940 752718582 752309418
1356.9 752309418 751764221 750949554 751405106 751401215 750818024 750159531 747960663 749147720 750382004
1365.6 750382004 750571289 750927353 749304276 747344971 747001266 746343613 746098862 745801926 743151169
1374.3 743151169 741484375 742119827 742989655 742573166 742163544 742541428 742532272 742505569 740998383 739863129
1383.9 739863129 740067444 741302872 742299652 739861221 740939255 742665710 742931671 743249893 744070053
1392.6 744070053 746150742 744922333 740996323 741300125 742286606 742123413 738428879 737740326 739508896
1401.3 739508896 739547043 739510880 740261841 738064804 737138062 738450317 738520813 738353577 737782288 737216644
1410.9 737216644 735976410 735126343 735735168 735816193 736910400 737609863 738256531 739787369 733803787
1419.6 733803787 733815765 736912613 738270111 738207397 735581970 735982132 737772522 738238831 739797668
1428.3 739797668 740889740 739196930 739647598 741900864 742626572 742672043 745696564 748392334 740349045
1437 740349045 740075836 743888550 744781723 745020676 745989761 746740952 748302307 749438782 750238724
1445.6 750238724 752340088 752371826 748553619 749206848 751262360 751095581 750387192 751602631 754352493
1454.3 754352493 756646576 756926498 753392487 749930267 751801682 753945694 756889420 758211288
1462 758211288 759281845 761999359 757596436 755330505 758497849 760642624 762037582 764185181 768447342
1470.7 768447342 770671768 768679428 766122742 768812943 773339539 770083847 769870605 773107758
1478.4 773107758 774703903 776441040 776238708 776462479 778172913 779331131 780386581 782482910 781795578
1487.1 781795578 779633713 782144394 777734833 772307587 775355988 777818756 778692932 780680847
1494.8 780680847 782110825 773925934 777062912 776651382 771830444 774354858 773907242 772756805 772709808
1503.5 772709808 775247269 778608780 770126038 758516388 760373230 764149170 763843689 766736221
1511.2 766736221 765259476 761055908 763153763 762697601 762269135 756626205 750284424 757406616 763575439
1519.9 763575439 762217789 753993683 751369781 755186844 759444199 754559631 753082886 753939209
1527.6 753939209 750751801 750878220 752309647 753689270 754990921 752380981 743703613 746044617
1535.3 746044617 748941269 751497803 755786743 749833374 738495331 743206329 743146973 741985703
1543 741985703 745584564 744202194 739289093 743264923 745834045 748209915 746573944 741941299 745335388
1551.7 745335388 748228760 750755539 744845734 744494934 751838760 758302383 758921967 738669357
1559.4 738669357 737865829 746448212 751196976 753687973 755316696 752830505 751940079 754791107 757254562
1568.1 757254562 757297668 746794128 749277191 752845612 753376389 754343262 756680832 758557739 745095978
1576.8 745095978 747138062 749530640 748844604 748214569 746860123 746688766 744976654 744041595 742610855
1585.5 742610855 741128235 740374451 738297729 737188950 735129242 734080734 731901093 730699539
1593.2 730699539 729453049 726645737 725903778 723468246 722167435 720181351 718485794 716134872
1600.9 716134872 713632050 712514343 709284058 708231430 706861115 705398331 702753983 701396103
1608.6 701396103 699408340 696078339 695856705 693429108 692703094 691220856 692243729 692508392 678245239
1617.3 678245239 681000214 681180649 681311951 680218048 681078720 680116043 671523209 673487015 674207916
1626 674207916 675465317 671297989 667903366 668868027 668086548 667948914 667066040 669598312 671832047
1634.6 671832047 662481461 660284119 662324371 662953949 663811798 664837570 664315948 665512772 665271149
1643.3 665271149 667501297 670678787 667568741 665945358 662716599 665863800 669394302 674214020
1651 674214020 679276505 669936066 659007339 666541367 673148422 675671463 677370911 678977203
1658.8 678977203 680417709 682378235 685042877 685314713 682244339 686305313 689289780 691445312
1666.5 691445312 695366440 698503723 693897324 692938766 697386398 697717133 702180862 708463516 708232574
1675.1 708232574 703514862 707468414 712059708 714852219 716734467 715665207 720140839 727678986
1682.9 727678986 727887955 713109665 718145599 727052765 731252518 732303162 734692688 735368576
1690.6 735368576 738453369 741734772 745387573 751068344 754985809 746154480 749480743 757401733
1698.3 757401733 765168991 759255142 748410187 761930313 769867859 772946548 774039764 775796280
1706 775796280 774643784 776436386 781382141 783095703 783158646 785985641 789339523 792626801 791226273
1714.7 791226273 789826279 795286865 796839752 784447327 788561630 793883514 796366577 797955475
1722.4 797955475 797398605 796495361 798256378 799498138 799904404 801283417 804237976 802104187 800462875
1731.1 800462875 806239014 810703049 803551483 792171173 799848404 805074005 806739197 810158234
1738.8 810158234 806891632 802418823 808633118 812411499 809795227 809662399 813540497 816005020
1746.5 816005020 817579803 816950607 816238861 821161880 819384613 816878891 821808624 824101105 826733398
1755.2 826733398 829247284 825243225 826149750 829049225 831582031 835242310 829747696 827487488
1762.9 827487488 831482239 832765579 833312836 835607529 836931992 832518692 835944138 841514664
1770.6 841514664 840352249 832070465 829509506 836335297 838066177 835724106 838108673 838968124
1778.3 838968124 839935455 839310074 836936035 838439407 840908356 842371216 840402603 839723434 841498337
1787 841498337 841774063 842478027 844358063 844450226 843880768 838576508 838031006 843330231 844008484 842068176
1796.7 842068176 844042816 846736221 845312653 842740936 844618988 843326263 843190689 845257721
1804.4 845257721 845441284 846060944 846072159 845265427 846679535 847802124 845269547 845173035 846198349
1813 846198349 846200790 846709976 846896133 847418213 846406403 846535568 847663879 847453995 848186569 848062134
1822.7 848062134 850098190 852146072 846765747 846190796 849559708 852567596 851627502 843366776 845246964
1831.4 845246964 848743820 848968658 849256058 849873047 851305923 850869980 849374161 850108795 850032730
1840.1 850032730 850439148 850910721 853266907 852999268 844038925 847594681 851388779 850778046 849612350
1848.7 849612350 850307159 851489944 851318130 851573563 851501007 851204147 851037445 851068344 851505814 851730804
1858.4 851730804 852142334 852067871 851899719 851309357 851315842 851686707 852225723 853164978 852998962 853478012
1868 853478012 850479813 847002182 849040222 851357574 852432632 852596512 852916946 852878952 852716064
1876.7 852716064 852310257 851908875 851724472 851683197 852381592 852142487 852307205 852552719 852644043 853130264
1886.3 853130264 853263321 855138474 854379959 850109482 851007919 852354965 852416229 853226166 852392807
1895 852392807 851211395 852379761 852880402 853211060 853341446 853028336 853099213 852943573 853066254 852524414
1904.7 852524414 852140732 852227249 851884003 851992111 852323761 851697083 851760101 853183594 853194580 853266602
1914.3 853266602 853088074 853493195 855092850 851134949 849588242 851682358 852571030 853596954 851798477
1923 851798477 850635071 852116318 852666779 852725220 853032303 852713394 852132034 851899490 851645508 851405869
1932.6 851405869 850864716 850675964 850717926 851197510 851865387 851961899 851904831 851933441 853626556 852713242
1942.3 852713242 849033508 850507355 851605301 850815659 850662613 851138000 851332321 850871048 850873871
1951 850873871 851189117 851540680 851688385 851257858 850351639 850063324 850197449 850091324 850626373 850787735
1960.6 850787735 850518036 850544510 850669937 851048660 851547394 851819229 850503998 849328918 849770660
1969.3 849770660 850048904 850075684 849723587 849192429 849380569 849750214 850340500 850954361 850766830 850482178
1978.9 850482178 850127106 849568100 849197083 848534698 848046417 848112717 848261414 848636017 849090805 848685760
1988.6 848685760 848343735 849919128 850632401 848116455 847134399 847800522 848043289 847950134 847680054
1997.2 847680054 847852478 847749557 847615433 847966766 848183975 848584747 848558426 848191833 847702484 847107849
2006.9 847107849 846838608 846518860 846570816 846684189 846639023 846826248 846969986 847198944 847647552 847498550
2016.5 847498550 846612549 846382599 846100388 845973663 846113663 845624161 845408249 845349960 845558472 845983429
2026.2 845983429 846239319 846438446 846356125 846017456 845652161 845731812 845358429 844853134 844461441 843995438
2035.8 843995438 844141312 844091492 844294891 844813995 845149460 844919891 844562759 844664459 844115753 843921280
2045.5 843921280 843959351 843654480 843407669 843375854 843724747 843602066 843533325 843508301 843711472 844015732
2055.1 844015732 843675766 843386459 842980347 842668228 842339172 841984100 841875916 841929855 842231979 842198563
2064.7 842198563 841815567 841749649 842101974 842011795 841814804 841530914 840866318 840461044 839783401 839459076
2074.4 839459076 839537811 839435272 839307709 839126358 839231339 839474258 839738083 839495468 839167557 839013977
2084 839013977 838399277 838018646 837776947 837326584 837461853 838035278 838016739 837921829 838003159 837990952 837973328
2094.6 837973328 837788162 838051376 838361282 838321533 838227158 838314590 838485260 838517838 838937378 839013748
2104.3 839013748 838888779 839164352 839438324 839612961 839440384 838995285 838680801 838857117 839154129 839632416
2113.9 839632416 839750595 839465485 839752960 840047455 840099792 839899139 840130234 840266190 839900436 839711456
2123.6 839711456 839233932 839086151 838706131 838363037 838750534 839171677 839481049 839465942 839680328 839686203
2133.2 839686203 839411240 839168243 838897324 838844910 838951721 839106216 838993454 839183350 839227905 839366455
2142.9 839366455 839913254 840245667 840372391 839810257 839592133 839783554 839990692 839976883 839902115 840290375
2152.5 840290375 840196838 840426941 840643311 840625534 840751419 840590057 840764008 841078110 841165619 840461273
2162.1 840461273 840023422 840165558 840045166 839989166 840174866 840745087 840674744 840489883 840716476 840921555
2171.8 840921555 840762100 840231400 840103912 839620667 839301224 839340668 839564133 839679337 839502640 840179443
2181.4 840179443 840536957 840408020 840171661 839981003 839988022 839858322 839792023 839422150 839696350 839971771
2191.1 839971771 839982681 840647964 840980072 841262665 841732025 841909332 841907196 841967468 841776657 841579132
2200.7 841579132 841585770 841556244 841721115 842008591 842358093 842408752 842884140 843205643 842829056 842810516
2210.4 842810516 842599030 842661133 842753448 842354431 842102661 842441559 842862701 842684402 842580872 842271805
2220 842271805 842244263 842492371 842529907 842623291 842852173 842977600 842287064 842151184 842040100 841834793
2229.7 841834793 842278900 842247696 842213135 842213745 842532501 842509155 842384491 842613373 841990356 841648865 841956177
2240.3 841956177 842326889 842229996 842098007 842032776 841869888 842041779 841963959 842134857 841917953 841715546
2249.9 841715546 841864853 841446762 841428604 841425323 841399689 841712646 841907654 841809769 841673355 841778870
2259.5 841778870 842066803 841968918 841637039 842042618 841928940 841870117 842093124 841578751 841524506 841713638
2269.2 841713638 842043228 842251129 842413025 842604599 842427902 842089920 841904144 842343521 842173691 841718826
2278.8 841718826 841554642 841837769 842161255 841986542 842207108 841847992 841880341 842097244 841670227 841580582
2288.5 841580582 841622391 842027054 841912842 841838760 841658249 841240387 841145248 841290054 841756210 841244431
2298.1 841244431 841413040 841644211 841690750 842409515 842136612 841795578 841362457 841668625 841822891 841347504
2307.8 841347504 840996475 840351334 840917740 840843048 840858078 840998001 840428238 840484238 840036087 839935913
2317.4 839935913 839681778 839691086 839649429 839319534 839534378 838964157 839044647 838526382 837820129 838582001
2327.1 838582001 839476929 839146042 838247757 838322983 837882767 837716293 837537689 837494049 838233566 838207169
2336.7 838207169 838471146 839265289 838697052 836727600 836346893 837535248 839351273 839226685 837476425
2345.4 837476425 838131104 838075333 838918304 841618195 842725525 841918945 840759354 840424881 840396881
2354.1 840396881 838512878 836705246 836953964 837760086 838398819 838373337 837343445 837184143 837788010
2362.7 837788010 837483902 836710815 837031479 837774963 837963181 837682419 837354584 837752991 838220520 838674088
2372.4 838674088 839348145 839830399 839885178 839996414 840432205 840941315 841541748 841934662 842433243 842731400
2382 842731400 842720718 842866898 842869263 843052902 843384552 843568344 843417664 843065948 843092651 843419724 843447342
2392.6 843447342 842990494 842903976 843043518 843141861 843261642 843154068 843009872 842613220 842432098 842573776
2402.3 842573776 842654190 842679672 842771454 842916107 842598877 842450485 842739792 842742920 842335052 842294540 842276917
2412.9 842276917 841646881 841882782 842414093 842187729 842198868 842498016 842396088 842006226 841910248 841906967
2422.5 841906967 841835480 841637650 841409378 841111832 840937881 841239471 841402054 841453705 841346207 841342697
2432.2 841342697 841277161 840652390 840535583 840778656 840682678 840407181 840216522 840211105 840625458 840575256
2441.8 840575256 839679947 839899063 840460052 840247574 839937973 839671173 839889145 839862289 839176559 838877563
2451.5 838877563 839141388 839125061 839119797 839510040 839598846 839503250 839447861 839416733 839236755 838980331 838771820
2462.1 838771820 838568802 838588943 838436356 838276825 838130264 837785187 837877502 838321762 838621445 838626633
2471.7 838626633 838253784 837660522 837198715 836938019 836946716 836927414 836595840 836502762 836856232 837219315
2481.3 837219315 837290268 837208252 836876755 836351242 836157684 836349030 836058731 835260620 835227356 835613403
2491 835613403 835707016 835459671 835284271 835534592 835566864 835445175 835300064 835512924 835562668 835077515
2500.6 835077515 835024948 834976044 834736862 834253540 834043655 834277878 834423599 834703064 834726715 834816437
2510.3 834816437 834626999 834153748 833912125 833571396 833627625 833638535 833311844 833116150 833389053 833676300
2519.9 833676300 833431320 833429642 833579865 833477554 833148956 832479172 831875381 832199478 832731476 832379684
2529.6 832379684 831927032 831886368 832076111 831897278 831973267 832671204 832700424 832374573 832165222 832035828
2539.2 832035828 831789932 831301804 831027832 831143799 831205673 830826645 831020813 831446075 831353302 831445160
2548.9 831445160 831268234 830852356 830852432 830788956 830375137 830014191 829854584 829876099 830027924 830135269 830035934
2559.5 830035934 829913712 830061493 830144882 830126648 829932098 829601593 829368668 829064865 829064255 829261246
2569.1 829261246 829301071 829185638 829021912 828972473 828981400 828986588 828935394 828936844 828537903 827780914 827346878
2579.7 827346878 827453918 827649078 827556763 827720261 827687607 827680664 828040466 827905121 827598572 827407608
2589.4 827407608 827239304 826761780 826532288 826910553 826777802 826337891 826088562 826098328 826343384 826595230
2599 826595230 826590958 826118774 825664749 825539474 825668488 825681763 825320663 824878464 824346848 823849030
2608.6 823849030 824030533 824429703 824358749 824480820 824735413 824399109 823799133 823513947 823288422 823168488
2618.3 823168488 823378525 823406754 823185196 822817917 822808914 823274841 823394928 822951660 822281799 821755295
2627.9 821755295 821473618 821469040 821173325 820876999 820869064 820625839 820730133 820844116 820980148 821361847
2637.6 821361847 821406097 821099777 820669479 820372772 819839096 819606934 819407043 818901520 818830795 818676147
2647.2 818676147 818595657 818600235 818614807 818689194 818943710 819186935 818543854 817809677 817461700 817587128
2656.9 817587128 817398911 816724548 816814499 816823196 816845551 817074509 817141953 817294540 816924744 816660080
2666.5 816660080 816713715 816138077 815550156 815549850 815622482 815568542 815322342 815142975 815268326 815255661 815084534
2677.1 815084534 815068207 815130768 814886246 814514771 813966217 813461304 813555603 813511200 813105698 812874298
2686.8 812874298 813336411 813698044 813495178 813702545 813803864 813531265 812804260 812033997 811745377 811153870
2696.4 811153870 810862045 811129913 811297150 811563644 811910019 811841278 811388855 810938721 810827026 810948715
2706 810948715 810665817 810416412 810404739 810111847 809623947 809305344 809163361 809191208 809406357 809147415
2715.7 809147415 809151230 809382401 809096146 808820801 808204346 807746887 807443619 807121887 807071533 807049561
2725.3 807049561 807322388 807224197 806957474 806831360 806666183 806304626 805474472 805177383 805189514 805085144
2735 805085144 805034409 804779282 804425812 804483795 805115585 805274963 805139313 805210495 804862671 804219666
2744.6 804219666 804146652 804564133 804025345 803213730 803317947 803098068 802691574 802742767 802464447 802319336
2754.3 802319336 802705612 802973480 802785187 802128830 801624527 801421967 801243973 800804138 800254822 800284119
2763.9 800284119 800717392 801080399 801001511 800909195 800866165 800421677 799960556 799499741 799127502 798754196
2773.5 798754196 798468399 798215561 797885971 798031616 798136063 798000793 798057480 797984619 797382965 796989517
2783.2 796989517 796741791 795859070 795139923 794884644 795287476 795465317 795044098 795397949 795539474 795246735
2792.8 795246735 795039597 794553528 794066162 793481827 792803497 792344589 792192917 791801453 791286087 791098862
2802.5 791098862 790868225 790758591 790736694 790582809 790497284 790174103 789764328 789488220 788657532 787947540
2812.1 787947540 787763138 787331543 786949463 786745300 786641388 786427078 786533203 786893005 786262970 785167160
2821.8 785167160 784242020 783852539 783705521 783102036 782685318 782531052 782227478 781644211 781372833 781549606
2831.4 781549606 781288452 780438690 779500427 778968506 778689728 778312531 777656631 776805496 775804291
2840.1 775804291 774768753 773919144 772998428 772105942 771040497 769912033 769005356 767674866 765992813
2848.8 765992813 764414825 762897034 761614761 761103592 760756531 760194778 760129471 760493622 761059875
2857.4 761059875 761222839 761033020 760844345 760370483 759787140 759208374 759087601 759165192 758814011 758303223
2867.1 758303223 757527466 756610565 756200409 756081772 755664291 755160599 754645386 754089203 753610306 753274612
2876.7 753274612 753176193 752849045 752383041 752083588 751757355 751627808 751775284 751762085 751339874 750895004
2886.4 750895004 750517426 749697495 748634262 747816315 747095947 746788406 746793976 746201172 745487289 745144882
2896 745144882 744586258 744015427 743990936 743666382 742804871 742279587 741731033 741569366 741730347 740912094
2905.7 740912094 740092773 739857178 739378357 738959351 738617401 738008194 737677231 737291641 736531754 736029663
2915.3 736029663 735260849 734065247 733162460 732433548 731799011 731536255 731301804 731002197 730605087
2924 730605087 730044632 730338516 730770645 730762024 731140900 731054687 730578079 730365372 730263901 730448380
2933.6 730448380 730947113 731368790 731669464 732041321 732249298 732566528 732841949 733019409 733243256 733413391
2943.3 733413391 734041824 734363861 734264679 734455643 734463730 734253311 733922577 733709259 733572083 733093033
2952.9 733093033 732900238 732796326 731915817 731222382 731346970 731758499 732109833 732371826 732745056 732617798
2962.6 732617798 732207260 732185898 732420044 732963638 733475952 733871994 734081573 734486542 735595856 736612549
2972.2 736612549 737172165 737763062 738417130 738680115 738994217 739749603 740583191 741038132 741177292 741677475
2981.8 741677475 742328491 742969971 743394089 743848419 744505157 744735489 745395813 745945358 745911407 746378021
2991.5 746378021 746870117 747332230 747541580 747278290 747557678 748217316 748337631 747779465 747490234 747936859
3001.1 747936859 748486633 748720016 748302460 747707748 747597809 747694168 747659912 747666016 747772980 747616882
3010.8 747616882 748150024 748476486 747612762 747492371 747147903 746556320 746544113 746334305 746436310 746136246
3020.4 746136246 745587006 745382004 745416260 745390549 744780273 744388428 744001617 743783722 743964691 743998489
3030.1 743998489 743721771 742965088 742726059 742821426 742654343 742408752 741941452 741511154 741211395 740914383
3039.7 740914383 740559387 740251160 740154114 739867020 739206619 738804169 738614960 738407745 737984467 737385635
3049.4 737385635 737085876 736544800 736285553 736186981 735773621 735739136 735313263 734514160 734080048 733699875
3059 733699875 732872391 732638474 733056183 733080521 733109818 732451324 732302856 732343216 731016159 730122299
3068.6 730122299 729828949 729885941 729636230 729365005 729530106 729286499 729072876 728698883 728402252 728216400
3078.3 728216400 728107224 727848511 727295609 727198410 726886978 726410675 725899353 725474548 725098038 724904480
3087.9 724904480 725344162 725038681 724294434 723825531 723280869 722839203 722567062 722163925 721389160 720869522
3097.6 720869522 720825119 721168137 720933609 719878540 719412918 719368286 719141083 718933792 718772049 718679657
3107.2 718679657 718443222 717338562 716477585 716584625 716248322 715522232 715285110 715397568 714718018
3115.9 714718018 714076538 714323959 713849640 712876587 712774658 712707520 711145248 709884644 709748993
3124.6 709748993 709514160 709560623 709113083 708328552 708024063 707868271 707636414 707054367 705817413 704732590
3134.2 704732590 704671326 704233551 703609085 703291321 702648315 702272110 702026215 701667786 701244888 701018219
3143.9 701018219 700467300 699721298 699462357 698784561 698005219 697465057 696763763 695906677 695218201 694801178
3153.5 694801178 694318924 693819275 693621063 693488998 692710953 692132568 691625443 690939560 690447617 689631042
3163.1 689631042 689308167 688982849 688369446 687537842 686500015 686178894 685824127 685289688 684482727
3171.8 684482727 683753281 683475800 682715225 681756134 681692810 681776047 680354843 679330521 679431076 679173584
3181.5 679173584 678498459 677839661 677543793 676895828 675919647 674950638 674390945 673945389 673259888 672827988
3191.1 672827988 672125549 671939468 671900558 671417847 670663681 669407501 668614578 668024902 667750244 667449493
3200.8 667449493 666687622 665946884 665129776 664756851 664542236 664236908 663784790 663338318 662763748 661399536
3210.4 661399536 660353851 660065918 659707718 658942413 658330154 658221436 658081207 657425842 656609650
3219.1 656609650 656108856 655687103 655343628 655141754 654689255 653912430 653628159 653521347 652959595 651884003
3228.7 651884003 650402451 649914322 649841156 649470825 649258118 649102631 648866043 647997665 647153168 646403656
3238.4 646403656 645723572 645102921 644444809 644147720 644031677 644199295 643443832 642492447 641809845 640955658
3248 640955658 641091156 641005325 640791397 640591888 640059280 639359627 638035316 637203636 636563797 635924072
3257.7 635924072 635903511 636030922 635726089 635131683 634790649 634634514 634412384 633745842 632912140 632229729
3267.3 632229729 631795807 631307907 630946999 630768700 630518417 630481415 629466019 629336510 629882469 628476639
3276.9 628476639 627549629 627473450 627431107 627030716 626343575 626095695 625337143 624679337 624418106 624202843
3286.6 624202843 624022102 623678017 623547249 623551445 623083076 621985016 621149635 620852165 620657883 620372849
3296.2 620372849 619854317 618849335 618083878 618143120 618083458 617613297 617095985 616857605 616121445 615189705
3305.9 615189705 615366135 615300903 614156075 613138809 612758713 612206764 611788483 611555367 611088333
3314.6 611088333 610669060 609839439 609173622 608554153 607794495 607074089 606452408 606235695 605657921 605217209
3324.2 605217209 604747467 604231339 603874664 603437386 603009644 602027016 601265564 599970703 598774033
3332.9 598774033 598642082 598298416 597990837 596799469 595391006 595192833 595378990 594946136 594079437
3341.6 594079437 593249588 592051544 591203575 590505333 589874687 589183846 588458900 588346558 587546921
3350.2 587546921 586515884 586002884 585381889 584443283 583545837 582867737 582122803 581313553 580194092
3358.9 580194092 579465446 578927765 578095741 577189751 576678810 576722870 575949860 575033607 574092293 573143768
3368.6 573143768 572798767 571826859 570702782 569982147 569561234 569255791 568612633 567825356 567319794
3377.2 567319794 566645393 565651855 565338516 564873276 564160538 563538055 562692337 562162743 561555214 561416359
3386.9 561416359 561438942 560496979 559597816 559649887 559962044 559198761 557653465 557116623 557767715 557840919
3396.5 557840919 556353798 554642677 553754120 553453636 553711548 554104996 553856392 553278847 552831879
3405.2 552831879 552872887 552833900 551724586 550664558 550719604 550827866 550429535 550039215 549820175 549926186
3414.8 549926186 549574661 549053955 549074707 548876076 548667984 548312836 547872925 547570496 547578964 547740440
3424.5 547740440 547622871 547656097 547077255 546642723 547309761 547762413 547089386 546645050 546877975 546657410
3434.1 546657410 547024574 547293243 547676697 548082352 547744064 547770729 547580719 548238792 548140831 547362595
3443.8 547362595 547845459 548784790 549538612 547525558 546988029 548243484 548877373 549945564 550396385
3452.5 550396385 550631752 550537491 550958443 551252518 551265984 552142487 552268524 552617607 553141022 553388138
3462.1 553388138 553317108 553927307 555430908 556124420 556318436 556204109 557136650 557733116 557362289 557789307
3471.7 557789307 558411674 559204941 559318848 559102173 559312248 559980774 561102791 562393761 563418808
3480.4 563418808 563606720 563188744 562418137 563711624 565561676 566207428 566821594 566347733 566367149
3489.1 566367149 567394409 567914925 568338470 569500504 570279236 570797882 571945953 571464806 571324692
3497.8 571324692 572700348 573488274 574118385 575516624 576045189 574908104 575551109 577011757 578012238
3506.5 578012238 579481773 581521378 581790009 580227737 580932121 581450005 581570091 582690582 583926125
3515.1 583926125 585051842 585776024 586560440 586753502 587108002 588651123 590565033 590365829 588885040
3523.8 588885040 589693260 591090927 592409782 592790413 593022881 593604546 594640846 595544090 595784225
3532.5 595784225 597090836 598226929 599844131 599606590 598655777 600666695 602000809 602984734 603458519
3541.2 603458519 604906998 607186813 609009819 609499817 608696404 609487495 608187904 609494705 611660767
3549.9 611660767 613674660 615379333 612033005 613170967 614530334 615882683 618398933 618551559
3557.6 618551559 620565681 621692886 621815376 622228012 624858170 626071053 626358223 631850891 631283226
3566.2 631283226 628691635 627009315 626832581 631859093 633297958 634559784 636571465 637769508
3574 637769508 637615585 638381042 639814606 639838066 642805405 643641968 643628616 645772171 648248444 649245071
3583.6 649245071 649955673 656077652 657076569 653320618 652795334 650778580 655398483 659048080 662284470
3592.3 662284470 662406540 662764969 665995560 662290726 665931854 669843597 669501114 672408371 671658554
3601 671658554 671521683 673391418 675205307 677920380 682163925 684173431 681305618 685112610 682003174
3609.6 682003174 682707596 693247528 691486588 687425461 691369324 690069351 696482697 701345139
3617.4 701345139 699455872 700176773 696281891 696645813 701402893 704845352 707064056 710086288 712750778
3626 712750778 715272369 722559738 716276703 699526978 707747498 716443787 723911133 722943497 719627533
3634.7 719627533 723230667 727514267 729832458 728619919 730201569 733558044 735688400 735873566
3642.4 735873566 736394577 740155716 745296783 751259460 745998154 741371231 747672729 743055267
3650.1 743055267 735210648 736292496 745307465 751372528 757131042 760034180 745859146 750423508
3657.9 750423508 756942902 757897415 759134064 759136200 760987244 761886215 763631134 764801865 765879669
3666.5 765879669 771773224 773480530 771266861 768287582 758280792 765144196 777897873 788826370
3674.3 788826370 780324020 751584091 760845032 772871017 777644196 771697388 771885376 776760101
3682 776760101 779006653 779563828 778711624 779422913 786190262 794077835 778381882 774958954 782775192
3690.6 782775192 770254059 773607788 780786743 780419922 781985245 781708679 781705856 783607941 784351349
3699.3 784351349 787956848 790127640 780060501 778841858 786007843 787434235 787375336 787932510 792148895
3708 792148895 795198212 784475327 792597809 793721542 773721771 783081131 789171371 789707260
3715.7 789707260 791127701 794011993 794006653 788445663 791498718 798432770 789796371 785541534 793747787
3724.4 793747787 793966064 791624680 786670380 788028336 793443222 796272202 804315033 796020889
3732.1 796020889 788595352 803167114 798756714 781224823 783793030 788551941 789712982 793276978
3739.8 793276978 796622696 793166580 800157776 812860413 784378510 772453537 790389938 798358765
3747.5 798358765 805860443 798344345 789327774 803130875 785584946 779322128 789778061 797097473
3755.3 797097473 799686050 792101212 797515564 802651978 788518753 787908554 794574127 796309586
3763 796309586 797675781 802225723 795635147 789785309 796231308 803774796 801655884 787661209
3770.7 787661209 791564255 795468521 795432510 796614151 796870651 798545227 799436188 802585144 798476486
3779.4 798476486 787784653 792968292 795998993 798528366 801347046 796105347 794334946 795218430
3787.1 795218430 796099701 796637878 796455154 797261200 797424698 798436279 798877411 801678772 804732742
3795.8 804732742 796390152 792602005 797344971 804042892 810527420 794035568 780381470 788413849
3803.5 788413849 794788513 802854996 807209091 788077545 785981216 794458008 796924057 797493744
3811.2 797493744 798264923 798876953 802548752 810144196 800561295 783177109 795262833 804284134
3818.9 804284134 811302795 809119949 778908386 785181351 794227600 798020248 800895157 798138275
3826.6 798138275 791930389 794654922 798938599 804195862 802930145 789298172 797284698 806337738
3834.3 806337738 795202942 796782379 806612854 791493759 790839844 801402359 790810623 793370895
3842.1 793370895 801206970 794050369 791222076 796646805 798481064 798608704 800440140 799164658
3849.8 799164658 804546814 813045044 803598251 798830872 769684525 782109222 797686462 794312668
3857.5 794312668 792548065 796285172 800458984 801974716 794233246 797589569 804025497 789833069
3865.2 789833069 785641861 794662247 804135208 811147842 792967377 782673416 790837631 800627899
3872.9 800627899 802067108 785364838 790487976 796486282 796825104 800979309 805391464 792296600
3880.6 792296600 785199890 796471786 798241806 801964340 804797897 783711090 789494553 795638962
3888.3 795638962 798373642 804405212 798248749 785836716 791157303 795304947 793291702 796858444
3896.1 796858444 799604874 803058777 801890411 789258347 798217163 797980270 792262192 798884659
3903.8 798884659 791820908 788928299 789440231 791771622 795237579 795201416 795188980 794785385 794937134
3912.5 794937134 795048294 796031952 798571243 799916687 793257446 790100784 797333450 795637894 790555496
3921.1 790555496 794462509 797321091 798442383 792405090 789011993 793438797 795937881 796963196
3928.8 796963196 795166702 795800858 798114166 792920837 791030502 793248215 793610611 794341736 794822006
3937.5 794822006 794090729 793786392 794664612 797925415 797599411 790704956 791211166 793265915 795088577
3946.2 795088577 796370850 793123322 794979782 794413452 791005325 792868042 792812881 792567978 792938995
3954.9 792938995 793183289 793035583 792462692 793174667 793524399 795181808 794753189 792042160 792973022
3963.6 792973022 794257889 793761749 792919159 792999268 793828964 793703690 793646545 794859924 794692688 793839188
3973.2 793839188 793720474 792967682 792616653 792371979 792830429 793446121 793481750 794043579 793616638 792830200
3982.8 792830200 793060608 793234100 792787628 793083191 793410263 793502350 793965225 792666168 791405792
3991.5 791405792 791581116 793177338 794072266 792526550 792961960 794012756 793886032 793474655 792435760
4000.2 792435760
##END=$$ End of the data block
