##TITLE=$$ Begin of the data block
##JCAMP-DX=5.00 $$ ACD/SpecManager v 10.08
##SPECTROMETER/DATA SYSTEM=Varian
##DATE=18 Dec 2012 14:02:26
##DATA TYPE=INFRARED SPECTRUM
##DATA CLASS=XYDATA
##ORIGIN=
##OWNER=
##NPOINTS=3735
##FIRSTX=399.26403809
##LASTX=4000.35498047
##MAXX=4000.35498047
##MINX=399.26403809
##MAXY=85.64792633
##MINY=37.65384293
##XFACTOR=1.0000000000
##YFACTOR=0.000000100000000
##FIRSTY=70.84529114
##DELTAX=0.96440572
##XUNITS=1/CM
##YUNITS=TRANSMITTANCE
##XYDATA=(X++(Y..Y))
399.3G08452911M547348J2885895l261795l852081L80783K959061K927627L999405
$$ 708452911 713000259 725886154 722624359 718772278 719153061 722112122 725039749 729039154
407G29039154n468292m184723Q567886M030991o829224j540832l08838r346848n8975
$$ 729039154 723570862 719386139 727954025 731985016 725155792 723614960 723306122 713959274 713900299
415.7G13900299O296921M590759K860870j3750000Q279725R280700J787415q716812
$$ 713900299 720197220 724787979 727648849 713898849 722178574 731459274 733246689 724529877
423.4G24529877l017960K70844k857056m350052k851334M043503L766861J494675k73514
$$ 724529877 721511917 721782761 718925705 714575653 711724319 715767822 719534683 721029358 720755844
432.1G20755844Q11768N56717J965484L842240j0592423q223419K030945M948120K651672
$$ 720755844 721567612 722124329 724089813 727932053 717339630 709116211 711147156 716095276 718746948
440.7G18746948p91397L356552l153000j696777K348404j810913K438507O36673p609558
$$ 718746948 717955551 721312103 718159103 716462326 718810730 716999817 719438324 720074997 712465439
449.4G12465439n201569M855347N831299k686463n705413J175842N065841K57035J32293
$$ 712465439 707263870 712119217 717950516 715264053 709558640 710734482 715800323 716057358 716189651
458.1G16189651J358338N15137l660965o249085n28183J257172k84119M60434L002625
$$ 716189651 717547989 718063126 714402161 708153076 707624893 708882065 708597946 709058380 712061005
466.8G12061005K211151j403122j828308L383865J107102j0678864L18680M780731
$$ 712061005 714272156 712869034 711040726 714424591 715531693 704852829 705171509 709952240
474.5G09952240P40662k683030k824554J215439K463150M095917J188049J295700N14374
$$ 709952240 710692902 708009872 705185318 706400757 708863907 712959824 714147873 715443573 715957947
483.2G15957947l579865j985931j360169J440278O17294q6365J692200J377182j099472
$$ 715957947 712378082 710392151 709031982 710472260 711089554 711003189 712695389 714072571 712973099
491.8G12973099k802658K252807K368546M73785O19278r59778m111862k232361K144318
$$ 712973099 710170441 712423248 714791794 715265579 715884857 714925079 710813217 708580856 710725174
500.5G10725174r97543L0670J698532O13403K651139K159881j269836m661637j374664
$$ 710725174 709727631 709758301 711456833 712070236 714721375 716881256 715611420 710949783 709575119
509.2G09575119j637115k361908L41415j517944k053604M8675K977524L77579m066010
$$ 709575119 707938004 705576096 705917511 704399567 702345963 702394638 705372162 705749741 701683731
517.9G01683731j990814k41776K992707k23618l448563n09948J533279J411209j86920
$$ 701683731 699692917 699451141 702443848 702220230 698771667 698261719 699794998 701206207 701019287
526.6G01019287L42102p46765j336288K80532K85950M12598j349793k767029n17730
$$ 701019287 701361389 700614624 699278336 699558868 699844818 700257416 698907623 696140594 695622864
535.2F95622864J714325J117248k63443L64228J574478J217880N61829R00497J94778
$$ 695622864 697337189 698454437 698190994 698555222 700129700 701347580 701909409 702809906 703004684
543.9G03004684o07910o72226m93011m58069q31451J26876K27585j91955K186432J799621
$$ 703004684 702396774 701724548 701231537 700773468 699942017 700068893 700296478 700104523 702290955 704090576
553.6G04090576o72531J887665K737503q36945k723922k003174p83844l87650L45001
$$ 704090576 703418045 705305710 708043213 707206268 704482346 702479172 701695328 701307678 701652679
562.3G01652679R86634J360321J302337J53351K57492k38647m86450O8206O9504q44116
$$ 701652679 702639313 703999634 705301971 705455322 705712814 705474167 704987717 705055923 705125427 704281311
571.9G04281311k135773j71280J056290j007385k081146r97849L68118R41773J415787
$$ 704281311 702145538 701974258 703030548 702023163 699942017 698944168 699312286 700254059 701669846
580.6G01669846O21337N15366P2174k404404q02307K28730q52814m5166Q5296O60096
$$ 701669846 702291183 702806549 702878723 700474319 699672012 699900742 699047928 699002762 699088058 699748154
590.2F99748154J118393J591797J418609j74408q92029j66702m73480k492447j764679
$$ 699748154 700866547 702458344 703876953 703702545 702810516 702643814 702170334 699677887 697913208
598.9F97913208k23999p83386j252671j750793j467895k249070l815994l741074k594986
$$ 697913208 697689209 696905823 695653152 693902359 692434464 690185394 686369400 682628326 680033340
607.6F80033340m190444q179245q997880r944229j0029335r646949q000527m087067
$$ 680033340 675842896 667663651 658665771 648721542 638692207 629045258 621044731 616957664
615.3F16957664j081581J96038j291809p48673k465591n674973o623497o369781l662835
$$ 616957664 615876083 616072121 614780312 614031639 611566048 605891075 599267578 592897797 589234962
624E89234962J078110Q316612J1505242J2168236J1609153J1263008R106522M725342
$$ 589234962 590313072 598629684 610134926 622303162 633912315 645175323 654281845 659007187
631.7F59007187R39102k617874l540192n371017o688538n167427m050560j702194K149200
$$ 659007187 659946289 657328415 653788223 648417206 641728668 636561241 632510681 630808487 632957687
640.4F32957687P768402J1651993J3493805J3049545J1218644P816314O284027O059800
$$ 632957687 640726089 652378082 665871887 678921432 690140076 697956390 704240417 710300217
648.1G10300217L646392J038743J824417J750030J262436K072907N05142l7613O88553
$$ 710300217 713946609 714985352 716809769 718559799 719822235 721895142 722400284 722362671 723051224
656.8G23051224J591034J558075J393280J205139m11987j0605J016540J513291J058654
$$ 723051224 724642258 726200333 727593613 728798752 728386765 728376160 729392700 730905991 731964645
665.4G31964645J556778j170578j4146728P974472O903305K770843Q52967q6441R40933
$$ 731964645 733521423 732350845 718204117 726178589 733081894 735852737 736705704 736619263 737560196
674.1G37560196P34787K75574q70514k68097N96237m98581O20117J123047N80750P8735
$$ 737560196 738294983 738570557 737700043 737431946 738028183 737529602 738149719 739272766 739853516 739932251
683.8G39932251M2496j65482j545944j112595l15399j427536j695785q66166n44433
$$ 739932251 739974747 739809265 738263321 737150726 736835327 735407791 733712006 732845840 732301407
692.4G32301407l12042k97776K32468J06735j815338j747894J78375N33981l88870
$$ 732301407 731989365 731691589 731924057 732030792 730215454 728467560 728645935 729179916 728791046
701.1G28791046l42102m11224p15409J027832J763535J009369J030121J068496R75571
$$ 728791046 728448944 728037720 727322311 728350143 730113678 731123047 732153168 733221664 734197235
709.8G34197235J263199J995697J152420n37872m92401N79452J440888J930007K296982
$$ 734197235 735460434 737456131 738608551 738070679 737578278 738157730 739598618 741528625 743825607
718.5G43825607J573258O67267K025909J674652m5013M76455m86831r11484m60434
$$ 743825607 745398865 746066132 748092041 749766693 749721680 750198135 749711304 748799820 748339386
727.2G48339386j147232l61862j27259n18493j064377k16675J089630K34146o08825
$$ 748339386 747192154 746830292 746703033 746184540 745120163 744903488 745993118 746227264 745618439
735.8G45618439n57709J18179p48520r45358k74277j283493p72552O64596J036988
$$ 745618439 745060730 745178909 744430389 743485031 743210754 741927261 741154709 741819305 742856293
744.5G42856293J390381K397537K842178L261185K903976J430207J037368L39737J746140
$$ 742856293 744246674 746644211 749486389 752747574 755651550 757081757 758119125 758458862 760205002
753.2G60205002K804870J321183N22003J020279K402649K019806L011474K720490J49078
$$ 760205002 763009872 764331055 764853058 765873337 768275986 770295792 773307266 776027756 776176834
761.9G76176834p40127j219712l40042q25424n60303P8278r29566m08401M51660Q24204
$$ 776176834 775436707 774216995 773876953 773051529 772491226 772569504 771639938 771231537 771683197 772507401
771.5G72507401R61456J152038N09110P58591P47757j35117K39258N50537J722107
$$ 772507401 773468857 774620895 775130005 775888596 776636353 776501236 776740494 777291031 779013138
780.2G79013138J360702J884461L100128J789780J343383J194077J021500j86158k71911
$$ 779013138 780373840 782258301 785358429 787148209 788491592 789685669 790707169 790521011 790249100
788.9G90249100o8131n24444L79791j52817k16980O17829L44238L87726J888046J842270
$$ 790249100 790180969 789656525 790036316 789883499 789666519 790284348 790628586 791016312 792904358 794746628
798.5G94746628K77939q82187j584320k32315n65110j395721q95386k32773P14951
$$ 794746628 795024567 794142380 792558060 792325745 791760635 790364914 789469528 789236755 789951706
807.2G89951706J166611J601333J117478J068878p1488j023788k48489k11564l25851
$$ 789951706 791118317 792719650 793837128 794906006 794834518 793810730 793562241 793350677 793024826
815.9G93024826j96075J056060p0648j003189m9362K66495J020355P0038q9951k08053
$$ 793024826 792828751 793884811 793814163 792810974 792761612 793028107 794048462 794118500 794028549 793820496
825.5G93820496j625519k057419j855545k221756k053680j580887l098984k631836
$$ 793820496 792194977 790137558 788282013 786060257 784006577 782425690 779326706 776694870
833.3G76694870j355591o05163j168518k908478j930390k403412k873611k122650k529755
$$ 776694870 775339279 774734116 773565598 770657120 768726730 766323318 763449707 761327057 758797302
841.9G58797302k661667k664566j280288O43005J150589M58145O04553J456986J171570
$$ 758797302 756135635 753471069 752190781 752833786 753984375 754442520 755047073 756504059 757675629
850.6G57675629J746673J495438L68423J273728K387771K117386K081833K410812J764451
$$ 757675629 759422302 760917740 761286163 762559891 764947662 767065048 769146881 771557693 773322144
859.3G73322144J721649K024231K068481J568833O92672R39484R43451J5411K14081
$$ 773322144 775043793 777068024 779136505 780705338 781398010 782337494 783280945 783296356 783510437
868G83510437J9455j109161R27352J733323L62396O58646J222763J581344L90244l13340
$$ 783510437 783529892 782420731 783348083 785081406 785443802 786102448 787325211 788906555 789296799 788983459
877.6G88983459p16323j125336j038742j524582j231918j863556k205506j448364j342163
$$ 788983459 788267136 787141800 786103058 784578476 783346558 781483002 779277496 777829132 776486969
886.3G76486969j281662r3002q0109o59943j51443j270294o63147M02069q927N44205
$$ 776486969 775205307 775112305 775032196 774372253 774220810 772950516 772287369 772689438 772680511 773224716
895.9G73224716L26157M07104Q29850R14611j53503p64771P0191o44760r54743k40478
$$ 773224716 773550873 773957977 774787827 775702438 775548935 774784164 774854355 774209595 773254852 773014374
905.6G73014374o57807j717300j880417j970444j567688j853408k677460j996384k320022
$$ 773014374 772356567 770639267 768758850 766788406 765220718 763367310 760689850 758693466 756373444
914.3G56373444j632004r24301j595002j830368k373352k140274j803436j315994r76639
$$ 756373444 754741440 753817139 752222137 750391769 748018417 745878143 744074707 742758713 741782074
922.9G41782074j548615j983566j514664n09643o15768j568146j427918M7303P00149
$$ 741782074 740233459 738249893 736735229 736225586 735609818 734041672 732613754 732661057 733361206
931.6G33361206O46515l738j94550J442413K081452K111282K362671K345200K278213
$$ 733361206 734007721 734003983 733809433 735251846 737333298 739444580 741807251 744152451 746430664
940.3G46430664J861115K403945K780304K378464J791992J931534K343140J452789
$$ 746430664 748291779 750695724 753476028 755854492 757646484 759578018 761921158 763373947
948G63373947J226273Q80203O76804J120376P86133j56479n56183k80151p40128j073303
$$ 763373947 764600220 765480423 766157227 767277603 768063736 767907257 767351074 767070923 766330795 765257492
957.7G65257492j259384p75986j362533k357331j800384k033997k192001k156677j616669
$$ 765257492 763998108 763222122 761859589 759502258 757701874 755667877 753475876 751319199 749702530
966.3G49702530j629105j350784l84827j426696j434021q64182j041565l00674J53656
$$ 749702530 748073425 746722641 746337814 744911118 743477097 742612915 741571350 741270676 741424332
975G41424332q98362j394882J13297K54974r14612q04748m25492j085662j561509j246566
$$ 741424332 740525970 739131088 739244385 739499359 738584747 737779999 737354507 736268845 734707336 733460770
984.7G33460770j002274j784668l073425j940308j467590l160553l634338l797074
$$ 733460770 732458496 730673828 727600403 725660095 724192505 721031952 717397614 713600540
992.4G13600540n190048p944489j0093460p471008J256256Q246536P810746L971557
$$ 713600540 708410492 700466003 690372543 682901535 684157791 692404327 700215073 704186630
1000.1G04186630J371537N29327J040878J42136j999359j994629n25437k05001o06003
$$ 704186630 705558167 706087494 707128372 707270508 705271149 703276520 702751083 702546082 701940079
1008.8G01940079m16947r16977j265869r83810j623688j286087q45795j336212j404037
$$ 701940079 701523132 700606155 699340286 698356476 696732788 695446701 694600906 693264694 691860657
1017.5F91860657q25806j575470l218918j885299j024781j726532k067642j684723
$$ 691860657 691034851 689459381 686240463 684355164 683330383 681603851 679536209 677851486
1025.2F77851486j047134j729279j775207k339478j229400k80838k433777k593155
$$ 677851486 676804352 675075073 673299866 670960388 669730988 669450150 667016373 664423218
1032.9F64423218j518479j364669k006836j495743q22296n62516r46655j570587k29721
$$ 664423218 662904739 661540070 659533234 658037491 657215195 656652679 655706024 654135437 653905716
1041.6F53905716L41339O55975l27835j373291k01187J306153J313934l01285L10440
$$ 653905716 654247055 654903030 654575195 653201904 653000717 654306870 655620804 655319519 655629959
1050.2F55629959J350937R36279k95562m0284J158753P81097J31378p58133j54190
$$ 655629959 656980896 657917175 657621613 657581329 658740082 659521179 659652557 658894424 658740234
1058.9F58740234J70746L17383N1117n04684L77197q5068R5825p47986j123809n21698
$$ 658740234 658910980 659228363 659279480 658774796 659151993 659066925 659162750 658414764 657290955 656769257
1068.6F56769257j010819n51834q63800m39606j116333j332626o09894m28619K23999
$$ 656769257 655758438 655206604 654342804 653903198 652786865 651454239 650844345 650415726 650639725
1077.2F50639725q80661q45948j076583j145325q99887q98133N3025r85947j904983
$$ 650639725 649759064 648913116 647836533 646691208 645791321 644893188 644946213 643960266 642055283
1085.9F42055283j684571j470184k680092l120003k775268l664627m675942n878792
$$ 642055283 640370712 638900528 636220436 633100433 630325165 626660538 621984596 616105804
1093.6F16105804o126861p540894p811012p929344p791405q358726j0646553r420510
$$ 616105804 609978943 602438049 594627037 586697693 578906288 570547562 559901009 550480499
1101.4E50480499j0638046r380188r300117r815903r044228j1476860r644699j0437775
$$ 550480499 539842453 530462265 521162148 511346245 502302017 490825157 481180458 470742683
1109.1D70742683r059143r111213p678147n556106o880722l174019l243103p01485
$$ 470742683 461683540 452572327 444894180 439338074 432457352 429283333 426040230 425338745
1116.8D25338745j291656n96466J136245O20194K778892J137123K987900J126633J365929
$$ 425338745 424047089 423450623 424586868 425207062 427985954 429123077 432110977 433237610 434603539
1125.5D34603539J391563k0790L33710j981621N70755r39713o15310k200737l375512
$$ 434603539 435995102 435974312 436308022 434326401 434897156 433957443 433342133 431141396 427765884
1134.1D27765884k085266m342918k480927m269752k956123l708077l471184k924347
$$ 427765884 425680618 421337700 418856773 414587021 411630898 407922821 404451637 401527290
1141.9D01527290n040092k369270m383698k514877l338623k179222p98035k418213
$$ 401527290 396487198 394117928 389734230 387219353 383880730 381701508 380903473 378485260
1149.6C78485260l05519j641312J168480O29883J831894J478119J072197L156471J504898
$$ 378485260 378179741 376538429 377706909 378336792 380168686 381646805 382719002 385875473 387380371
1158.3C87380371M233437K645569L837852L170357L418693N769425M407119N572701
$$ 387380371 391613808 394259377 398097229 401267586 404686279 410455704 414862823 420435524
1166D20435524L500252O025581O257401P069969P740707N909310P871818P045059P973061
$$ 420435524 423935776 429961357 436218758 443288727 451029434 456938744 464810562 471855621 479828682
1174.6D79828682P340927Q870659Q358269P216415Q360176O410675P604561P021370
$$ 479828682 487169609 496040268 504398537 511614952 519975128 526385803 533990364 541011734
1182.4E41011734O978683N736084N530739O473275N098037N729828M296799M623451
$$ 541011734 547990417 553726501 559257240 565730515 570828552 576558380 580855179 585478630
1190.1E85478630M191628L992767M194183L352318M036484L398895M648399M248276
$$ 585478630 589670258 593663025 597857208 601209526 605246010 608644905 613293304 617541580
1197.8F17541580M461289M562072L740883M667435L919907L986320K669830K377320
$$ 617541580 622002869 626564941 630305824 634973259 638893166 642879486 645549316 647926636
1205.5F47926636K814483K582550K904969J988372K006608J712341K603683K365265
$$ 647926636 650741119 653323669 656228638 658217010 660223618 661935959 664539642 666904907
1213.2F66904907J532440J770020J143646J728440Q19549O08368P17239J23597N59463
$$ 666904907 668437347 670207367 671351013 673079453 673899002 674507370 675224609 675348206 675907669
1221.9F75907669N84488J106949O41708O98014Q61282N47943N02624K58255O14396
$$ 675907669 676492157 677599106 678240814 678938828 679800110 680348053 680850677 681108932 681723328
1230.6F81723328N63659N35050k86179k37274R01108J317596R68399M52500J034469
$$ 681723328 682286987 682822037 682535858 682298584 683199692 684517288 685485687 685938187 686972656
1239.3F86972656P27082O87179O63757J78528j2359o1417N24750J30996K45820L68499
$$ 686972656 687699738 688386917 689050674 689229202 689216843 689155426 689680176 689811172 690056992 690425491
1248.9F90425491N59922P56149L07617L32718j29013L99933O56433N38483K07824m14734
$$ 690425491 690985413 691741562 692049179 692381897 692252884 692652817 693309250 693847733 694055557 693640823
1258.5F93640823J76621O63528J056214N87768O74820Q49610P92388R73664M81415
$$ 693640823 693817444 694480972 695537186 696124954 696799774 697649384 698441772 699415436 699896851
1267.2F99896851Q89968P08619N74951O44455M75769J020660J199722J323319J284943
$$ 699896851 700786819 701495438 702070389 702714844 703190613 704211273 705410995 706734314 708019257
1275.9G08019257J385421J086350R57413J412963J384125R24454J012802J753922J480941
$$ 708019257 709404678 710491028 711448441 712861404 714245529 715169983 716182785 717936707 719417648
1284.6G19417648J147461J036835Q86078J378097J896668J704483J280517J445771
$$ 719417648 720565109 721601944 722488022 723866119 725762787 727467270 728747787 730193558
1292.3G30193558J060180R21021R99603P59354J072922J069946J103134J251984J280899
$$ 730193558 731253738 732174759 733174362 733933716 735006638 736076584 737179718 738431702 739712601
1301G39712601J148452Q27408O53153L67508K37579L19824O19889M91638R2315O83594
$$ 739712601 740861053 741688461 742341614 742709122 742946701 743266525 743886414 744378052 744470367 745153961
1310.6G45153961Q67462K92359J96380N86319O37665O15845J105728O64215n48172
$$ 745153961 746021423 746313782 746510162 747096481 747734146 748349991 749455719 750119934 749571762
1319.3G49571762j08490Q94089M12674J13449L14407N03159J181106P16858M55094
$$ 749571762 749463272 750357361 750770035 750883484 751197891 751701050 752882156 753599014 754054108
1328G54054108J045913Q99964O5155q94623j48544L9596l61557K23618K98309O06766
$$ 754054108 755100021 755999985 756065140 755170517 755021973 755061569 754700012 754923630 755221939 755828705
1337.6G55828705K79465j023560j352844Q46176J488418J48316k78626l02887l28369
$$ 755828705 756108170 755084610 753731766 754577942 756066360 756214676 755936050 755633163 755304794
1346.3G55304794m86755k18201l64074n14756L84217j13449J97296M31213m01840m99344
$$ 755304794 754818039 754599838 754235764 753721008 754105225 753991776 754189072 754620285 754218445 753719101
1355.9G53719101j20316l54995p71103M17251m87365r21479p38678k128219J289291
$$ 753719101 753598785 753243790 752472687 752889938 752402573 751481094 750742416 748614197 749903488
1364.6G49903488J106796N5161M74091j499100j912613j92948o01730J38474L24325
$$ 749903488 751010284 751065445 751539536 750040436 748127823 747934875 747333145 747471619 747795944
1373.3G47795944k820205k016526O45752R19495l71552m08172O04019l30963r34830
$$ 747795944 744975739 742959213 743604965 744524460 744152908 743744736 744348755 744017792 743082962
1382G43082962j550903m73633N86395J159210O24085k762222J098175K229232N94864
$$ 743082962 741532059 741058426 741644821 742804031 743428116 740665894 741764069 743993301 744588165
1390.7G44588165Q4687Q67157J854095j778183l255920O48269Q57544m25415m029617
$$ 744588165 744672852 745540009 747394104 745615921 742360001 743008270 743865814 743440399 739410782
1399.3G39410782o97251J546021l9062J42822O99234k604141r29108J860580M03138
$$ 739410782 738713531 740259552 740220490 740363312 741062546 738458405 737529297 739389877 739793015
1408G39793015J02615o05698q70514q30307q18405M93317j72959N61524Q52127R52682
$$ 739793015 739895630 739289932 738419418 737589111 736770706 737264023 737091064 737652588 738504715 739457397
1417.7G39457397K370606o146164j065216L133469J362762J54572k721634N50155K008286
$$ 739457397 741828003 735681839 734616623 737750092 739112854 739267426 736545792 737095947 739104233
1426.3G39104233K18582J429214P41806j748275Q27560K292786O30493M3640K921448
$$ 739104233 739322815 740752029 741493835 739745560 740573120 742865906 743496399 743540039 746461487
1435G46461487K271042p635269l17154L653488J421127O45294R31778N03845J212922
$$ 746461487 748732529 741097260 740780106 744433594 745854721 746500015 747431793 747935638 749148560
1443.7G49148560R93347P85370J793594k365k885437P76825J429901j56326P9651P45925
$$ 749148560 750141907 750927277 752720871 752718506 749833069 750609894 752039795 751883469 751963120 752709045
1453.3G52709045K027207K923965J794968m369965m650116K499085J989517L005524
$$ 752709045 754736252 757660217 759455185 755085220 750435104 752934189 754923706 757929230
1461.1G57929230J317215O63910K524795m310608j812439L023453K132263J520920
$$ 757929230 759246445 759910355 762435150 758124542 756312103 759335556 761467819 762988739
1468.8G62988739J873322M363784K446900k319336k699509K522049M482346k634507
$$ 762988739 764862061 769225845 771672745 769353409 766653900 769175949 773658295 771023788
1476.5G71023788L71018L183212J344223J446762m70581K61078J939697J360474J292801
$$ 771023788 771394806 774578018 775922241 777369003 776898422 777159500 779099197 780459671 781752472
1485.2G81752472K040405j221008k019501K791062m586487n787201L036804K630844
$$ 781752472 783792877 782571869 780552368 783343430 778756943 772969742 776006546 778637390
1492.9G78637390J073227K202988J188507q659058L569107J80359n067978K140427
$$ 778637390 779710617 781913605 783102112 774443054 778012161 778192520 773124542 775264969
1500.6G75264969j83716r96475L57895L451614L916550r341202j2372513J261749L306809
$$ 775264969 775081253 774084778 774442673 777894287 781810837 772469635 760097122 761358871 764665680
1509.3G64665680o96259K743760j112671l767166J856918n00183N7068m955750o194305
$$ 764665680 763969421 766713181 765600510 761833344 763690262 763190079 763247147 758291397 752097092
1518G52097092O934051N659485l735275r715424m40368M882125M198304m704132j167222
$$ 752097092 759031143 764690628 760955353 751239929 750799561 755681686 759879990 755175858 754008636
1526.6G54008636J172715l146363j18560J761322J008148M29687k482986p499237K877807
$$ 754008636 755181351 752034988 751916428 753677750 754685898 755115585 752632599 745133362 748011169
1535.3G48011169K860413K683716M617615n829010j3052903L392945r156p12432M031295
$$ 748011169 750871582 753555298 758172913 752343903 739291000 742683945 742674789 741962357 745993652
1544G45993652p05719m275436M036255K460098K492142j315308m974594L008041L093415
$$ 745993652 745287933 741012497 745048752 747508850 750000992 748685684 743711090 746719131 749812546
1552.7G49812546K776031n982513P1487P308808N682830j316223j8241882q83713Q046723
$$ 749812546 752588577 746606064 746677551 753986359 759669189 758352966 740111084 739227371 747274094
1561.4G47274094N158691K935486J434708k847748o05622L231354K776642Q10089r711304
$$ 747274094 752432785 755368271 756802979 753955231 753349609 756580963 759357605 760167694 750456390
1570G50456390J888657K997894n798J004486K471924J322708j4523468K255478K875748
$$ 750456390 752345047 755342941 755337143 756341629 758813553 760136261 745612793 747868271 750744019
1578.7G50744019k97089n64880j369400j11084j615448r67408j453705j760406r20410
$$ 750744019 750446930 749882050 748512650 748401566 746786118 745818710 744365005 742604599 741684189
1587.4G41684189j639862r25675k387695j284790k135696j382981j475219k965546
$$ 741684189 740044327 739118652 736730957 735446167 733310471 731927490 730452271 727486725
1595.1G27486725j273346k481079j102677j790008j187439k201614k481995j018372
$$ 727486725 726213379 723732300 722629623 720839615 719652176 717450562 714968567 713950195
1602.8G13950195l327713j347503j427613j412506l034286j460495j914597l581009
$$ 713950195 710622482 709274979 707847366 706434860 703400574 701940079 700025482 696444473
1610.5F96444473m35409k490158p87278j363906J521759K53601j5459519K888718M75922
$$ 696444473 696009064 693518906 692731628 691367722 692889481 693143082 677683563 680572281 681048203
1619.2F81048203J21612j215515Q94318j360627q781662J931687R56115J581650m209594
$$ 681048203 681169815 679954300 680848618 679487991 670706329 672638016 673594131 675175781 670966187
1627.9F70966187k718583J008835j288757l07007p87964K274170J977158q459931l201141
$$ 670966187 668247604 669256439 667967682 667660675 666872711 669146881 671124039 662664108 659462967
1636.6F59462967J958160J055451J213455J379471n89676J301193r0790K514496L511810
$$ 659462967 661421127 662476578 663690033 665069504 664479828 665781021 665690231 668204727 671716537
1645.3F71716537l430557k373047l045425M084015L655014M670486N238419p791672
$$ 671716537 668285980 665912933 662867508 666951523 670606537 675277023 680515442 672723770
1653F72723770j1974792N988922O532135L105469K149353J531143J587066K299805
$$ 672723770 660748978 666737900 673270035 676375504 678524857 680056000 681643066 683942871
1660.7F83942871K729263L54309k742309L826523K531662K040558M068603L566055
$$ 683942871 686672134 687026443 684284134 688110657 690642319 692682877 696751480 700317535
1668.4G00317535m138412o27670M705352n73501L851013N862350q89511l897094M187240
$$ 700317535 696179123 695551453 700256805 699683304 703534317 709396667 708507156 704610062 708797302
1677.1G08797302M364777K575760J969986o88248M877396P890167L8452j6010361N354233
$$ 708797302 713162079 715737839 717707825 717019577 721896973 729787140 729825592 713815231 719169464
1685.8G19169464R381485M458618J016312K044220M83475L507385L552704L556747
$$ 719169464 728550949 733009567 734025879 736070099 736553574 740060959 743613663 747170410
1693.5G47170410N597992L928833r370270L666077Q214111P568283l368072j0749436
$$ 747170410 752768402 756697235 747326965 750993042 759207153 766775436 763407364 752657928
1701.2G52657928J1516724P171097K724380J455918K068863j305237K089004N075074
$$ 752657928 764174652 771345749 774070129 775526047 777594910 776289673 778378677 783453751
1708.9G83453751J217956k92282K834320L246613L264923j467285j222687O047897
$$ 783453751 784671707 784379425 787213745 790460358 793725281 792257996 791035309 797083206
1716.6G97083206J658478j3729782M387359N720902K737045J987992j09330j182785
$$ 797083206 798741684 785011902 789399261 795120163 797857208 799845200 799735870 798553085
1724.3G98553085J258316J326447O16684J415863L024368k341232j862717N829315
$$ 798553085 799811401 801137848 801754532 803170395 806194763 803853531 801990814 807820129
1732H07820129M839936o654129j2444764P584687N265198J825408L407593l976211
$$ 807820129 812660065 806005936 793561172 801145859 806411057 808236465 811644058 807667847
1739.8H07667847m074555O680756L520965k819595J27945L892441K050857J208649
$$ 807667847 803593292 810274048 813795013 810975418 811103363 814995804 817046661 818255310
1747.5H18255310O0120k31095M351425k433319k369384N236129K515641K693863K562408
$$ 818255310 818315430 818084335 822435760 820002441 817633057 822869186 825384827 828078690 830641098
1756.2H30641098l652420Q09631K852936K702942L255615n831299j710357M064331
$$ 830641098 826988678 827798309 830651245 833354187 836609802 830778503 829068146 833132477
1763.9H33132477J125641N87921K432098J255264m649505L351364N820999j185531
$$ 833132477 834258118 834846039 837278137 838533401 833883896 837235260 843056259 841870728
1771.6H41870728q667450k011185O852569J686783k551498K338791R97238J055756
$$ 841870728 833203278 831192093 838044662 839731445 837179947 839518738 840515976 841571732
1779.3H41571732l62931k790374J175308K608108J762009j870575j202393J855011
$$ 841571732 841208801 838418427 839593735 842201843 843963852 842093277 840890884 842745895
1787H42745895M70047M50364J640243L09677N9433n648804m56314N542756O15386j746292
$$ 842745895 843215942 843666306 845306549 845616226 845675659 840026855 839570541 845113297 845728683 843982391
1796.7H43982391J806794K457428j430512k591934J785126j547776k5787K254105K37274
$$ 843982391 845789185 848246613 846816101 844224167 846009293 844461517 844435730 846689835 846927109
1805.3H46927109N94101R1629l96805J315765P11289k554093l65524Q81424M08783
$$ 846927109 847521210 847612839 847216034 848531799 849243088 846688995 846323471 847204895 847613678
1814H47613678O12259n2033O41098q25424q1863R80682j4725R27735j40839J953507
$$ 847613678 848225937 848173904 848815002 847989578 847907715 848888397 848873672 849801407 849660568 851614075
1823.7H51614075J974716n209580m59976L184662K760239j160889q083038J819916
$$ 851614075 853588791 848379211 847919235 851103897 853864136 852703247 844620209 846440125
1831.4H46440125L296585O24618Q51288N12314R20715o99997j589737P49207L00369
$$ 846440125 849736710 850361328 851212616 851724930 852645645 851945648 850355911 851105118 851405487
1840.1H51405487P47604O49262K479629k91595r539413L720016M305191o38504j351929
$$ 851405487 852153091 852802353 855281982 854990387 845450974 849170990 853476181 852837677 851485748
1848.7H51485748N33066J010056j59378J21002k06604l03421l5477N9815K51693K50321
$$ 851485748 852018814 853028870 852869492 852990494 852783890 852480469 852444992 852504807 852756500 853006821
1858.4H53006821M93545j07574N0049o5308K35367K42004M66232P02210n11398O68411
$$ 853006821 853500366 853392792 853442841 853377533 853612900 853854904 854321136 855023346 854511948 855180359
1868H55180359k859650l543548K148513K196045J059189r9411q1177J20850j6327j30463
$$ 855180359 852320709 848777161 850925674 853121719 854180908 854081497 854000320 854121170 854104843 853974380
1877.7H53974380j20391k98615l33252L10517j95008N04303K79389q8196N75409K28805
$$ 853974380 853853989 853555374 853222122 853532639 853337631 853841934 854121323 854033127 854608536 854837341
1887.3H54837341J576615r53141l951416J199875J293869j34582R94873m06952j360931
$$ 854837341 856413956 855460815 851509399 852709274 854003143 853868561 854863434 854456482 853095551
1896H53095551Q11233L23029L2425N10025J94397j36261l90549l5019n60227k30102
$$ 853095551 853906784 854229813 854262238 854772263 854966660 854830399 854439850 854404831 853844604 853614502
1905.6H53614502M30603j66779L6316K75345r61914m9820J237488j52130K59094Q39
$$ 853614502 854045105 853878326 853914642 854189987 853228073 853178253 854415741 854263611 854522705 854523544
1915.3H54523544N59922J395797m056244j630401J983185J401519J233597k165756
$$ 854523544 855083466 856479263 852423019 850792618 852775803 854177322 855410919 853245163
1923H53245163j468201J262360Q06503M25339K14920k88849m56467l50112m52424l37295
$$ 853245163 851776962 853039322 853845825 854271164 854486084 854197235 853740768 853390656 852938232 852600937
1932.6H52600937j68686L63617L40500K27356J99966J20316O0425R4757J698913j076431
$$ 852600937 852432251 852795868 853136368 853363724 853563690 853684006 853744431 853839188 855538101 854461670
1942.3H54461670l854904J436462J108170j057892m28009M53720O20880Q1711J9150
$$ 854461670 850606766 852043228 853151398 852093506 851665497 852119217 852740097 852821808 852840958
1951H52840958J6632m4480Q6975k69851p50962j63192m196k36588M64783L05710k24152
$$ 852840958 852857590 852813110 852900085 852630234 851879272 851716080 851711884 851475296 851940079 852245789 852021637
1961.6H52021637K5940O09283N63584K32315j13144j541214j007691N39246K67410
$$ 852021637 852047577 852656860 853220444 853452759 853339615 851798401 850790710 851329956 851597366
1970.2H51597366j29852k37808j59073J07117K06070M37851M08706n2261k78244m11301
$$ 851597366 851467514 851229706 851070633 851177750 851383820 851821671 852230377 852178116 851899872 851488571
1979.9H51488571k90298l4485l25012o68412l41491K08130M39987O16073l14865o38504
$$ 851488571 851198273 851163788 850838776 850170364 849828873 850037003 850476990 851093063 850778198 850139694
1989.5H50139694J418381O97784k407302p93076P69272J4953m76913l35083N8594j87607
$$ 850139694 851558075 852255859 849848557 849055481 849824753 849839706 849362793 849027710 849086304 848898697
1999.2H48898697J25427N66254J83945K70843L6850k31018m92935p31430l88565k53144
$$ 848898697 849024124 849590378 849774323 850045166 850082016 849850998 849358063 848626633 848238068 847984924
2008.8H47984924K76642L91464l9749J64948o104k67944N62744L59726q80890m94003
$$ 847984924 848261566 848653030 848613281 848778229 848772125 848504181 849066925 849426651 848545761 848051758
2018.5H48051758l66516j2207J06582o79092m71420N9738P72781M36936j55411J83639
$$ 848051758 847685242 847673035 847779617 847100525 846629105 846688843 847461624 847898560 847743149 847926788
2028.1H47926788J06278j53504n40313m93393l59268j47248j53656k98462q0795j5106
$$ 847926788 848033066 847879562 847339249 846845856 846486588 846339340 846185684 845887222 845806427 845791321
2037.7H45791321M14276O24542L83911o42547m20151K94342n63278k13700j21078k65503
$$ 845791321 846205597 846830139 847214050 846571503 846151352 846445694 845882416 845668716 845547638 845282135
2047.4H45282135m272K2277K26593j03683l5400K4490L26004k3727m56696j7166m85535
$$ 845282135 845277863 845300140 845526733 845423050 845387650 845412140 845738144 845714417 845257721 845240555 844755020
2058H44755020l25241j33591o5155J89438J0224K56271n6152o89850l04337K97928
$$ 844755020 844429779 844296188 844231033 844420471 844430695 844686966 844630814 843940964 843636627 843934555
2067.6H43934555j05667l41721j31225l42179p49588r16748k79617j6174Q926O0959
$$ 843934555 843828888 843487167 843355942 843013763 842264175 841347427 841067810 841051636 841060562 841121521
2077.3H41121521n0049J12229L00979N5695n00183j97678j93405m47769k86637j10397
$$ 841121521 841071472 841183701 841484680 841540375 841040192 840842514 840649109 840201340 839914703 839804306
2086.9H39804306J18027M7607j4725k65121L40881L55835k84805k7466j88141J50299
$$ 839804306 839922333 839969940 839955215 839690094 840030975 840386810 840102005 840074539 839886398 840036697
2096.6H40036697M5395k26440j5793L052L98254L72772N15747L53928n2948J2665L3722
$$ 840036697 840082092 839855652 839839859 839842911 840241165 840613937 841129684 841483612 841430664 841443329 841477051
2107.2H41477051j68762j97068k7084l17841N5085J79062k4109J44653L22037N78231
$$ 841477051 841308289 841111221 841084137 840766296 840821381 841000443 840976334 841120987 841443024 842021255
2116.8H42021255K39182R6283j62735M9057Q5754n63507l09982k43530k45972k76794
$$ 842021255 842260437 842356720 842193985 842243042 842328796 841765289 841455307 841211777 840965805 840689011
2126.5H40689011k060J72653J64490M22287M9972J00937K18048N6305m49600o52237
$$ 840689011 840686951 840859604 841024094 841446381 841496353 841597290 841815338 841871643 841422043 840769806
2136.1H40769806r8953L19519L20129k15759J1902N7220K16065O05545L06396J40228
$$ 840769806 840670853 840990372 841310501 841094742 841106644 841163864 841379929 841985474 842291870 842432098
2145.8H42432098j97677k9602j48773j60523j4725k8915J48010j03760M97513N02243
$$ 842432098 842234421 842204819 842056046 841895523 841880798 841851883 841999893 841896133 842393646 842895889
2155.4H42895889J62812l9368j78223L55683m9363k37121k37580j69219N1956J28250
$$ 842895889 843058701 843019333 842841110 843196793 843147430 842910309 842672729 842503510 842555466 842683716
2165H42683716J09711q6518J76850m9820j25046p3090J17645o027m90875k34680l60642
$$ 842683716 842793427 842706909 842883759 842833939 842708893 842635803 842753448 842747421 842256546 842021866 841661224
2175.6H41661224P096M1809j26877p0877m8828P34710O14090K68555l23639o39267
$$ 841661224 841668320 841710129 841583252 841512375 841463547 842198257 842812347 843080902 842757263 842117996
2185.3H42117996j85241P4005K76336j61667k5634K85568K93426L88489K14386J30768
$$ 842117996 841932755 842006760 842283096 842121429 842095795 842381363 842674789 843063278 843277664 843408432
2194.9H43408432K48108L05405p3243j94778j51596K09503J97449j85547j19476P4844
$$ 843408432 843656540 843961945 843888702 843693924 843542328 843751831 843949280 843763733 843644257 843719101
2204.6H43719101N69458K37656K13394K11868j07880Q1253q9798J82648j13449l35846
$$ 843719101 844288559 844526215 844739609 844951477 844843597 844924850 844835052 845017700 844904251 844568405
2214.2H44568405j33743J20163M39148j18790k59247j13067K59857L10440J06506K4262
$$ 844568405 844434662 844554825 844993973 844875183 844615936 844502869 844762726 845073166 845179672 845203934
2223.9H45203934j21002r5749k97470J449k14691M58K88849j03150l1586k91214P0801
$$ 845203934 845082932 844987183 844689713 844691162 844476471 844476929 844765778 844662628 844631042 844339828 844410629
2234.5H44410629Q4381J38398J30615m56162j58386K50168K73209l89252j18561l6392
$$ 844410629 844495010 844633408 844764023 844307861 844149475 844399643 844672852 844283600 844165039 844128647
2244.1H44128647l27683J90125K42233K7619n81971L2959L74756O0654O6376l00370
$$ 844128647 843800964 843991089 844233322 844260941 843678970 843711929 844086685 844147339 844213715 843913345
2253.8H43913345Q7967o0196k13928J2665M43497J33667l45536K09809N3253K05307
$$ 843913345 844001312 843941116 843727188 843739853 844183350 844317017 843971481 844181290 844234543 844439850
2263.4H44439850k51923k07138J14746m15725J46713K49176P0038m273J90888j79520
$$ 844439850 844187927 843980789 844095535 843679810 843826523 844075699 844145737 844141464 844332352 844152832
2273H44152832k09808L04489K1286K57110l78570l33557O180L2196K96936L5781K01569
$$ 844152832 843943024 844247513 844268799 844525909 844147339 843813782 843819962 843852158 844149094 844184875 844386444
2283.7H44386444j80893J99814J0605k08054k35290n80902O93969K75040n493k09808
$$ 844386444 844205551 844405365 844415970 844207916 843972626 843391724 844085693 844360733 844355240 844145432
2293.3H44145432k94571K33306l30657J53732L1433K90985k05383m51050M82788j27335
$$ 844145432 843850861 844084167 843753510 843907242 843938675 844229660 844024277 843573227 844056015 843928680
2302.9H43928680N875j18027J62125k14462m49677J0681m27017M17252j22605l43094
$$ 843928680 843934555 843816528 843978653 843764191 843314514 843325195 842898178 843315430 843192825 842849731
2312.6H42849731n41992n94253j72272o02417J092072P21054m86985o05163k09198
$$ 842849731 842307739 841713486 841541214 840938797 842030869 842751923 842264938 841659775 841450577
2321.3H41450577L22342r53446m02221P6065L12729M98428m76837q77610m47845O15921
$$ 841450577 841772919 840819473 840417252 840493317 840806046 841304474 840827637 839950027 839502182 840118103
2330.9H40118103R14764l69873j212844R09576P36694j541366j067963R40552Q53500
$$ 840118103 841032867 840662994 839450150 840359726 841096420 839555054 838487091 839427643 840281143
2339.6H40281143j743545n28183J016769J397858K51541j077347M12445p79800R88540
$$ 840281143 838537598 838009415 839026184 840424042 840675583 839598236 840010681 839230881 840219421
2348.3H40219421L360444J419219j153717j122360L29209p0038k291413j856918m03442
$$ 840219421 843579865 844999084 843845367 842723007 843052216 842982178 840690765 838833847 838430405
2356.9H38430405K7542J156997J67160m22210j47248j747207M28238J272506L5401
$$ 838430405 838457947 839614944 839782104 839359894 839212646 837465439 837893677 839166183 839201584
2365.6H39201584L45001N3558J221009P24640q65631k34910N49241O98471K02255k26593
$$ 839201584 839546585 839600143 840821152 841545792 840680161 840445251 840994492 841692963 841895218 841668625
2375.3H41668625M67529O82373L30277N10788O37359L90702Q2321M00085p4005k95715
$$ 841668625 842136154 842818527 843148804 843659592 844296951 844687653 844769974 845170059 845096054 844800339
2384.9H44800339M75311m8447P9499L32641q6746J58234l7690k89382k63291k4414
$$ 844800339 845275650 845227203 845306702 845639343 845552597 845710831 845673141 845383759 845120468 845096054
2394.6H45096054J11466R765n4626L77121K96478p31812k82516J24435q7738p2250
$$ 845096054 845207520 845217285 845162659 845539780 845836258 845104446 844821930 844946365 844858627 844786377
2404.2H44786377j79062M5776K7161L06778K94037j10321o15082o75430R9640P4691
$$ 844786377 844607315 844653091 844680252 844987030 845281067 845170746 844555664 843880234 843979874 844054565
2413.8H44054565K21863K98081j82267k21939J31684N18951N9662m80957j25732K24227
$$ 844054565 844276428 844574509 844392242 844170303 844301987 844820938 844880600 844399643 844273911 844498138
2423.5H44498138k60238l88489k94876k62909K57034K86179k1515m77219k54440O5155
$$ 844498138 844237900 843849411 843554535 843291626 843548660 843834839 843813324 843336105 843081665 843146820
2433.1H43146820k14767o5308q3542n4397k34070l17688K06909M69971k5711m65012
$$ 843146820 842932053 842866745 842783203 842728806 842494736 842177048 842383957 842853928 842828217 842363205
2442.8H42363205K49786L76129k62832m00849p6675M3182k33993l51334l15094L9597
$$ 842363205 842612991 842989120 842726288 842325439 842248764 842291946 842057953 841706619 841391525 841431122
2452.4H41431122q2092O5155L17993r1248L662m0588L8528q6212m23279k73132k54974
$$ 841431122 841349030 841414185 841732178 841640930 841644592 841604004 841642532 841556320 841133041 840859909 840604935
2463H40604935k72370k54287J11465K00958j6098k6474K02027K72903q5907k20337
$$ 840604935 840332565 840078278 840189743 840390701 840374603 840348129 840550156 840823059 840737152 840516815
2472.7H40516815n97610l88947n2719l08914M2496J28250j00479o5384K05078K96936
$$ 840516815 839919205 839530258 839477539 839168625 839211121 839339371 839238892 839173508 839378586 839675522
2482.3H39675522j6022j42364l20359l50570k52076o30188n03158M6692J27258L74222
$$ 839675522 839659500 839517136 839196777 838846207 838594131 837963943 837460785 837507477 837634735 838008957
2492H38008957P4921l2425L12194k24990j36948J81961P9651l99475p72171l72162
$$ 838008957 838083878 838051453 838363647 838138657 838001709 838183670 838263321 837863846 837091675 836719513
2501.6H36719513l34473j86767L3340K18582J90583J91040L79181n265o561k99759
$$ 836719513 836385040 836198273 836231613 836450195 836640778 836831818 837210999 837205734 837199173 836899414
2511.2H36899414m26712j63727l53775k07596J45646J54342k77481K52762M14352l55987
$$ 836899414 836472702 836308975 835955200 835747604 835893250 836047592 835770111 836022873 836437225 836081238
2520.9H36081238l28293j64642m5777k24838k74735l69415k22778J38473j67694J65863
$$ 836081238 835752945 835588303 835542526 835317688 835042953 834673538 834450760 834589233 834421539 834587402
2530.5H34587402L02582j24817j15356J55182j03226m19464j62735k46964J16806Q5755
$$ 834587402 834889984 834765167 834649811 834804993 834701767 834282303 834119568 833872604 833989410 834075165
2540.2H34075165m07028j09559M2573j62583l42331K07825L41568k41623j30386M3869
$$ 834075165 833668137 833558578 833601151 833438568 833096237 833304062 833645630 833404007 833273621 833317490
2549.8H33317490j76468j81809o256k58026l46222N2567L08532N2719k32391j07498
$$ 833317490 833141022 832959213 832952957 832694931 832348709 832401276 832709808 832762527 832530136 832422638
2559.5H32422638M3182q8043k48718Q5678p5150l30581l16468l91693L3722M3564J84326
$$ 832422638 832465820 832377777 832129059 832214737 832139587 831809006 831492538 831100845 831134567 831178131 831362457
2570.1H31362457L86277K75878j4267m75616k46124k2049J97525k41318p49512n47180
$$ 831362457 831748734 832024612 832010345 831534729 831288605 831266556 831464081 831222763 830473251 829926071
2579.7H29926071k59933K75039k1515l15017j5717N02701J32751m49523L23333Q3237
$$ 829926071 829666138 829941177 829919662 829604645 829588928 830091629 830224380 829774857 830098190 830181427
2589.4H30181427l68118m05350j50909K06909n20935n08499j41373J92947K95792p1793
$$ 830181427 829813309 829407959 829257050 829463959 828943024 828434525 828293152 828486099 828781891 828710098
2599H28710098m9133j61667l8528j05820n35278n79453l12271j51749j47400p4691
$$ 828710098 828660965 828499298 828460770 828354950 827819672 827240219 826927948 826776199 826628799 826554108
2608.6H26554108J14517L05786Q469J40609P4006o52695l75595j48011m61654l74603
$$ 826554108 826668625 826974411 826982880 827123489 827197495 826544800 826169205 826021194 825559540 825184937
2618.3H25184937r9335J21002J4267j23901L61099M71115j60141m36249m96292k49710
$$ 825184937 825085602 825206604 825220871 825096970 825458069 825929184 825769043 825332794 824836502 824586792
2627.9H24586792J21384j80512o05774l71246l13644m39682J33285L37219K60086K30484
$$ 824586792 824708176 824527664 823921890 823550644 823237000 822797318 822930603 823267822 823527908 823758392
2637.6H23758392j64032m80270k46201j40075o71692k74658q2322l31039K2430j60827
$$ 823758392 823594360 823114090 822867889 822727814 822056122 821781464 821699142 821368103 821390533 821229706
2647.2H21229706N264L69492K98309m5319m01764l65142j54419j31607n51987m07562
$$ 821229706 821234970 821604462 821902771 821857452 821455688 821090546 820936127 820804520 820252533 819844971
2656.9H19844971m05426m38004M7226N7297K40097K36664j22681k01187q4076j72348
$$ 819844971 819439545 819001541 819048767 819106064 819346161 819582825 819460144 819258957 819174881 819002533
2666.5H19002533j85852j49689l46985k95639n71747k94036L12194K57950j38702l99017
$$ 819002533 818816681 818666992 818320007 818024368 817452621 817158585 817470779 817728729 817590027 817191010
2676.1H17191010L63616L21732k54745r4452k15073m79584l73001k57950n34591k42997
$$ 817191010 817554626 817876358 817621613 817527161 817312088 816832504 816459503 816201553 815666962 815423965
2685.8H15423965J81427L22266L7613j01395K93122k27509k28805l67508p00226j67084
$$ 815423965 815605392 815927658 815965271 815863876 816156998 815929489 815700684 815333176 814632950 814465866
2695.4H14465866l31802p7439K72065o6071k44217P4616L79638J6022j45264k31476
$$ 814465866 814134064 814056625 814328690 814262619 814018402 814093018 814472656 814488678 814343414 814111938
2705.1H14111938n19790m14658j81427m76608m81033k21787k823L09983j07651k9907
$$ 814111938 813592148 813177490 812996063 812519455 812038422 811816635 811813812 812123795 812016144 811986237
2714.7H11986237J37100j08338j68380l37906k27280n89600n08499k29873l92990p7897
$$ 811986237 812123337 812014999 811846619 811508713 811281433 810691833 810183334 809953461 809560471 809482574
2724.4H09482574K6398K55890K11563k32086k57034n7297j85394n65949m74930k88162
$$ 809482574 809508972 809764862 809976425 809744339 809487305 809430008 809244614 808678665 808203735 807915573
2734H07915573q5373K2583p6828j24588j10245j6632m9972j8311N4627l3112k08206
$$ 807915573 807830200 807852783 807775955 807651367 807541122 807524490 807474518 807456207 807510834 807477722 807269516
2744.6H07269516k40936k89307l04108k23007k12478j86768l05634k51770r2468L25623
$$ 807269516 807028580 806739273 806435165 806212158 805999680 805812912 805507278 805255508 805163040 805488663
2754.3H05488663M52957O1874k51846p72781o86188o54297n05829J7929r2850j08871
$$ 805488663 805941620 806003494 805751648 804978867 804292679 803638382 803132553 803150482 803057632 802948761
2763.9H02948761K27814O57882k18200p87354j08108j57929j90048l31802n45502n34439
$$ 802948761 803176575 803834457 803616257 802828903 802720795 802562866 802372818 802041016 801495514 800961075
2773.5H00961075k15912p2479j11542J39008k10495j4573L54615J39923l29056n84030
$$ 800961075 800745163 800672684 800561142 800700150 800489655 800475082 800829697 800969620 800640564 800056534
2783.2H00056534p01981j137008n75028j75552K7542N4626j07345M07562J3809l38516
$$ 800056534 799354553 798217545 797642517 797466965 797494507 797549133 797441788 797849350 797863159 797524643
2792.8G97524643l13187k16827m23660p38984j81427j98287n55420o04020r8114o2408
$$ 797524643 797211456 796994629 796570969 795831985 795650558 795452271 794896851 794292831 794194717 794132309
2802.5G94132309m36020j26266L1128J74484l52402o88934m07410l22113m10538p21435
$$ 794132309 793696289 793570023 793601151 793775635 793423233 792734299 792326889 792004776 791594238 790872803
2812.1G90872803o29120n61600j21765L6392k07901j02463m6539r4986r01794j013489
$$ 790872803 790243683 789682083 789560318 789596710 789388809 789286346 789239807 789144821 788243027 787229538
2821.8G87229538n95551l48129j41373o21490p21817k17361M25949l84980r78469J76467
$$ 787229538 786633987 786285858 786144485 785522995 784801178 784583817 785009766 784624786 783646317 783822784
2831.4G83822784P8888o95572q10775n59540l66745j84555l50647j317062j442032
$$ 783822784 783901672 783206100 782395325 781835785 781469040 781284485 780933838 779616776 778174744
2840.1G78174744r33304p21817p26471j002426j276398j258545j004562j178284j638947
$$ 778174744 777241440 776519623 775793152 774790726 773514328 772255783 771251221 770072937 768433990
2848.8G68433990j658020j496887j253280n68619l34397P8965N04837k83585j60904
$$ 768433990 766775970 765279083 764025803 763457184 763122787 763201752 763706589 763423004 763262100
2857.4G63262100K87781M4327j53275l53317l23792o61773n55191K4948k00119p58591
$$ 763262100 763549881 763594208 763440933 763087616 762763824 762102051 761546860 761571808 761371689 760613098
2867.1G60613098n48553k38266o02494n18341l71627m35486n38712p46002p04041j93939
$$ 760613098 760064545 759826279 759223785 758705444 758333817 757898331 757359619 756613617 755909576 755715637
2876.7G55715637M92630k45361r49936l74756j64795l92990k57568K0141m79736n51529
$$ 755715637 756208267 755962906 755012970 754638214 754473419 754080429 753822861 753843002 753363266 752811737
2886.4G52811737k06680o51551p89413n44052l61405l53622l97186m28696p12585p11518
$$ 752811737 752605057 751953506 751164093 750620041 750258636 749905014 749507828 749079132 748366547 747655029
2896G47655029n32455l07160R7504j81732p81632q45413n66330k40020o99769q57391
$$ 747655029 747122574 746815414 746912918 746731186 745949554 745104141 744537811 744297791 743598022 742740631
2905.7G42740631j87225r3689j70593m53797o30340o04554l63998j69525j050949j013260
$$ 742740631 742553406 742459717 742289124 741835327 741204987 740600433 740236435 740066910 739015961 738002701
2915.3G38002701o70624r47952l72772l09983o79855n90363m88052l96423j66245L3493
$$ 738002701 737332077 736384125 736011353 735701370 735021515 734431152 733943100 733546677 733380432 733413925
2925G33413925p4997j75705r8037q9798k30027j72805k21177J5335Q12455O94656K43912
$$ 733413925 733338928 733163223 733065186 732975388 732745361 732572556 732351379 732366714 733179169 733873825 734117737
2935.6G34117737M76532K84729J26800N21317J82876R690L54538L79486N95932M13284
$$ 734117737 734594269 734878998 735005798 735527115 735709991 735719681 736074219 736453705 737049637 737462921
2945.2G37462921M501k06604k81143k3346j89056l12424n9509l31268n96924k10724
$$ 737462921 737467422 737260818 736979675 736956329 736767273 736454849 736395340 736064072 735467148 735256424
2954.8G35256424j48392m89502k69851k9374j0528M63409M05426j35116P3700J19400
$$ 735256424 735108032 734618530 734348679 734319305 734308777 734772186 735177612 735042496 735116196 735235596
2964.5G35235596L14254O17600J31149j54419J75858J091232J417999J113282N39856
$$ 735235596 735549850 736167450 736298599 736144180 736320038 737411270 738829269 739942551 740482407
2973.2G40482407r0485M36401Q74939J173706R33915J05819J49689K81906M58450N01404
$$ 740482407 740391922 740828323 741703262 742876968 743810883 743916702 744066391 744348297 744806747 745308151
2982.8G45308151M80500L80783N78308Q82950M00695M21067K02102K28577O26602K09274
$$ 745308151 745788651 746169434 746747742 747630692 748031387 748452454 748654556 748883133 749509735 749719009
2992.5G49719009M66919L34092j09864K76490K94265K66800K3041k92587L16314M96827
$$ 749719009 750185928 750520020 750410156 750686646 750980911 751247711 751270752 750978165 751294479 751791306
3002.1G51791306m1962m51584m58298J22223j96838m53720P27157Q55789k39257k97852
$$ 751791306 751749344 751297760 750839462 750961685 750764847 750311127 751038284 751894073 751654816 751356964
3011.7G51356964k98538o19278N1880J7242k90374j80588k57645N6305l16315k78167
$$ 751356964 751058426 750439148 750491028 750508270 750217896 750037308 749779663 749835968 749519653 749241486
3021.4G49241486k37122n27267K4261o6528k50778o03257n93872J9760k2812m03595
$$ 749241486 749004364 748477097 748501358 748434830 748184052 747580795 746986923 747006683 746983871 746580276
3031G46580276m37011M10232O4316m85077k30636o90461m47158j89438m73862k94571
$$ 746580276 746143265 746553497 746617813 746132736 745902100 745211639 744764481 744575043 744101181 743806610
3040.7G43806610j73721k90299j17569j2436n77087p72018m77066m02680j5182K03704
$$ 743806610 743632889 743342590 743225021 743212585 742635498 741863480 741386414 740983734 740968552 741172256
3050.3G41172256n30929p21130n29633m30603L74527r5368j234130q57468k03934q239
$$ 741172256 740641327 739920197 739390564 738959961 739334488 739239120 738004990 737147522 736943588 736935349
3060G36935349P4462j27563j61667J42593o51016p02896M807n65110o19049j99890
$$ 736935349 737009811 736882248 736720581 736863174 736212158 735509262 735514069 734948959 734329910 734130020
3069.6G34130020k67410m86221k2965M8904n03845k05688k47727m26025l84293k65655
$$ 734130020 733862610 733376389 733353424 733402328 732898483 732692795 732445068 732019043 731634750 731369095
3079.2G31369095l02429k72675O7444m94995o50482l58124j91422l52859n69458q6899
$$ 731369095 731066666 730793991 730861435 730366440 729715958 729357834 729166412 728813553 728244095 728157196
3088.9G28157196l52402k70462K00043k23312m40216j73417p05947j223450N3329M73557
$$ 728157196 727804794 727534332 727734375 727511063 727070847 726897430 726191483 724968033 725021362 725494919
3098.5G25494919j64643o15539q12531m12521n35965k09808j61209n03464Q2855l33633
$$ 725494919 725330276 724714737 723902206 723489685 722953720 722743912 722582703 722079239 722162094 721828461
3108.2G21828461r56879n04379l56369o06156m29916L69186O20423q03070j401444
$$ 721828461 720871582 720367203 720010834 719404678 718974762 719343948 719964371 719161301 717759857
3116.9G17759857k51083l50876o44608l7078l13645j012192j152801m30679L06015
$$ 717759857 717508774 717157898 716513290 716476212 716162567 715150375 713997574 713566895 713872910
3125.5G13872910l46070r23843l98102j51520k64740k75802k95334r16825j199874
$$ 713872910 713526840 712602997 712204895 712053375 711788635 711512833 711217499 710300674 709100800
3134.2G09100800p28684n92499l35464l29437k19803k14463p17392o57043n97992k07519
$$ 709100800 708372116 707779617 707444153 707114716 706894913 706680450 705963058 705306015 704708023 704500504
3143.9G04500504k23008p12127n60456p98797p52487m14429p14111p32270l29056k54364
$$ 704500504 704277496 703565369 703004913 702206116 701453629 701039200 700325089 699592819 699263763 699009399
3153.5F99009399l17993n20706p03354o10733m99725l33710p90024q98056m44870n06210
$$ 699009399 698691406 698170700 697467346 696856613 696356888 696023178 695233154 694335098 693890228 693384018
3163.1F93384018o06537q03070o03790n12848p81174n23758r9792l34168q75244m36478
$$ 693384018 692777481 691974411 691370621 690857773 690076599 689552841 689453049 689118881 688243637 687807159
3172.8F87807159K07596m42581j472473k80457k4719k016754j224747J59226J53656
$$ 687807159 688014755 687572174 686099701 685819244 685794525 683777771 682553024 682712250 682865906
3181.5F82865906n44586p26929j14670p77054q79516m52042o33926q46405n71900l73230
$$ 682865906 682321320 681594391 681479721 680702667 679823151 679371109 678737183 677890778 677318878 676945648
3191.1F76945648o86264l53699j05362k62603j134033j220704m19998m45328n00259
$$ 676945648 676259384 675905685 675800323 675537720 674403687 673182983 672762985 672317657 671817398
3199.8F71817398q95080p89643p61261q82339o52161m76074j09406j75705r6206r54590
$$ 671817398 670922318 670132675 669371414 668489075 667836914 667360840 667251434 667075729 666979523 666024933
3209.4F66024933j140213m03900l60718J47934n73349r65347o34156n11398Q0109n05371
$$ 666024933 664884720 664480820 664120102 664268036 663694687 662729340 662095184 661583786 661663895 661158524
3219.1F61158524j116486p43103n91965k30255O1874o85958n52597m24576q74710o64292
$$ 661158524 660042038 659298935 658706970 658476715 658538589 657852631 657300034 656875458 656000748 655336456
3228.7F55336456j227112p03048L01590R4146o83136j048584o92749p32879l44620
$$ 655336456 654109344 653406296 653707886 653802032 653118896 652070312 651377563 650644684 650300064
3237.4F50300064m10614l26691o16607j301575q42743k37350O02111k28042n75104
$$ 650300064 649889450 649562759 648946152 647644577 646801834 646564484 647166595 646938553 646363449
3246.1F46363449m50516p35244M2801o58036q32596p97577n62667j80970q46710m57763
$$ 646363449 645912933 645177689 645220490 644562454 643729858 642932281 642369614 642188644 641341934 640884171
3255.7F40884171m71039m52881k96745k62261n75752o61888K8000k76184l77961o65626
$$ 640884171 640413132 639960251 639663506 639401245 638825493 638163605 638191605 637915421 637537460 636871834
3265.4F36871834o18553m41704m56658k63824p33261l49922k81754p48482q78982J71013
$$ 636871834 636253281 635811577 635354919 635091095 634357834 634007912 633726158 632977676 632098694 632269707
3275F32269707K63023j174431j78184j2322o21376l46222n54809n26428o61278n27725
$$ 632269707 632532730 631358299 631180115 631167793 630546417 630200195 629645386 629118958 628457680 627929955
3284.7F27929955m85993m91409l20664m2877k56691p34634k90337k59666o33278q66242
$$ 627929955 627443962 626952553 626631889 626589012 626332321 625597687 625307350 625047684 624414406 623548164
3294.3F23548164m22248m96n49240o73714k02332j22375l82920o18438r20296k23274
$$ 623548164 623125916 623125420 622576180 621902466 621700134 621577759 621194839 620576401 619656105 619432831
3303.9F19432831j33629o60934l45307m71687n19638q65593m31442j45302n85099n24177
$$ 619432831 619299202 618638268 618292961 617821274 617301636 616436043 616004601 615859299 615274200 614750023
3313.6F14750023q51402k72637n56106r72901n65986n04837k90833q47549m91219l87039
$$ 614750023 613898621 613625984 613069878 612096977 611530991 611026154 610735321 609887772 609396553 609009514
3323.2F09009514j131516r79728m49982l93143o78329m36516p89719p82356q71239
$$ 609009514 607877998 606898270 606448288 606055145 605376816 604940300 604150581 603368225 602496986
3331.9F02496986p66944n10674j136131k84195n15785r38836n15594r88503n02815
$$ 602496986 601730042 601219368 600083237 599799042 599283257 598344421 597828827 596840324 596337509
3340.6E96337509l58848p73125r23538p25136q51708r89265k22015k94609q55256j131019
$$ 596337509 595978661 595205536 594281998 593556862 592705154 591715889 591493874 591199265 590344009 589212990
3350.2E89212990r70116n97343n01175p11365j260223j334534q04634l81889o07377
$$ 589212990 588242874 587645531 587144356 586432991 585172768 583838234 583033600 582651711 582044334
3358.9E82044334q47740j019401j011238n97191l06435k80762q46672j014099p79991
$$ 582044334 581196594 580177193 579165955 578568764 578262329 577981567 577134895 576120796 575340805
3367.6E75340805q43162j035271r56497p18880q08563o38314o31561o96373q70705
$$ 575340805 574497643 573462372 572505875 571786995 570978432 570340118 569708557 569012184 568141479
3376.3E68141479q00743l43513m06075k74543p00913j226578j008567l96195j53046
$$ 568141479 567340736 566997223 566591148 566316605 565615692 564389114 563380547 562984352 562831306
3384.9E62831306q39004o27899k62909j87645k63481p73697q94585j235847q18367
$$ 562831306 561992302 561364403 561101494 560913849 560650368 559876671 558982086 557746239 556927872
3393.6E56927872o4354k66953j79062l73764r47685p77893o56319k11219K83889k49061
$$ 556927872 556863518 556596565 556417503 556043739 555096054 554318161 553661842 553450623 553734512 553485451
3403.3E53485451n64614l21884k6321k59667q45909p65838L8528K26822n74150m28391
$$ 553485451 552920837 552598953 552572632 552312965 551467056 550701218 550739746 550966568 550392418 549964027
3412.9E49964027l34968n61409r1934M3296l4523m9476k74124j252022r33380K30446
$$ 549964027 549629059 549067650 548975716 549019012 548984489 548935013 548660889 547408867 546475487 546705933
3422.6E46705933K18124K79160r9183l63578O6757J83296J14059j41906o13098j30616
$$ 546705933 546924057 547203217 547104034 546740456 546807213 546990509 547104568 546962662 546349564 546218948
3432.2E46218948J15815k94915K08817l4638R8763K80838p8240K98806N78232P47833
$$ 546218948 546334763 546039848 546248665 546214027 546312790 546593628 546515388 546814194 547392426 548140259
3441.8E48140259p06330l57818O41250P72515P53746k137833l61862J829567Q42705
$$ 548140259 547433929 547076111 547717361 548489876 549243622 547105789 546743927 548573494 549416199
3450.5E49416199J05743k56920K78473J36299Q12645M20914J30539P91664K23045O79741
$$ 549416199 549521942 549265022 549543495 549679794 550492439 550913353 551043892 551835556 552058601 552738342
3460.2E52738342P31659R88236P1945j28365P02248J5793J77917j17073P89833R56154
$$ 552738342 553470001 554458237 554530182 554401817 555104065 555119858 555297775 555180702 555970535 556926689
3469.8E56926689M12102R95788M57116M34188m3487p3090Q17185J129646J018944Q46214
$$ 556926689 557338791 558334579 558791695 559225883 559182396 559109306 559926491 561056137 562075081 562921295
3479.5E62921295Q12721L37944m57572n00718J408882J346055O98089Q05855m59404
$$ 562921295 563734016 564071960 563614388 563113670 564522552 565868607 566566696 567372551 566913147
3488.1E66913147j95808O44378J106148O38580O87790J143494P41958M71802n56679
$$ 566913147 566717339 567361717 568467865 569106445 569794235 570937729 571679687 572151489 571594810
3496.8E71594810O30646J292877N35622R00307J361618R47494n30204K38189J076622
$$ 571594810 572225456 573518333 574053955 574954262 576315880 577263374 576733170 576971359 578047981
3505.5E78047981J138993J162071J189995j89629j018791J199531O01693P26814J202850
$$ 578047981 579186974 580349045 581539040 581349411 580330620 581530151 582131844 582858658 584061508
3514.2E84061508R35898J482048N87807M25491p7705M31251K115288K452354J43700
$$ 584061508 584997406 586479454 587067261 587492752 587415047 587846298 589961586 592413940 592557640
3522.9E92557640k137985O50482J734085Q01506J11656P61376R36126P69730R62677
$$ 592557640 590419655 591070137 592804222 593605728 593717384 594478760 595414886 596184616 597147293
3531.5E97147293P87125J485443Q61664J492233K57683q35839J446267Q02345Q40912
$$ 597147293 597934418 599419861 600281525 601773758 602031441 601195602 602641869 603444214 604285126
3540.2F04285126J124038K146645J698151J057052N12123j078453J061402l60527J702537
$$ 604285126 605409164 607555809 609253960 610311012 610823135 609744682 610806084 610445557 612148094
3548.9F12148094J855698J502533K178192k575188Q32672J283303J957359K223701
$$ 612148094 614003792 615506325 617684517 615109329 615942001 617225304 619182663 621406364
3556.6F21406364q06465K138176J374893Q7243L55453K438660J130752K66381N286865
$$ 621406364 620599899 622738075 624112968 624200211 624555664 626994324 628125076 628391457 633678322
3565.3F33678322j325531k380219j078682m1656N641632K206764J342774J570625J054230
$$ 633678322 632352791 629972572 628893890 628852234 634493866 636700630 638043404 639614029 640668259
3574F40668259K17361R69086J537475M12522K790069M96979M15878K093201K031632
$$ 640668259 640885620 641854706 643392181 643804703 646594772 647091751 647507629 649600830 651632462
3582.6F51632462J095733J060257N937958L52859l549804q62122k430038N233307M427032
$$ 651632462 652728195 653788452 659726410 660079269 656529465 655667343 653237305 658470612 662897644
3591.3F62897644L872833J28708O104L713760l250656K683258L186951j64490K970734
$$ 662897644 666770477 666899185 666905289 670619049 667368393 670051651 673238602 673074112 676044846
3600F76044846L433J454391J799393L64304K478027M543838K174454k985458K950973
$$ 676044846 676048279 677502670 679302063 679666367 682144394 686688232 688862686 685877228 688828201
3608.7F88828201k816162Q88672J0901337o60935m617767L553085j600723O670761
$$ 688828201 686012039 686900711 697802048 697141113 692523346 696076431 694475708 701146469
3616.4G01146469N640030k183990k3652l824462R81445N248718L707581J935806L035889
$$ 701146469 706786499 704602509 704578857 700754395 701735840 706984558 710692139 712627945 715663834
3625.1G15663834L258056K745590O940613q322143j6401062Q734436Q546753P898025
$$ 715663834 718921890 721667480 728608093 720285950 703884888 712619324 721166077 729064102
3632.8G29064102q77685l685990L682556M310379K044754p70797J744613L131485K820588
$$ 729064102 728186417 724500427 728182983 732493362 734538116 733767319 735511932 738643417 741464005
3641.5G41464005J51977k11334L582992N569916O654053n383377n072251M395371m924774
$$ 741464005 741615982 741404648 744987640 750557556 757211609 751828232 746755981 751151352 746226578
3650.1G46226578n579071J400528R219436N585862N466995K784729j4867707N354615
$$ 746226578 740647507 742048035 751267471 756853333 762320328 765105057 750237350 755591965
3657.9G55591965P128982O55670N32303M14734K670517L59726J203919J473541J154098
$$ 755591965 762720947 763376617 763908920 764323654 766994171 767353897 768557816 770031357 771185455
3666.5G71185455N572052J358109k760773l549576r282684P588577J2991028J0606613
$$ 771185455 776757507 778115616 775354843 771805267 762522583 770111160 783102188 793708801
3674.3G93708801r957657k9552383R953766J3033295N825576n366211q2931M282989
$$ 793708801 783751144 754198761 764152527 777185822 783011398 777645187 777562256 781845245
3682G81845245J870804P53937l59650N73502N933304O877441j5611038k753601P458191
$$ 781845245 783716049 784469986 784110336 784683838 790617142 797494583 781883545 779129944 786588135
3690.6G86588135j2213364M039612P642822j48697J447754k4948r8724J239013N03769
$$ 786588135 774374771 778414383 786057205 785908508 787356262 787331314 787232590 788471603 788975372
3699.3G88975372L512650K163696r327698j695175O488190J586609J07269P31659L891602
$$ 788975372 792488022 794651718 785324020 783628845 790117035 791703644 791810913 792542572 796434174
3708G96434174K636718j0160598O975479N91125j7957153R550323N840378j44806J654816
$$ 796434174 799070892 788910294 795885773 796476898 778519745 788070068 793910446 793765640 795420456
3716.7G95420456L599319K87934n232544K682342O418305q798828m587784P811813
$$ 795420456 799019775 799307709 794075165 796757507 803175812 794376984 789789200 797601013
3724.4G97601013O7826j800766l933945J440887N233689K981033Q016815q011856q490906
$$ 797601013 797668839 795868073 791934128 793375015 798608704 801589737 809606552 801594696 793103790
3733.1G93103790J2545700m392013j3803864L063889K708664P18231N386047M100113
$$ 793103790 805649490 801257477 787453613 790517502 793226166 793944397 799330444 803430557
3740.8H03430557m626159N908355J1530915k9500428j0316085J8330993Q672714Q318940
$$ 803430557 798804398 804712753 816243668 786743240 776427155 794758148 803430862 811749802
3748.5H11749802r097443j1252060J4768524j6360168n975495J0612564P315064K501221
$$ 811749802 802652359 791400299 806168823 789808655 783833160 794445724 801760788 804262009
3756.2H04262009p781525N780106N206222j4033584L65371O363449J161042J103286
$$ 804262009 796480484 802260590 807466812 793433228 793798599 800162048 801323090 802426376
3763.9H02426376M309006o265411n664444P008056P207489m377060j3886032M950028
$$ 802426376 806735382 800469971 794805527 801813583 809021072 804644012 790757980 795708008
3771.7G95708008M164886K17438J121750j68686J717987J711731L627701m347305j0849534
$$ 795708008 799872894 800090332 801212082 801043396 802761383 804473114 808100815 803753510 792903976
3780.3G92903976N559311L122025J986771K132949n491333j048889J035538N55420
$$ 792903976 798463287 801585312 803572083 805705032 800213699 799164810 800200348 800755768
3788H00755768J189804K78168L26538j90506O31027P6446L019028L598557q337097
$$ 800755768 801945572 802223740 802550278 802359772 802990799 803067245 806086273 809684830 801347733
3796.7H01347733m478608M957428P034760N933456j7482834j3457031Q741226O874237
$$ 801347733 796869125 801826553 808861313 814794769 797311935 783854904 792596130 799470367
3804.4G99470367Q248368M035034j9523010q45948Q982392K561874O04477L45535J88675
$$ 799470367 807718735 811753769 792230759 791384811 800367203 802929077 803533554 803879089 804067764
3813.1H04067764L146973P355804q775711j6862259J1116944P450943O232376j928940
$$ 804067764 807214737 814570541 805794830 788932571 800049515 807500458 813732834 811803894
3820.8H11803894k7580337O299514P389450L611832L698578k088623o187515K441177
$$ 811803894 784223557 790523071 797912521 801524353 805222931 803134308 796946793 799387970
3828.6G99387970M530182N105133q90122j2643661P143784P754135j0837860L482818
$$ 799387970 803918152 809023285 808133163 795489502 802633286 810387421 799549561 803032379
3836.3H03032379J0815201j6251984l256454J0174637r696198K683411Q444519o824646
$$ 803032379 813847580 797595596 794339142 804513779 794817581 797500992 805945511 799120865
3844G99120865l686752N295791K407150N09034K155838r78623M347306P661438j0181656
$$ 799120865 795434113 800729904 803137054 803646088 805801926 804823303 809170609 816832047 806650391
3852.7H06650391o148453k6614304J3047638J5134125l804245r70154M166336L822174
$$ 806650391 800501938 773887634 786935272 802069397 798265152 797294998 801461334 805283508
3860.4H05283508K040634p635650K875442O563263j4466095m459991Q983154Q894806
$$ 805283508 807324142 799688492 802563934 809127197 794661102 790201111 799184265 808079071
3868.1H08079071O571045j7375793j0659180R141769J0124817O37818j6123353M593277
$$ 808079071 814650116 797274323 786615143 795756912 805881729 806519547 790396194 794989471
3875.8G94989471N742646J032180M534607M256211j3283158p232437J0365906J599197
$$ 794989471 800732117 801764297 806298904 810555115 797271957 790039520 800405426 802004623
3883.5H02004623M074707L254319k0614777N290756O420975K902756O123581n885163
$$ 802004623 806079330 809333649 788718872 794009628 800430603 803333359 809456940 803571777
3891.2H03571777j2571563N711288M393997k249527K778626K170791L449860k161026
$$ 803571777 791000214 796711502 801105499 798855972 801634598 803805389 807255249 805094223
3898.9H05094223j3364944J0191497K60697o181030P021942o711655k409973O08063
$$ 805094223 791729279 801920776 802181473 796000443 803022385 796310730 793900757 794508820
3906.7G94508820K339706L401031p86361K45514J49307O56891L81622J78528K283707
$$ 794508820 796848526 800249557 799463196 799708710 799858017 800514908 800896530 801075058 803358765
3915.3H03358765N48858o986999k166062O746369k105179m413300M501496K138824
$$ 803358765 803907623 796920624 794754562 801500931 799395752 794982452 799483948 801622772
3923.1H01622772N34134m650802l120652M351044K665024Q73108k145233m1733K283172
$$ 801622772 802156906 797506104 794385452 798736496 801401520 802274628 800129395 800087662 802370834
3931.7H02370834m609527j785126J884537O77490J353455L8452j135407j38015J71661
$$ 802370834 797761307 795976181 797860718 798538208 799891663 799930115 798794708 798656693 798828354
3940.4G98828354K692871N92728o813584j77688K665100K150650R55658l623581J194382
$$ 798828354 801521225 802113953 795300369 795122681 797787781 799938431 800894089 797270508 798464890
3949.1G98464890q85773j827240L573913j82571j126251n0431O47431J72424j161575
$$ 798464890 797579117 795751877 799325790 799143219 798016968 797966537 798613968 798786392 797624817
3957.8G97624817P37457N36423J530609o92139k425079J251755L04870p57675p0190
$$ 797624817 798362274 798898697 800429306 799737167 797312088 798563843 798868713 798111038 798040848
3966.5G98040848O23321K57874j527634j71127J878815J82647j455307j68991K01111
$$ 798040848 798664169 798922043 797394409 797223282 799102097 799284744 797829437 797660446 797861557
3975.1G97861557m11301l95355N05371L90702j36490O02569m8370n82962N68847R14917
$$ 797861557 797450256 797054901 797560272 797950974 797814484 798417053 798368683 797785721 798354568 799269485
3984.8G99269485k40402m41208k30255k27585O6910j182022r16214L68271J463852
$$ 799269485 799029083 798587875 798357620 798130035 798196945 797014923 796098709 796466980 797930832
3993.5G97930832J295624p73926j78299k4490k17743J83410n53970
$$ 797930832 799226456 798452530 798274231 798249741 798031998 798215408 797661438
4000.2G97661438
$$ 797661438
##END=$$ End of the data block
