##TITLE=$$ Begin of the data block
##JCAMP-DX=5.00 $$ ACD/SpecManager v 10.08
##SPECTROMETER/DATA SYSTEM=Varian
##DATE=18 Dec 2012 14:02:22
##DATA TYPE=INFRARED SPECTRUM
##DATA CLASS=XYDATA
##ORIGIN=
##OWNER=
##NPOINTS=3735
##FIRSTX=399.26403809
##LASTX=4000.35498047
##MAXX=4000.35498047
##MINX=399.26403809
##MAXY=85.79877472
##MINY=37.64802170
##XFACTOR=1.0000000000
##YFACTOR=0.000000100000000
##FIRSTY=69.72590637
##DELTAX=0.96440572
##XUNITS=1/CM
##YUNITS=TRANSMITTANCE
##XYDATA=(X++(Y..Y))
399.3F97259064p569580J8796539O433105P302170J135712l455429K085342Q927460
407G30914383N955200m130325j0882416q112869R22088Q262864L100891q119965n779190
415.7G12130661J462250Q062210n31769j9857788J2728348N960235R95865k589950
423.4G18360062J08947N19638o151428o87332M319763O628113K829285l522415r71299
432.1G21433334o16226j961975M072037L405914q149948m529648L506241L978500o74057
440.7G20464172r79156L269424l472900l420563L461456M599610n220413q271408j007767
449.4G09422455J134949N691757L477020o140442k242660J706848K065048m149780
457.1G10965195l127137O860123r91592m021530j162262j076737j12610J194153J052170
$$ plain form
399.3 697259064 689689484 708486023 714919128 722221298 723357010 719901581 721986923 730914383
407 730914383 736869583 732739258 721856842 713743973 714666061 722928925 726029816 717909851 712130661
415.7 712130661 713592911 721655121 721123352 701265564 713993912 719954147 720950012 718360062
423.4 718360062 718469009 718988647 712837219 712149887 716469650 723097763 725927048 722404633 721433334
432.1 721433334 720817108 718855133 722927170 726333084 718183136 713653488 717159729 721138229 720464172
440.7 720464172 719485016 722754440 719281540 715860977 719322433 723922043 718701630 710430222 709422455
449.4 709422455 710557404 716249161 719726181 713585739 711343079 713049927 715114975 710965195
457.1 710965195 707838058 714698181 713706589 709685059 708522797 707446060 707333450 708527603 709579773
465.8G09579773j247635m989014J74256N254898J944885N01480j580887k939224j603165
474.5G05095367j962432k567139j54801K474595N033722O383056r21783J065368L824616
483.2G18270569m313965l897934m65546J330643J103592Q60748Q17032q51822P91168
491.8G13644485L13492n26809m99573j449280P08160K466355j315918k827912O10505
500.5G11123505Q13522k76413P26624J725997Q62809j69907r17892k539139k717362
509.2G08631744l345642k159500j173401j389847p74459Q79745K321854P54394q27865
517.9G02917023k907181m269257O9962J719055N78995L23410L72009j215591j032029
526.6F96556396K16904l60946P82852L94821O77338J851654p95136l481674j019898
$$ plain form
465.8 709579773 708332138 703343124 703517380 708772278 710717163 711218643 709637756 706698532 705095367
474.5 705095367 703132935 700565796 700410995 702885590 707919312 714302368 713380585 714445953 718270569
483.2 718270569 713956604 710058670 709593124 710923767 712027359 712888107 713705139 712853317 713644485
491.8 713644485 713957977 713431168 712931595 711482315 712190475 714656830 713340912 710513000 711123505
500.5 711123505 711937027 711660614 712387238 714113235 714976044 714806137 713888245 711349106 708631744
509.2 708631744 705286102 703126602 701953201 700563354 699788895 700668640 702990494 703744888 702917023
517.9 702917023 700009842 695740585 695810547 697529602 698108597 698432007 698804016 697588425 696556396
526.6 696556396 696773300 696412354 697195206 697590027 698267365 700119019 699323883 695842209 694822311
535.2F94822311R16214p69119R96323J719055L73077R70383N74036L70102N39169J27563
544.9G00639114j73721Q23898j12915q01620J45416l84140R384O30265Q57925q7967
554.5G01545639J442108K142639j275787j443329p36084n28412j891098j04446L795624
563.2G02946854J464080L56827k66571J18103J6937k063598k50626K29264l61786k31629
572.9G01957855l87268j99432k32392j647338j438065R33838J314392J570816l738
581.5G01868668O49871J196671k848129j678849k37579j47171P47833J60904L89023
590.2G00101242n81665O8207J857605K146301K17819k151184k037201j952743j65863
598.9F97502518L77273j264953j217881j488952k052918j648559k845917m877930l793716
$$ plain form
535.2 694822311 695738525 694969406 695965729 697684784 698057861 699028244 699602280 699972382 700511551 700639114
544.9 700639114 700465393 701289291 701176376 700374756 700520172 700136032 700145416 700775681 701633606 701545639
554.5 701545639 702987747 705130386 703854599 702411270 701675186 701146774 699255676 699151230 702946854
563.2 702946854 704410934 704767761 704501190 704619293 704636230 702572632 702322006 702551270 702189484 701957855
572.9 701957855 701570587 701371155 701138763 699491425 698053360 698987198 700301590 701872406 701868668
581.5 701868668 702518539 703715210 700867081 699188232 698950653 698803482 699551315 699712219 700101242
590.2 700101242 699519577 699587784 701445389 703591690 703809509 701658325 699621124 697668381 697502518
598.9 697502518 697879791 696614838 695396957 693908005 691855087 690206528 687360611 682482681 678688965
607.6F78688965m869995p517014p616348r153824j0587807j0297012o585655n393143
615.3F16668167l796921M44184O13632K06413l543320n111923o110954o796989l520508
624E89051781M47883Q161621J1883240J2866249J1558228J0447349Q916321M666062
631.7F57998734R09957k151947k990951o480179p570419m198609k881164j535225K272415
640.4F33372612Q885689J1688614J3134308J3004074J0748367Q492355O384583L856582
648.1G09567184L132248K615509J627579J311875N24902J091156J984482K210464J470184
656.8G25535583j42822J45569J714172J330948L3799J61209P47528J501846J302948
665.4G32330780J549759q22144j1942138P839660O482621J345138k05765r5367J193695
$$ plain form
607.6 678688965 673818970 666301956 658685608 649531784 638943977 628646965 622061310 616668167
615.3 616668167 612871246 613315430 613929062 614135475 610592155 605480232 599369278 592572289 589051781
624 589051781 589499664 597661285 609544525 622410774 633969002 644416351 653332672 657998734
631.7 657998734 658908691 656756744 653765793 647285614 639715195 635516586 632635422 631100197 633372612
640.4 633372612 642258301 653946915 667081223 680085297 690833664 699326019 705710602 709567184
648.1 709567184 712699432 715314941 716942520 718254395 718779297 719870453 721854935 724065399 725535583
656.8 725535583 725392761 725538330 727252502 728583450 728617249 728778458 729525986 731027832 732330780
665.4 732330780 733880539 733058395 721116257 728955917 735438538 736783676 736577911 736482544 737676239
674.1G37676239R35440K33231m43344l92762L47061l98864J418457K515411K11563
682.8G42102432j304397q79975R6131l39127q32901j541443k554092j189270N89218
691.5G34146576n7907j302567q80356J19782O56967l23944j192169m63181p27920p83692
701.1G29191589k28119j85775J81122M94766Q49609R53064J343308J501541N20935
709.8G34622040Q24508J439133O89011K83203J03302P16247J842270K383957K794800
718.5G45698471J070709l01971J607132J580505N50919O85043k50931n75866j134644
727.2G48929367j131058K2889o09971o05087k53906l65067p8048k21939l19596J72196
736.8G45539780K93808o54679q36334m03900n25436q64258K71225J642608J482163
$$ plain form
674.1 737676239 738611679 738844910 738401566 738008804 738355865 737957001 739375458 741890869 742102432
682.8 742102432 740798035 739918060 740014191 739675064 738842163 737300720 734746628 733557358 734146576
691.5 734146576 734088669 732786102 731905746 732025528 732682495 732358551 731166382 730703201 729975281 729191589
701.1 729191589 728963470 728777695 728958817 729453583 730303192 731256256 732599564 734101105 734622040
709.8 734622040 735446548 736885681 737574692 737857895 737961197 738677444 740519714 742903671 745698471
718.5 745698471 746769180 746467209 748074341 749654846 750205765 750890808 750639877 750064011 748929367
727.2 748929367 747798309 747821198 747211227 746606140 746352234 745987167 745909119 745687180 745367584 745539780
736.8 745539780 745833588 745178909 744342575 743938675 743413239 742548981 742820206 744462814 745944977
745.5G45944977J778564K115021L129807K789688J402053J919022R15833R82818J657944
754.2G62635727Q21838P47376K387695M236984K898178K065659J235657M91256k6016
762.8G77494354j585235j003495j192169p35473m06495m66766O86340L92533K25219
771.5G73408813M65317O63224J29241R43757J357574K38800M31366K91595J409379
780.2G79339066J844329K765656L409042J386338J153183J387329J409378l22190j259689
788.9G91112442o99158l08075M30146o82755M1123L82461J55792K023087J752701J220779
798.5G95428543L67127j353989p80487o42777k201690j283570M41132O82526P31582
807.2G91388397J366959J206970L6926L28522P62634Q64487o6986q82416j059646q22144
$$ plain form
745.5 745944977 747723541 749838562 752968369 755758057 757160110 759079132 759994965 760977783 762635727
754.2 762635727 763457565 764204941 766592636 770829620 773727798 775793457 777029114 777520370 777494354
762.8 777494354 775909119 774905624 773713455 772977982 772571487 772104721 772791061 773183594 773408813
771.5 773408813 773874130 774537354 774666595 775610352 776967926 777206726 777638092 777929687 779339066
780.2 779339066 781183395 783949051 787358093 788744431 789897614 791284943 792694321 792372131 791112442
788.9 791112442 790413284 790105209 790535355 789852600 789893723 790276184 790431976 792455063 794207764 795428543
798.5 795428543 795795670 794441681 793661194 793018417 790816727 789533157 789974289 790656815 791388397
807.2 791388397 792755356 793962326 793999252 794327774 795090408 795954895 795887909 795005493 793945847 793123703
816.9G93123703O11267p83615k19955J091766J84631Q93860O32324L26462j151810
825.5G94708633j951904j352920k157593l189621k848358j202240k001648k244644
833.3G77759705j762238j540756j054383j913452k252731l605118l264465j649552
841G60717010j953811k141647k369309j121902L89099K57873j20163M72183J791306
849.6G55920639J543121J524887K307435J680679P95517J688690J800385Q27560J832809
858.3G69921722L094864L671875K514038J221009J093902P58667N36347m41208K9373
867G82400589J655579J086654p68051n73349J144562J423492N97687P77893J230087
875.7G88975143K34604M8142k90528r04617j275253k703781k523346j325150q01620
$$ plain form
816.9 793123703 793734970 792951355 792731400 793823166 794007797 794901657 795533981 795860443 794708633
825.5 794708633 792756729 791403809 789246216 786056595 783208237 782005997 780004349 777759705
833.3 777759705 775997467 774456711 773402328 771488876 769236145 765631027 762366562 760717010
841 760717010 758763199 756621552 754252243 753130341 753519440 753777313 753657150 754129333 755920639
849.6 755920639 757463760 758988647 761296082 762976761 763772278 765460968 767261353 768088913 769921722
858.3 769921722 773016586 776688461 779202499 780423508 781517410 782276077 782812424 782371216 782400589
867 782400589 784056168 785142822 784374771 783801422 784945984 786369476 786967163 787745056 788975143
875.7 788975143 789209747 789257889 788967361 788062744 786787491 784083710 781560364 780235214 779433594
884.4G79433594j027756j077881j267013j347657n98373j91879K38571p61337j379548
893G72020721k35824L18832Q47626R22623M69055K02255P9727k83890Q2322M04434
902.7G74827881q36182q43353l70789j270675k124481j468964r65195j972809k354889
911.4G62620544j583633j200409k541809k957001j182098q23288j940765j972809j612168
920G46806564k155533k074203j314850j703567j436005j148987j679230l76739n06363
928.7G34411087j200943o16150k83737J265411J118622L22647J051712J677780J840287
937.4G39586716J865158K403183K372665K489777K220382J917954K278900J711960
945.1G56846695K285690K048416J466446K187958O50635J79596J168594Q85163l86124
$$ plain form
884.4 779433594 778405838 777327957 776060944 774713287 774114914 773923035 774161606 773400269 772020721
893 772020721 771784897 772103729 772951355 773873978 774343033 774545288 774625015 774341125 774423447 774827881
902.7 774827881 773991699 773148346 772777557 771506882 769382401 767913437 766948242 764975433 762620544
911.4 762620544 761036911 759836502 757294693 754337692 753155594 752332306 750391541 748418732 746806564
920 746806564 744651031 742576828 741261978 739558411 738122406 736973419 735294189 734917450 734411087
928.7 734411087 733210144 732593994 732310257 733575668 734694290 735016937 736068649 737746429 739586716
937.4 739586716 741451874 743855057 746227722 748717499 750937881 752855835 755134735 756846695
945.1 756846695 759132385 761180801 762647247 764835205 765485840 765665436 766834030 767719193 767333069
953.8G67333069r28345N5390j28098o81610j501923j936569k022171k107391r22318
962.5G57160034j501617k734680k284852j897430j109238p23877j618957j311188p88803
971.2G43189392n04303m59976q84018m34647j106796j047287m1351l14179q06045j016083
980.8G36574707m89197j240616j286926n78003j548309j947556k014770k147675k755508
989.5G22566147k690735k458572l526001n137406p918396j0127792p932358M96750
997.2F83271637Q051453Q243103M472656K021561j8921q68225l39585r90677p48520
1005.9G03094482j90963m23737j36032k93579j247788j909408j095505p80334j495667
1014.6F95521469j941681j701965j146088j385727j866073j804505q99810j302567
$$ plain form
953.8 767333069 766404724 766460114 766332016 765650406 764148483 762211914 760189743 758082352 757160034
962.5 757160034 755658417 752923737 750638885 748741455 747632217 746908340 745289383 743978195 743189392
971.2 743189392 742685089 742225113 741341095 740906448 739799652 738752365 738711014 738396835 737590790 736574707
980.8 736574707 736085510 734844894 733557968 732979965 731431656 729484100 727469330 725321655 722566147
989.5 722566147 719875412 717416840 713890839 708753433 700835037 690707245 682774887 683271637
997.2 683271637 691323090 699566193 704038849 706060410 706041489 705173264 704833679 703843002 703094482
1005.9 703094482 702903519 702479782 702343750 702050171 700802383 698892975 697797470 697017136 695521469
1014.6 695521469 693579788 691877823 690731735 689346008 687479935 685675430 684775620 683473053
1022.3F83473053k380676k409745j583557q06427j162643j365738k359467k691803
1030F68712997k063827j398468r79004j469498j281356j246949j169281j969375j705094
1038.7F55430145n79757m21677O0730j39542j14822o30570R7809j33438l45917J066513
1048.3F54289474J96534R21173J103363K41928J54037M36631N11779M1657M35104M39377
1058F58771057J149368n26733r56726M55627p08770j60523P3166n29480r02405L43094
1067.6F57007675P0267j628418r26743j403122j050262o79932l62854j133194p53402
1076.3F49140015R52148j121597j206818j363373j408615m36706l60871n80673j635666
1085F41977844j200943j030845p37191k555351l683319l038788l857384m357376n545463
$$ plain form
1022.3 683473053 681092377 678682632 677099075 676292648 675130005 673764267 671404800 668712997
1030 668712997 666649170 665250702 664271698 662802200 661520844 660273895 659104614 657135239 655430145
1038.7 655430145 654850388 654428711 654489441 654349899 654235077 653604507 653702316 653568878 653222961 654289474
1048.3 654289474 654486008 655407181 656510544 656752472 656906509 657343140 657854919 657896576 658331680 658771057
1058 658771057 659920425 659393692 658436966 658892593 658183823 658023300 658096466 657566986 656664581 657007675
1067.6 657007675 657077942 655449524 654522781 653119659 652069397 651389465 651026611 649893417 649140015
1076.3 649140015 650092163 648970566 647763748 646400375 644991760 644555054 644194183 643613510 641977844
1085 641977844 640776901 639746056 639008865 636453514 632770195 629731407 625874023 621516647 615971184
1093.6F15971184n563584p650451q084069q021087r361534q541603r614258q898392
1101.4E50236206j0467148j0036583r695396j0269737r266282j1253318r180184r904594
1109.1D70162964r504433q973999p340240n994950o401100k716865l981018j310883
1116.8D23939476p69577K45323R73816K21863L019371J007194K605591J088143J330909
1125.5D33662109J163025k50244Q93135j765747Q01p69806n42717k337646l417130
1134.1D26635780k327461m171524k749329m536666k244873l337708l815231k901039
1141.9D00551949m979096k857933l829155j944580m213638k655716p53632k194824
1149.6C77123375K85149r28307J557693K24801J269455J576042J880493L858528K003822
$$ plain form
1093.6 615971184 610407600 602757149 594673080 586651993 577290459 568748856 559134598 550236206
1101.4 550236206 539769058 529732475 520037079 509767342 500501060 489247742 480067558 470162964
1109.1 470162964 460658531 451684532 444344292 438349342 431948242 429231377 425250359 423939476
1116.8 423939476 423169899 423415222 424389038 424610901 427630272 428637466 431243057 432331200 433662109
1125.5 433662109 434825134 434574890 435468025 433702278 433703079 432933273 432390556 430052910 426635780
1134.1 426635780 424308319 420136795 417387466 412850800 410605927 407268219 403452988 400551949
1141.9 400551949 395572853 392714920 388885765 386941185 382727547 380071831 379318199 377123375
1149.6 377123375 377408524 376480217 378037910 378262711 379532166 381108208 382988701 386847229 388851051
1158.3C88851051L929978J647606L625717L525810L895149N508499L929177N795135
1166D20708122L807984O312370N890541O591148P666855O653290Q886414O637878P904167
1174.6D81058769P573090Q417892Q446732P049446P713165O185036P515221O992721
1182.4E40952072P595596O377068N325317N913887M854088N797043M569702N264092
1190.1E86648865M260978L547554M158135L101730M100380L988304M922562M280472
1197.8F19008980M287796M767532L618698L838539M011231M157333K555161K663727
1205.5F48908997K512130K047043K972260K495117K256393J656113K464752J993485
1213.2F67306290J532745K114258J381531J247482K52533O67038Q28934N53436N19485
$$ plain form
1158.3 388851051 392781029 394428635 398054352 401580162 405475311 410983810 414912987 420708122
1166 420708122 424516106 430828476 436719017 443310165 450977020 457630310 466516724 473154602 481058769
1174.6 481058769 488631859 497049751 505496483 512545929 520259094 526444130 533959351 540952072
1182.4 540952072 548547668 554924736 560250053 566163940 571018028 576815071 581384773 586648865
1190.1 586648865 590909843 594457397 598615532 601717262 605817642 609805946 614728508 619008980
1197.8 619008980 623296776 628064308 631683006 635521545 639532776 643690109 646245270 648908997
1205.5 648908997 651421127 653468170 656440430 658935547 661191940 662848053 665312805 667306290
1213.2 667306290 668839035 670953293 672334824 673582306 673834839 674501877 675330811 675884247 676403732
1221.9F76403732N22385J410599J99966R2545Q95767J576004Q09708j57776O90307
1230.6F82443237J08185K46582n8975q1940N36270Q60291J342926P42645P02286M06952
1240.2F87248459R43832P88498K62833M00543j59912J52817K4185P43637O12640K32468
1249.9F91250000N83801J58158N70678K59171M69284N72967M67835Q4610l72543M67605
1259.5F94511566K82517N56030O70242Q53729R79081O55594P85827O43082P82471L70788
1269.2G01090927Q74405R76257P10526R74197O24695J194992J391297J591720J479645
1277.8G10908661J193848J179122J197968J537552J039734R84421J151886J461792
1285.5G20654984J298599R15146J806259K155914J667862P26852O71387J138306J057663
$$ plain form
1221.9 676403732 676926117 678336716 678536682 678629227 679524994 681100998 681910706 681752930 682443237
1230.6 682443237 682551422 682798004 682739029 682657089 683193359 684053650 685396576 686139221 686841507 687248459
1240.2 687248459 688192291 688980789 689243622 689644165 689484253 689637070 689661255 690404892 691017532 691250000
1249.9 691250000 691833801 691991959 692562637 692821808 693291092 693864059 694331894 694416504 694043961 694511566
1259.5 694511566 694794083 695350113 696020355 696874084 697853165 698508759 699294586 699937668 700720139 701090927
1269.2 701090927 701965332 702941589 703652115 704626312 705251007 706445999 707837296 709429016 710908661
1277.8 710908661 712102509 713281631 714479599 716017151 717056885 718041306 719193192 720654984
1285.5 720654984 721953583 722868729 724674988 726830902 728498764 729225616 729897003 731035309 732092972
1294.2G32092972J021881R80606J074600R41849J248779J370926R70230R49173R20182
1302.9G41571198Q14590N17197M89807L57666K41699N26733L90473N46798O71998N24215
1312.5G46652374M75922M51279L96270P67365J329346M81491m37241j3504O52313L76663
1322.2G51132278K48414O26754K93656Q34274J248245Q00324N15442K40097J57241
1330.9G56096725l14712j98746l04107j91269N3405l23867N93338N50918o89239j034470
1340.5G54237976Q59757J297149m8065j67160k12250m63409o47583j55564q0413j68534
1350.2G54451904N91202k72217p553J57395m74320k81448m74625o38656o58112K22321
1359.8G52615891o86417n42450j30310j887589J057587Q42209J27640N37033j617890
$$ plain form
1294.2 732092972 733114853 734095459 735170059 736111908 737360687 738731613 739701843 740651016 741571198
1302.9 741571198 742385788 742902985 743392792 743750458 743992157 744518890 744909363 745456161 746128159 746652374
1312.5 746652374 747128296 747579575 747975845 748743210 750072556 750554047 750116806 750103302 750755615 751132278
1322.2 751132278 751380692 752007446 752301102 753135376 754383621 755183945 755699387 755939484 756096725
1330.9 756096725 755782013 755583267 755279160 755087891 755141296 754817429 755410767 755961685 755272446 754237976
1340.5 754237976 755097733 756394882 756346817 756179657 755967407 755503998 754856415 754700851 754620438 754451904
1350.2 754451904 755043106 754770889 754763336 754920731 754446411 754164963 753690338 753051682 752393570 752615891
1359.8 752615891 751929474 751387024 751256714 749369125 750426712 751268921 751396561 751933594 750315704
1368.5G50315704j838760j93558l84369N8823k25067k526627j715393M52042J083450
1377.2G45026245o4697n43976K63748k28424m36020j308365q70514K4262P36694R50623
1386.8G43549576j960755Q04978K036896P18917L33481M63181J387024j454163l614731
1395.5G42264404J182328J557312m79508m274292j419144J453858K04391L48435Q27942
1404.2G41665726k332917o49414J453095Q3923j09100m55475m48074j079026r83810
1412.8G37144928M33197j46637M85382N10788N69229R91211n568542O15844L061142
1421.5G38096542J598053M10462l121186K03095J812439L26538J784210J106873j433106
1430.2G40783920Q05817K146149L09677j71967L049393K261352p634430J4878L795776
$$ plain form
1368.5 750315704 748476944 748283386 747899017 747957840 747732773 745206146 743490753 743942795 745026245
1377.2 745026245 744961548 744417572 744681320 744452896 744016876 742708511 741837997 741862259 742598953 743549576
1386.8 743549576 741588821 742393799 744430695 745149612 745483093 745946274 747333298 745879135 742264404
1395.5 742264404 743446732 745004044 744524536 740250244 738831100 740284958 740489349 740837784 741665726
1404.2 741665726 739332809 738683395 740136490 740220413 740111313 739655838 739207764 738128738 737144928
1412.8 737144928 737578125 737431488 737916870 738427658 738996887 739988098 734419556 735035400 738096542
1421.5 738096542 739694595 740105057 736983871 737186966 738999405 739325943 741110153 742217026 740783920
1430.2 740783920 741589737 743735886 744045563 743873596 746922989 749184341 741549911 741564789 745360565
1438.9G45360565J133957q1711O69174Q05893J496659J081161R73816J916428k76718
1447.6G53079224k962189R74197J779328r7733o96335N73883K453995K865143J468887
1456.2G59438400k748947m916916R58023K367707L554611J332245P02743K622605m609223
1464.9G58701248j714401L322296K096863J422500J721497M173660K225418k521133
1472.6G69427948j945038K566681L602371l412094J268082L461914J309357K037277
1480.3G78316498j14212J46103J950683J110688J100845K025223j335221k374496K560196
1489G83386307m088364n323486K769699K729645J402206J858521J88980q776856L967362
1497.7G78114014j49308n232620K316132k76032p47604P41959L032531L050003p307129
$$ plain form
1438.9 745360565 746494522 746412811 747081985 747887878 749384537 750465698 751439514 753355942 753079224
1447.6 753079224 750117035 751091232 752870560 752772827 752076492 752650375 755104370 757969513 759438400
1456.2 759438400 756689453 751772537 752730560 755098267 758652878 759985123 760687866 763310471 758701248
1464.9 758701248 756986847 760309143 762406006 763828506 765550003 769723663 771949081 769427948
1472.6 769427948 767482910 770049591 773651962 770239868 771507950 774969864 776279221 778316498
1480.3 778316498 778202286 778348389 780299072 781409760 782510605 784535828 783200607 780826111 783386307
1489 783386307 779297943 773974457 776744156 779473801 780876007 782734528 782923508 774146652 778114014
1497.7 778114014 777964706 772732086 775048218 774772186 774024582 774766541 777799072 780849075 773541946
1506.4G73541946j1937484j008530L612137K365K738800j351547l839646K336655o7902
1515.1G64026794q68225o047287n334701P258758O198044k119903q595124j763534
1522.8G52754822L361664L826675m177246j072006J199951k852783l7079J330108Q63953
1531.5G55198059R56574k514115q157120K594147K875977K783813M433747o402436
1539.2G51768646j1961136M867096M64325j225815K794877j301499l343887L828964
1546.9G45891571K148285K521820j189499m808884L098679L089600K592849n540390
1554.6G47804031k37579P047195O756287J16882k0224227q52204Q217850N040893K739716
1563.3G56408844J567612k850418r63746L112336K709121l45382j0289994L042374
$$ plain form
1506.4 773541946 761604462 760595932 764208069 764210434 766949234 765597687 761758041 764094696 764026794
1515.1 764026794 763158569 757111282 751776581 759035339 765233383 763113480 754518356 752754822
1522.8 752754822 756116486 759943161 755765915 754693909 755893860 753041077 753003998 754334106 755198059
1531.5 755198059 756154633 753640518 745483398 748077545 750953522 753737335 758171082 751768646
1539.2 751768646 739807510 744674606 745138931 743913116 746707993 745406494 742062607 745891571
1546.9 745891571 748039856 750561676 749372177 744563293 747661972 750751572 753344421 747804031
1554.6 747804031 747566452 754613647 761369934 761486816 741262589 740410385 748628235 753669128 756408844
1563.3 756408844 757976456 755126038 754162292 757274628 759983749 759638367 749348373 752390747
1571G52390747K950363K20032J430511K247773Q38623j3807221K962265K743454q40835
1579.7G51135712n30625j036682j70822j512985q42743j591797j717224q58002j732025
1588.4G41142807j066895k356491j125106k245484j508484j551590k918243j248856
1596.1G27121658k587204p00988j790390j724549k189178k671738j517868l363190
1603.8G10576553j020431j291123j714859l138656j317215k003174l265610J40229
1611.5F96965714k510529j014481j391372J001281m21142j4926300L066940M79508
1619.2F81249619L5400j373139P87430r16443p590332J487503m1122J072311m075012
1627.9F70636215k906265J044464p73315j74942r73130K574540K718658q074646l770371
$$ plain form
1571 752390747 755341110 755561142 756991653 759239426 760078049 746270828 749233093 751976547 751135712
1579.7 751135712 750605087 749568405 749397583 747884598 747041855 745450058 743732834 742874832 741142807
1588.4 741142807 740075912 737719421 736594315 734348831 732840347 731288757 728370514 727121658
1596.1 727121658 724534454 723833466 722043076 720318527 718129349 715457611 713939743 710576553
1603.8 710576553 709556122 708264999 706550140 703411484 702094269 700091095 696825485 696965714
1611.5 696965714 694455185 693440704 692049332 693050613 692629471 677703171 680770111 681249619
1619.2 681249619 681285019 679911880 680699310 679782867 672192535 673680038 673638916 674711227 670636215
1627.9 670636215 667729950 668774414 668001099 667826157 666853027 669427567 672146225 664071579 660301208
1636.6F60301208J605988Q85849J377640J405716p50962J275864O867K415466L076324
1645.3F71599960m036941j391220k221680L663254L564300M913712N925522n942688
1653F76074219j4361878O595688O675110K581787J535340J731567J861801K307358
1660.7F85000992K931366J63345l189087L749695K801590K509308L785400K771149
1668.4G00523758l837509k00806M330292l87573M390487O109238j110458m050141M510956
1677.1G10278244M714584K800141J815643j128235M453430P637253J399384j4725724
1684.8G17244720L749772Q928375M182815Q43583K411727M42810K961808L456039L600083
1693.5G47821732N341262L183899q719635M364548Q047867P357406m134597j0841980
$$ plain form
1636.6 660301208 661907196 662793045 664170685 665576401 664825439 666101303 666108170 668523636 671599960
1645.3 671599960 667563019 666171799 663950119 667613373 671177673 676091385 682016907 676074219
1653 676074219 661712341 668308029 674983139 677564926 679100266 680831833 682693634 685000992
1660.7 685000992 687932358 688095703 684906616 688656311 691457901 693967209 697752609 700523758
1668.4 700523758 696686249 696485443 700815735 700428162 704818649 710927887 709817429 705767288 710278244
1677.1 710278244 714992828 717792969 719608612 718480377 722933807 730571060 731970444 717244720
1684.8 717244720 720994492 729922867 734105682 734949265 737360992 737803802 740765610 744221649 747821732
1693.5 747821732 753162994 756346893 747627258 751991806 760039673 767397079 763262482 752420502
1701.2G52420502J1905517P759476K895355L95737J625366n61981K600098N063476
1708.9G84103546J196823m90265K797928L506699L100967j374206o36139N925751J418075
1717.6G99549179j2905579M688950N480576K248535J459656j75629r44443J416474
1725.3H00817719J389923O44226J431122K624893k293778j160431N735703M118347
1733H13307724p048340j1096268P348404N092240J376266K944870l551636l770217
1740.7H04603043O492385L336106k573471M87060M024277K332077J048279l37753n28107
1749.4H18883896M272613k094726k234421N262375K515564K607040K483292l782501
1757.1H27913132O66961K507019K652283L743057n407638j804352L837357J080780
$$ plain form
1701.2 752420502 764326019 772085495 774980850 775376587 777001953 776439972 779040070 784103546
1708.9 784103546 785300369 784810104 787608032 791114731 794215698 792841492 792205353 798131104 799549179
1717.6 799549179 786643600 791332550 796813126 799061661 800521317 800345688 799401245 800817719
1725.3 800817719 802207642 802851868 804282990 806907883 804614105 803453674 809189377 813307724
1733 813307724 806259384 795163116 802511520 807603760 808980026 811924896 808373260 804603043
1740.7 804603043 811095428 814431534 811858063 812345123 816369400 818701477 819749756 819412003 818883896
1749.4 818883896 823156509 821061783 818827362 824089737 826605301 829212341 831695633 827913132
1757.1 827913132 828580093 831087112 833739395 837482452 832074814 830270462 834107819 835188599
1764.8H35188599J091385K602233Q23212m873199L301544N701980l51486p442550l021775
1773.5H33019943O328354J486130k680817K271118R14383J136170l91007k532882J282119
1782.2H40833511K251130J439514j946106q31147J996155K97241O66275K186890J92795
1790.9H47086258p42264n710296l98484N681992R65652j813659J760025K541732j504592
1799.5H47866364k660447J960755j306610k43836J858444L4028P43484K81448n86547
1808.2H47947083J414108J041641k580337J71051J245651l4104L90473n6305M04968
1816.9H49944229j114120Q0719J344223K9220P32270k08741K083664J731262n751266
1825.6H48871460l20969L397522K817231j217652q086929K109070L677215M97589M81644
$$ plain form
1764.8 835188599 836279984 838882217 839705429 834832230 838133774 843835754 843484268 836041718 833019943
1773.5 833019943 839348297 840834427 838153610 840424728 841339111 842475281 842084274 839551392 840833511
1782.2 840833511 843084641 844524155 842578049 841746902 843743057 844040298 844706573 846893463 847086258
1790.9 847086258 846343994 840633698 840235214 845917206 846882858 845069199 846829224 849370956 847866364
1799.5 847866364 845205917 847166672 845860062 845616226 847474670 847508698 848252182 848533630 847947083
1808.2 847947083 849361191 850402832 847822495 847993546 849239197 849205093 849595566 849539261 849944229
1816.9 849944229 848830109 848910828 850255051 850284271 851016541 850807800 852891464 854622726 848871460
1825.6 848871460 848550491 851948013 854765244 853547592 845460663 847569733 851246948 851744537 852226181
1834.3H52226181N29404Q17032p60422j177750J064606J88064K82746K58484K352600
1842.9H55780945l96576r224396L683853M278107l4409j249466K00425R56649J450
1851.6H53996582J84708m11225k83050j85623J16577Q82187L39965K81601r3078m5090
1861.3H54783554k87323K25372J69678L55454R32922o67801K76642k678223k986603
1869.9H50123672K297516J831284R17053K76413J67923Q2169N5236k92739n21088l64609
1879.6H54572830l76434K72827Q7738P48520L7460n18264N18188O37131K007751p14111
1889.2H57273636l949738O56891J022568J6403Q50907o42396j303787J015320N10025
1897.9H55449829K23389K79922j08108L3951k74125J65329n05600l09829M21295l59574
$$ plain form
1834.3 852226181 852755585 853572617 852812195 851634445 852699051 852887115 853169861 853428345 855780945
1842.9 855780945 855384369 846159973 849843826 854121933 854087524 852838058 853038483 853995132 853996582
1851.6 853996582 854181290 853770065 853487015 853301392 853417969 854300156 854640121 854921722 854828644 854783554
1861.3 854783554 854496231 854721603 854891281 855246735 856179657 855511856 855788498 853110275 850123672
1869.9 850123672 852421188 854252472 855169525 855445938 855613861 855696030 855751266 855458527 854937439 854572830
1879.6 854572830 854196396 854469223 854556961 855305481 855342941 854824677 855342865 855979996 857987747 857273636
1889.2 857273636 853323898 853980789 855003357 855019760 855870667 855228271 853924484 854939804 855449829
1897.9 855449829 855673218 855953140 855845032 855878983 855604858 855770187 855264587 854954758 855376053 855016479
1907.6H55016479L9597K84042j137847n5619J568756M7837J03302j93787M21906J557006
1917.2H57651672m043197j392441K388763J175766R37806k275544j269531J615295
1924.9H54788589P21741Q4152k1896l19748l56293k78701l42484k04468k09503k8000
1934.6H53833389k0752N84030O35376R5444j09024j42746J732178j074905l938904
1943.2H51594086J578750J273423r26362n27038M33807M21677m1351K14080R8420K91519
1952.9H54411011K86941l42788q82416l23181R0408j39313L58048J65634l21121l33634
1962.5H52969589M01459P25632M47998J49231j451416j125107R5291J60675K93350
1971.2H52666702m57m7074Q3389J76773L83835N24292J984n07660m03290k95639k13623
$$ plain form
1907.6 855016479 855056076 855340118 854202271 854146652 855715408 855763245 855866547 855672760 856094666 857651672
1917.2 857651672 853608475 852216034 854604797 855780563 856718369 854442825 853173294 854788589
1924.9 854788589 855510330 855594482 855572586 855252838 854896545 854617844 854275360 854070892 853861389 853833389
1934.6 853833389 853812637 854396667 855032043 855127487 855018463 854875717 856607895 855532990 851594086
1943.2 851594086 853172836 854446259 853519897 852992859 853426666 853848343 853806992 854021072 854119492 854411011
1952.9 854411011 854697952 854355164 853472748 853149567 853239975 853100662 853458710 853624344 853303223 852969589
1962.5 852969589 853371048 854096680 854544678 854693909 853242493 852117386 852212677 852373352 852666702
1971.2 852666702 852666245 852619171 852702560 852879333 853263168 853787460 853789444 853281784 852878494 852582855 852369232
1981.8H52369232o32095n55725j71967r9106M09546M39987l11126r16J623917L16925
1991.5H53388672k657547p65381O04248K02332J6632j09330M6921j98211N8746L14407
2001.1H50901489R4452J58997J983j34811m11148m39453l25394j95923K02866L7536
2010.7H49890594K8077R1095K975J95389M44336l0441r30558n76324m46701p7591R4375
2021.3H48685226m12979j75705J0376O22483M69055M806K62604j71432j43814j61286
2031H48989334l14865l44849n80520l77808l815L9597j17340K44141P61795N05600
2040.6H48801270o54679l96957l8910p77130l3112O11j63041K17972q5983j45264k11029
2051.2H46513748M4632O1951K04391O7520k29110K594m36631m61883m70276k08664
$$ plain form
1981.8 852369232 851737137 851181412 851009445 850910339 851319885 851759872 851448746 851447830 853071747 853388672
1991.5 853388672 850731125 849965744 850569992 850772324 850788956 850679626 850726547 850528336 850587082 850901489
2001.1 850901489 850995941 851154938 851156921 851022110 850610962 850171509 849846115 849650192 849853058 849890594
2010.7 849890594 849918671 850009766 850012741 850208130 850652466 850622025 849691467 849115143 848668442 848590851 848685226
2021.3 848685226 848272247 848096542 848106918 848729401 849198456 849203262 849465866 849294434 849150620 848989334
2031 848989334 848674469 848329620 847749100 847371292 847367477 847407074 847289734 847533875 848295670 848801270
2040.6 848801270 848146591 847749634 847710724 846933594 846900482 846901093 846738052 846956024 846870041 846724777 846513748
2051.2 846513748 846558380 846620331 846824722 846892242 846663132 846665726 846229095 845767212 845296936 845088272
2060.9H45088272L51334K16903L53012K10267m68979n91889j40228o7596n9205j50604
2070.5H44741287n44357p76215o74209l6011R2468J14975Q7815r3384m6540q2931M9896
2081.1H42832794k00882j30157k79770o91757j68534R5826j42060o3095K18125q9951
2090.8H41380539J5716J21689j26037J19476p7972P8354J63726j92108r5901J75094
2100.4H41562576M10767M25110K36664M348J60904K9297l4485N8823m1046k46201o09054
2111H41957703k137K88239M60815L78418M0589O77719K96478k10037j73340J34277
2120.7H43848724J62735m44488o52619p37915k45514M8447L67813M18244J40457K54059
2130.3H43159943r5902N5466J9531l25622k58255n3025k6245M5853K09350j9760L69950
$$ plain form
2060.9 845088272 845439606 845656509 846009521 846219788 845750809 845158920 845018692 844951096 844891891 844741287
2070.5 844741287 844196930 843420715 842746506 842710495 842802963 842917938 843005753 842912369 842865829 842782898 842832794
2081.1 842832794 842631912 842501755 842221985 841530228 841361694 841457520 841315460 841252365 841470490 841380539
2090.8 841380539 841396255 841517944 841391907 841511383 841433411 841511765 841675491 841483383 841387482 841562576
2100.4 841562576 841973343 842398453 842635117 842639465 842800369 842829666 842795181 842854004 842812958 842566757 841957703
2111 841957703 841955566 842243805 842704620 843083038 843123627 843801346 844097824 843887787 843714447 843848724
2120.7 843848724 844011459 843566971 842914352 842176437 841930923 841979370 842347183 842765427 842905884 843159943
2130.3 843159943 843064041 843119507 843139038 842813416 842555161 842502136 842475891 842521744 842731094 842711334 843081284
2140.9H43081284J20925k5558M16565K98538J31378l31649k6093K1591O9199J95236
2150.6H43951416J0071J73950j24054K87705K25143P5073N0812k86789J18637N5237
2160.2H44537201m4479m74701j05973K65580j99967J48544K30103L29590k4185k07367
2169.9H44454346P9422P7667k35367n70907r0485l17383k98920J43967P4539k00195
2179.5H43116684J0910P12051J93558Q4686N799k29492L6544j9378J88141k17896l9825
2190.1H43841782L78570J27258L43476K72598J74484L84217K54669q4992j58462k52991
2199.8H45280609N0964K19040j7547J71432L84903M05197O333J45492K04087P8506
2209.4H46929016K060m44565R7504J78757q4381k26441p9651L54386j17569k27814
$$ plain form
2140.9 843081284 843202209 843176651 843593216 843891754 844023132 843691483 843665390 843686981 843756180 843951416
2150.6 843951416 843961487 844135437 844011383 844299088 844524231 844599304 844650116 844363327 844481964 844537201
2160.2 844537201 844492722 844018021 843912048 844177628 843977661 844126205 844356308 844685898 844661713 844454346
2169.9 844454346 844533768 844611435 844376068 843805161 843714676 843397293 843098373 843242340 843316879 843116684
2179.5 843116684 843127594 843839645 844033203 844117889 844123688 843894196 843930740 843911362 844099503 843881607 843841782
2190.1 843841782 844220352 844347610 844691086 844963684 845138168 845522385 845777054 845692062 845533600 845280609
2199.8 845280609 845331573 845550613 845533066 845704498 846089401 846494598 846500931 846646423 846850510 846929016
2209.4 846929016 846931076 846486511 846584015 846762772 846678391 846451950 846372299 846726685 846609116 846381302
2219H46381302r7275K74582J87454l3340R5062q39J59912l00446j85012l12958l58582
2229.7H45809860M56543K74811q0338k68402P2861Q9035J59912L1204n07202K56806
2239.3H46295090J74484l38287l14026r9945J38168k8381R3002J44653J4954k26517
2248.9H45853195M0131M4937k93274p248k7847r3537L0976k1973K07749N07354l35846
2259.5H45904617m50668Q6746K01264N97992k23618k18048q164m74929j54419K20489
2269.2H45481262O45142J29700K8457j11084j91955J1825o8512K96173n68161k90985
2278.8H45361862P9270p6294M09011L11661K28119m65011j8998m8675j39466K51160
2288.5H45892639l53546K22015M044P858p2708l09601O028p8812L36990k08511K67105
$$ plain form
2219 846381302 846284027 846558609 846746063 846712723 846807785 846806946 846966858 846666412 846481400 846168442 845809860
2229.7 845809860 846266403 846541214 846460876 846192474 846265335 846354370 846514282 846545486 846038284 846295090
2239.3 846295090 846469574 846131287 845817261 845717316 845855484 845827103 845920105 846064758 846079712 845853195
2248.9 845853195 845893326 845938263 845644989 845637741 845609894 845516357 845547333 845525360 845733109 846240463 845904617
2259.5 845904617 845453949 845540695 845741959 846339951 846116333 845898285 845890121 845415192 845260773 845481262
2269.2 845481262 846126404 846256104 846284561 846173477 845981522 845993347 845924835 846221008 845652847 845361862
2278.8 845361862 845441132 845364838 845773849 846085510 846313629 845848618 845829620 845780945 845641479 845892639
2288.5 845892639 845539093 845761108 845765152 845773010 845700302 845390701 845396729 845317917 845654907 845446396 845713501
2299.1H45713501J14593k34527L70178k90527o8360j9607K69775k09350l94059J97831
2308.7H45449448k82288O9580m58145L19595K24991j233063o84738j88293P32040J78909
2318.4H44128036m50210k90222Q1863k7389p63169J40457k32849k81143L83530O0806
2328H42749710r77402m13894R66720p858l30124r64203K96784Q37326j465607n36575
2337.7H40154877R80835K82592j014785J05285J028900J137391o485j622086l50571
2346.3H40695953n49926J302871L192063J485748p10373j327667l25394J95847j069107
2355H42890015p27921j08337l01056j63574o90613l02353j80664r43909o19812n18875
2364.7H38332901J074982J530761M43497R50089L91693l52249m63868L6774P98035
$$ plain form
2299.1 845713501 845828094 845593567 845963745 845673218 845604858 845585251 845855026 845645676 845251617 845449448
2308.7 845449448 845167160 845236740 844778595 845098190 845323181 844090118 843405380 843217087 843949127 844128036
2318.4 844128036 843677826 843387604 843469467 843442078 842678909 842819366 842586517 842305374 842688904 842749710
2328 842749710 841772308 841358414 842325134 842317276 841987152 841022949 841319733 842157059 840691452 840154877
2337.7 840154877 841135712 841418304 840403519 840508804 841537704 842675095 842668610 841046524 840695953
2346.3 840695953 840146027 841448898 844640961 846126709 845416336 844088669 843763275 843959122 842890015
2355 842890015 842162094 842053757 841752701 841589127 840898514 840596161 840415497 839471588 838851776 838332901
2364.7 838332901 839407883 840938644 841382141 842332230 842723923 842371674 841907806 841944580 842742615
2373.3H42742615R42154O94732J40534K10113N12772M93622L37982J17569J94626L78036
2383H46764755J22605K38037N21011K7924j38321j25962j08718R9563p1716j20011
2392.6H47209167J0605M6082M9744K3345j88674J32598K88849l20968k45743r5062
2402.3H46909943J50985K47574j62506k76565k23618J59454J56708j26114l84292k62604
2411.9H46188965q2703m00009M03290P23877j17188j97982j60523j84021k6474k03552
2421.6H45943680l00293J3122K82822J87225l56826l99399l3493K60849L34701j42440
2431.2H45789948m120R994n09186n98144o3095K48642k40250j30768n2414K19269K29645
2441.8H44899521l35770L9826j84784k75650K7160q8882l4866j86539l02353q3771
$$ plain form
2373.3 842742615 843684769 844379501 844520035 844730148 845242920 845736542 846074524 846192093 846386719 846764755
2383 846764755 846887360 847125397 847646408 847674332 847536011 847410049 847301331 847400894 847329178 847209167
2392.6 847209167 847219772 847265854 847315598 847338943 847150269 847282867 847571716 847250748 847005005 846909943
2402.3 846909943 847060928 847308502 847145996 846869431 846645813 846805267 846961975 846835861 846451569 846188965
2411.9 846188965 846106262 845706253 846109543 846833420 846716232 846518250 846357727 846173706 846147232 845943680
2421.6 845943680 845643387 845656509 845939331 846126556 845769730 845370331 845336838 845597687 845932388 845789948
2431.2 845789948 845785828 845795822 845286636 844688492 844625397 844874039 844633789 844503021 844450607 844669876 844899521
2441.8 844899521 844563751 844603577 844418793 844143143 844170303 844081421 844046555 843860016 843557663 843473892
2451.5H43473892K91748j46179k65121J94549R0790p4310j50147K64054J69601l11966
2461.1H43536911m16336k35138j31760n46188j47400K23694o9962l2272M04968L03879
2470.7H42890396l32184j22375l27225p79724l96118Q1329K50626j45111j27564L79105
2480.4H41371155L77044P6752j89895m30985l18680L7384O4011n09873o32553l7155
2490H39807205q3542r0561j1749L25318M47464l00217j02997m5013r2850k44446n44357
2500.6H39064255j04523l15247m6768P9041j44425J01319N1040L57132J86386k30102
2510.3H38998108n03006n48782k94342l93525K3270M89960j99662o94046K23160O25077
2519.9H37726212J68991r4223M2801Q8729l56674j84479n07354m49448K53143n6610
$$ plain form
2451.5 843473892 843765640 843619461 843354340 843548889 843639679 843565369 843415222 843679276 843848877 843536911
2461.1 843536911 843120575 842885437 842753677 842207489 842060089 842283783 842213821 842181549 842586517 842890396
2470.7 842890396 842558212 842435837 842108612 841328888 840932770 841014099 841264725 841119614 840992050 841371155
2480.4 841371155 841748199 841824951 841635056 841204071 840885391 840922775 840986786 840476913 839844360 839807205
2490 839807205 839723663 839633102 839621353 839946671 840394135 840093918 839990921 839945908 839853058 839608612 839064255
2500.6 839064255 838959732 838644485 838597717 838676758 838532333 838633652 838684692 839041824 839228210 838998108
2510.3 838998108 838495102 837946320 837651978 837258453 837281723 837771683 837572021 836877975 837101135 837726212
2519.9 837726212 837895203 837800980 837843781 837932510 837575836 837391357 836884003 836434555 836687698 836631088
2529.6H36631088q8806J4343J78147R994M4632K62146k65503j70440j58387k07672
2539.2H36249542r3155j05972k29q4457m40598o99386J82342N90668J80130j45950
2548.9H35632935n71518p6828M70352p3395p26852j28174K60315j16730J9989j78223
2558.5H34511871j05972J9531l30124j9607R0713k63290k05765k7237l7918k37198
2568.1H33395004j08185K08054j11694J13373K68936k95105j0681J91345j00022m53415
2577.8H33097610o47659l39355R0027j22147n56030J45187M52423K60697J15585l53470
2587.4H32142868m1351P8277l68652o76804k62451K63367j52969k20871L5705k6626
2597.1H30770493j43052P782P2403j30539j03988k02179j16425q4686m45938m57764
$$ plain form
2529.6 836631088 836542282 836556625 836734772 836744766 836789398 837051544 836786041 836615601 836457214 836249542
2539.2 836249542 836156387 836050415 836050186 835965729 835525131 834825745 835008087 835598755 835778885 835632935
2548.9 835632935 835061417 834984589 835454941 835381546 834654694 834526520 834786835 834670105 834690094 834511871
2558.5 834511871 834405899 834425430 834095306 834075699 834166412 833903122 833697357 833670120 833632202 833395004
2568.1 833395004 833286819 833494873 833383179 833496552 833765488 833470383 833459702 833651047 833551025 833097610
2577.8 833097610 832449951 832110596 832200623 832078476 831522446 831667633 832120056 832380753 832496338 832142868
2587.4 832142868 832101517 832179794 831811142 831134338 830871887 831135254 830982285 830761414 830797119 830770493
2597.1 830770493 830627441 830635223 830707626 830577087 830473099 830270920 830154495 830069809 829623871 829166107
2606.7H29166107l89786l29208J92032L54156p0343J43433L81775k06146n79453n33371
2616.4H28129196o59637l55683R4681j1062r92J97372L78342N569k03781J7700l33633
2627H27258072j78452J11008j61514p22428p45926j91574m64096m24957R5444M38614
2636.6H25014191L21579j28327j8539k26441m35028l15933l22876l66287k44599J25657
2646.3H23403397R6206n3634J09710K08435j13525j77765j78757m61120n04685n52063
2655.9H21776199K6398J21994l82843m5624k1972j22910R8953K63901J60751m07257
2665.5H21467590m73251k0142k11563m08401K4414j4267k93198q9416J49841k30102
2675.2H19901505l52479K34375P6905l34549k68555q9569j70212m33349m31519k74887
$$ plain form
2606.7 829166107 828776321 828447113 828639145 828993301 828922958 829066391 829448166 829242020 828662567 828129196
2616.4 828129196 827469559 827113876 827208557 827197495 827196503 827393875 827772217 827777786 827574005 827591705 827258072
2627 827258072 827079620 827190628 827029114 826306686 825560760 825369186 824905090 824480133 824575577 825014191
2636.6 825014191 825335770 825207443 825188904 824962463 824527435 824211502 823888626 823522339 823277740 823403397
2646.3 823403397 823499603 823445969 823555679 823764114 823650589 823472824 823294067 822832947 822328262 821776199
2655.9 821776199 821802597 821924591 821541748 821496124 821474152 821351242 821450195 821714096 821874847 821467590
2665.5 821467590 820994339 820974197 820762634 820354233 820378647 820364380 820071182 819981766 820131607 819901505
2675.2 819901505 819549026 819783401 819860306 819525757 819257202 819167633 818997421 818564072 818132553 817857666
2684.8H17857666K4490J49308J18408j10474Q4152N20096J2436p30591j119079m90341
2694.5H16316071j4725l80936n4092L25317J64490o7673P5379L0746l55988l05404
2704.1H15733185l0823o6757k48566j52969l66745m81491m57382k3270O81000J96914
2713.8H14783096r8495j54114k80609n37415p39135J16653m8675n58854l39126k56272
2723.4H11887054M7608P0495N6916j23749n17578r7504L35083l69339q15506l32870
2733H10140610o9275j3199j9226J3962l5935L3875L2348l25470P63J83411k06375m25034
2744.6H09310455m16946l13721n75485l24249K52914N8594J4572o5536m94233j17111
2754.3H07329254L72849J89132j82800m54407o97555p41654N4474K39868n37338l97415
$$ plain form
2684.8 817857666 817882156 818031464 818149872 818039398 818123550 818643646 818656082 817925491 816806412 816316071
2694.5 816316071 816301346 815920410 815866318 816191635 816356125 816288452 816363831 816394577 816038589 815733185
2704.1 815733185 815702362 815635605 815387039 815234070 814867325 814385834 813928452 813905182 814586182 814783096
2713.8 814783096 814684601 814530487 814249878 813712463 812973328 813089981 813041306 812482452 812143326 811887054
2723.4 811887054 811934662 812005157 812062073 811938324 811420746 811323242 811658325 811288986 810473480 810140610
2733 810140610 810071335 810058136 810038910 810052872 810016937 810050812 810083160 809757690 809758453 809941864 809735489 809310455
2744.6 809310455 808893509 808579788 808004303 807680054 807932968 807991562 808006134 807940598 807446365 807329254
2754.3 807329254 807702103 807891235 807708435 807254028 806556473 805814819 805869293 806109161 805571823 805174408
2763.9H05174408L41797M67148j8158k80609k87781k52152m59671o46667m20304m74319
2773.5H03143692k70462j2970j42746M3793K37732k04087l21655L3417l13339j24665
2783.2H02068710k80609r65195o94046m36553J33438K1133k18201L20511K65045r5291
2792.8H00118942m07791m20074p49512n16892j82266p32116o28434l27301j831j13907
2802.5G96038818m6920K32620k89459k47956j98822l22418l99551o29807o27670m93622
2812.1G93015213n37262o47507j42440k7924N2948Q9645j52053J74942n51987j092835
2821.8G90180740n64270m60128p35703r55887l99475n8670M1504o485o79016k50931
2831.4G86111679n2185r71527p60498l62015o22787o34919n32379o77948j214523j206818
$$ plain form
2763.9 805174408 805516205 805983353 805965195 805684586 805396805 805144653 804684982 804038315 803618011 803143692
2773.5 803143692 802873230 802860260 802717514 802761307 802999039 802794952 802473297 802506714 802193375 802068710
2783.2 802068710 801788101 800822906 800128860 799692307 799825745 799846878 799628677 799949188 800214233 800118942
2792.8 800118942 799711151 799291077 798541565 798024673 797842407 797110291 796481857 796154556 796152725 796038818
2802.5 796038818 795991898 796224518 795935059 795687103 795488281 795165863 794766312 794136505 793508835 793015213
2812.1 793015213 792477951 791830444 791688004 791660080 791713028 791802673 791650620 791825562 791273575 790180740
2821.8 790180740 789616470 789156342 788420639 787464752 787065277 787006607 787048111 787041626 786362610 786111679
2831.4 786111679 786059494 785087967 784327469 783965454 783342667 782707748 782175369 781497421 780282898 779076080
2841.1G79076080q13369p08008n11246p27463r79690j081696j408768j656494j962280
2849.7G69227066j831970j184082p49130m69285n7067L22952N71670K97165k56271
2858.4G65871048P8201K0218o83975n51529k74277p9651j21841p28989r79919m36783
2868.1G62112503k72827q56705o22635j49231l01590l99475o59027p21435k63062Q9111
2877.7G57955627k10266l67126j17111m73481m05273P2021q8882n71442p71865k83356
2887.3G54738846l77731q70514r10950m59290O6834n78613r07746n52063l29513k45819
2897G49573441l56293N9814l34778j025543p79266n54962l22571l50571m30374k19955
2906.6G45258942j95542l26538l96728o31867n08804l31879q11767q50983p58438o73828
$$ plain form
2841.1 779076080 778262711 777554703 777043457 776315994 775336304 774254608 772845840 771189346 769227066
2849.7 769227066 767395096 766211014 765461884 764992599 764935532 765258484 765830154 766127319 765871048
2858.4 765871048 765949249 765969467 765285492 764733963 764459686 764380035 764258194 763529205 762549286 762112503
2868.1 762112503 761839676 760982971 760360336 760211105 759909515 759510040 758851013 758129578 757866516 757955627
2877.7 757955627 757745361 757378235 757261124 756787643 756382370 756454391 756365509 755794067 755022202 754738846
2887.3 754738846 754361115 753490601 752579651 752120361 752187195 751608582 750700836 750148773 749819260 749573441
2897 749573441 749217148 749276962 748942184 747916641 747137375 746582413 746259842 745909271 745478897 745258942
2906.6 745258942 745063400 744736862 744340134 743708267 743199463 742867584 742055817 741204834 740446396 739772568
2916.3G39772568p96738p42645k83127q76541q41904m08783j94244J87301j05209o8817
2925.9G35641861j07727k5406K52075p4615n33066n50232p9346K79770M95529K30332
2935.6G35529175M91028R29794N58929M18778J80206Q4229L35998O88324M56619j72500
2945.2G39500580k76337k81982k2812O9580K5711J3580j2817m36859o33850J28021
2954.8G38072815l27606q80051m65240J2283K89307K36816L50647J88980L79257J43433
2964.5G38000641j88141M17175N07431J84708K85187R53216Q08716N82962P19834P64541
2974.1G43036270Q67157K02103M46319O61698N03235O96487L48511M29153M44489N46264
2983.8G48181686L54233K94571Q46176O86341M90341M66842P55921M88434j0605J91116
$$ plain form
2916.3 739772568 738975830 738233185 737950058 737073517 736231613 735822830 735628586 735815887 735710678 735641861
2925.9 735641861 735534134 735508728 735760803 735686188 735153122 734602890 734523544 734803314 735298843 735529175
2935.6 735529175 736020203 736949997 737508926 737927704 738107910 738192139 738528137 739216461 739673080 739500580
2945.2 739500580 739224243 738942261 738919449 738989029 739014740 739028320 739015503 738578644 737944794 738072815
2954.8 738072815 737745209 736865158 736399918 736412201 736701508 736938324 737288971 737477951 737857208 738000641
2964.5 738000641 737812500 738229675 738737106 738921814 739207001 740160217 740968933 741551895 742271729 743036270
2974.1 743036270 743903427 744105530 744551849 745213547 745716782 746413269 746761780 747190933 747635422 748181686
2983.8 748181686 748535919 748830490 749676666 750363007 750853348 751320190 752076111 752564545 752553940 752745056
2993.4G52745056J92719L16543K47879J84098K70156O0120j82953k29339M10461O01501
3003.1G54616241m37240q04825k56271P1335K53524L16849M36478q8425k33917J18789
3012.7G53992538m79354l35007l41873k36435L29818j11923k79846l96500p10754p45544
3022.4G50685120J97906M06799n70983m44794l97034j24969K12478J2207m52499p32880
3032G48791351K41928J79444o29273l16772j49384p57370n42373M6157r384L281k15149
3042.6G46642456j83258n64804o51550j73798n37033o02493n06363j84860k05460k36969
3052.2G42795868j35803l89939j42593q03986q93020J38092q0033p91168l35617J26496
3061.9G39488297k05155j17264n54962j59225J61743q06809o43692m22821m67834m13361
$$ plain form
2993.4 752745056 752937775 753254318 753502197 753686295 753956451 754016571 753833618 753604279 754014740 754616241
3003.1 754616241 754179001 753374176 753117905 753189240 753442764 753759613 754196091 754107666 753873749 753992538
3012.7 753992538 753513184 753178177 752836304 752599869 752929687 752817764 752537918 752141418 751430664 750685120
3022.4 750685120 750883026 751289825 750718842 750274048 749877014 749752045 749964523 749976730 749524231 748791351
3032 748791351 749033279 749212723 748583450 748266678 748117294 747359924 746817551 746863708 746854324 746857605 746642456
3042.6 746642456 746459198 745894394 745242844 745069046 744532013 743929520 743423157 743238297 743032837 742795868
3052.2 742795868 742660065 742270126 742127533 741323547 740430527 740568619 740488586 739697418 739361801 739488297
3061.9 739488297 739283142 739165878 738610916 738451691 738613434 737806625 737162933 736740112 736272278 735858917
3071.5G35858917j15661l9139K0218j3199m72565k78091n16205k67029l06320m17175
3081.2G33453751L22799k20718n06363m24805l87497n25360j62124K34222o56204n93186
3090.8G30534515l08990k17896l18603k83356j90811o97556q9950K7313k55661n31082
3100.5G27667923p17621k69623m84237l44696j99433k39868p9727l96576q83865q29544
3110.1G23222733l28980k25449k36358o027j3581q64486p10602M5395o54297o74744
3119.8G19553604J42746l39355j330109o76727k80609m31748k28195j108780q96072
3128.4G14404755J34353L00217Q8119k47802r73664j486969o43692l92150m93241k32162
3138.1G10457764J76468n6229j424484j184082k79999l78037p43637n23758l50265
$$ plain form
3071.5 735858917 735743256 735704117 735724335 735711136 735238571 734960480 734444275 734177246 733870926 733453751
3081.2 733453751 733776550 733555832 733049469 732624664 732237167 731711807 731549683 731783905 731127701 730534515
3090.8 730534515 730225525 730007629 729689026 729405670 729214859 728517303 728427353 728454666 728199005 727667923
3100.5 727667923 726950302 726680679 726196442 725851746 725652313 725412445 725332718 724936142 724052277 723222733
3110.1 723222733 722893753 722668304 722431946 722425919 722412338 721547852 720837250 720882645 720228348 719553604
3119.8 719553604 719696350 719356995 718026886 717350159 717069550 716637802 716409607 715300827 714404755
3128.4 714404755 714539108 714839325 714927444 714679642 713705978 712219009 711575317 711183167 710689926 710457764
3138.1 710457764 710634232 710578003 709153519 707969437 707689438 707311401 706567764 706044006 705693741
3146.8G05693741n03464n2872m13284q42132p48902m05502k89383r63974o51169j31454
3156.4G00691605l10898j46942k77787j424636j119080l01285p54700l32870m16260
3165.1F95607147r77936j012954p21131n01938o29119j70136l40652k84348k40555
3173.8F90728378r01870q64487j76697m11301j678390n60913L24859l26461o79322
3182.4F85453796p97042J05896k76642j228714j302567r77478l16925m98123o63681
3191.1F79498520k28500J24511l31421n90591o14090q70743r96857j155166p91626
3199.8F74044037m26254q4610o34003j006775l68576m40979l39432k55127k92511o77185
3209.4F69518585j097641o87561k03018k61230j179886r50165l11508m27780k78550
$$ plain form
3146.8 705693741 705190277 705137405 704724121 703881989 703133087 702727585 702438202 701474228 700823059 700691605
3156.4 700691605 700380707 700233765 699955978 698531342 697412262 697110977 696356277 696023407 695607147
3165.1 695607147 694629211 693616257 692895126 692393188 691764069 691593933 691253281 690968933 690728378
3173.8 690728378 689826508 688962021 688785324 688374023 686695633 686134720 686459579 686133118 685453796
3182.4 685453796 684656754 684762650 684486008 683257294 681954727 680977249 680660324 680162201 679498520
3191.1 679498520 679270020 679394531 679063110 678472519 677858429 676987686 675990829 674835663 674044037
3199.8 674044037 673617783 673533173 672899170 671892395 671523819 671082840 670743408 670488281 670195770 669518585
3209.4 669518585 668420944 667733383 667530365 667269135 666089249 665139084 664827576 664399796 664121246
3218.1F64121246k09350n31388o96792l14942l01208m77371r72748p79648j68838o01044
3227.8F59067917o61926j032029r05685r7885k42157m92172k41547l09906q78601p37991
3237.4F53468018q07496p54547m41360n72815p36084l61328M51279l19596m94156m54559
3247F48977356q77152l77044q40988p69959n97534l16391k71759j021576k38037k00272
3256.7F43466644o68258j27793J23902n66559j074219o99997l13873m5548j98250n81932
3266.3F39314117r51614p01408o54106l84408K72370L0517k15454j129722m57764O9618
3276F35192146q03070J32675r0370o40487n84031q74710o02417l73611m24385m95835
3285.6F30435905p2517k47078o41518o59484l12233l5591o69556j026955q63838J9531
$$ plain form
3218.1 664121246 663911896 663380508 662683716 662368774 662067566 661590195 660617447 659837799 659668961 659067917
3227.8 659067917 658405991 657373962 656468277 656370392 656128235 655636063 655394516 655084610 654206009 653468018
3237.4 653468018 652660522 651905975 651464615 650891800 650155716 649794388 650245667 649926071 649431915 648977356
3247 648977356 648100204 647723160 646882172 646112213 645514679 645198288 644926529 643904953 643666916 643466644
3256.7 643466644 642798386 642670593 642794495 642227936 641153717 640453720 640139847 640094299 639896049 639314117
3266.3 639314117 638362503 637661095 637006989 636622581 636894951 636925468 636710014 635580292 635122528 635192146
3276 635192146 634389076 634521751 634431381 633790894 633206863 632332153 631729736 631356125 630931740 630435905
3285.6 630435905 630363388 630116310 629474792 628815308 628503075 628467484 627797928 626770973 625907135 625926666
3295.3F25926666M09508j85127o14548n39627l99017m56047n54810j005745k84805
3303.9F22296448k53067o16532j77078q08449n91507n24444o14586o36940n71060j20163
3313.6F17382622p94220n78804o90270o98013m58603j150131n33867r2773n85976p27348
3323.2F11072617n52254q16384n82199n37605q19855j56898j86501n43213j515770
3331.9F05361938j593551p08428m96254m13551j203995q33625l85361l25508o3134
3340.6E99338531n44929r73206j497306r96895p84188m79049j92032r73816p32651
3349.3E92164459o04744o31256m88357o39649j374855j574478r10912q72497o20766
3357.9E84446945p32345n92537n79415q90693n53437o80008q09898q00819n58701r74502
$$ plain form
3295.3 625926666 626336174 626151047 625536499 624996872 624597855 624141808 623586998 622581253 622296448
3303.9 622296448 622043381 621426849 621249771 620441322 619849815 619325371 618710785 618073845 617502785 617382622
3313.6 617382622 616588402 616009598 615319328 614621315 614162712 613012581 612478714 612385941 611799965 611072617
3323.2 611072617 610520363 609703979 609121780 608584175 607764320 607607422 607420921 606877708 605361938
3331.9 605361938 603768387 603059959 602563705 602150154 600946159 600112534 599727173 599401665 599338531
3340.6 599338531 598793602 597820396 596323090 595326195 594542007 594062958 593870926 592897110 592164459
3349.3 592164459 591559715 590928459 590440102 589800453 588425598 586851120 585940208 585067711 584446945
3357.9 584446945 583714600 583122063 582542648 581651955 581098518 580418510 579608612 578807793 578249092 577274590
3367.6E77274590j125870j062622j538697o22520l36533r70344r78623m75959m86489
3376.3E69676933o33125k15302r38110r64088m35715p32269p68547o84014o18248q34579
3385.9E62852936m97666J23673j95885r50050n70908j9378r09653j118279l83110j22261
3395.6E58209419L0594n48057j422348r19533l37525O752J51558o18591n03006k17705
3405.2E53831558m47578p00455o21643J68571j85050p23839j58463P3357m49600n40429
3414.8E50246429m02450j28479N8784m69207l61405j000099q47015O81915O08482j8310
3424.5E48368645n70069P0038M61006k37274l11851m2229r1438l68119o2980k73323
3434.1E46942406K6359O74095O62194L80745l29171m76188k86637N01099Q7585j29585
$$ plain form
3367.6 577274590 576148720 575086098 573547401 572924881 572588348 571618004 570639381 570163422 569676933
3376.3 569676933 569043808 568828506 567890396 566926308 566490593 565758324 564989777 564305763 563687515 562852936
3385.9 562852936 562355270 562478943 562283058 561333008 560762100 560742722 559833069 558714790 558331680 558209419
3395.6 558209419 558240013 557691956 556269608 555350075 555012550 555019302 555170860 554552269 554049263 553831558
3405.2 553831558 553383980 552683525 552061882 552230453 552045403 551321564 551163101 551236458 550786858 550246429
3414.8 550246429 549843979 549715500 549774284 549305077 548943672 547943573 547096558 547778473 548386955 548368645
3424.5 548368645 547798576 547868614 548329620 548092346 547780495 547738266 547646828 547278709 547215729 546942406
3434.1 546942406 546968765 547642860 548305054 548685799 548356628 547880440 547593803 548094902 548182487 548052902
3443.8E48052902O09055P92770M66881j605759J2932J055756L84598J001625K84118
3452.5E51054878M68712M74625N53055M10194o8512L81584O1607M70047K91291K54287
3462.1E54351768K70348M42391J315650Q30040n8555l74413J147118J023140n3177
3470.8E58894310M7417J32675J080665N64537M0703M75197J188507J271744O30798
3479.5E64326553N83153o2981l42903k15301J214676J322632P84912J057930q65212
3488.1E67803459j97182J439896J147537P44438J162262J425972M6769N4206j11999
3496.8E73515358J10474J092186O10427Q56781J375084L44239m48876P15409J090164
3505.5E79261246J414642J758041J419793l94860j049804J726379P95441L2806J149826
$$ plain form
3443.8 548052902 548661957 549454727 549921608 548315849 548328781 549384537 549769135 550770760 551054878
3452.5 551054878 551523590 551998215 552551270 552961464 552892952 553274536 553336143 553806190 554097481 554351768
3462.1 554351768 554622116 555064507 556380157 557210197 557151642 556777229 557924347 558947487 558894310
3470.8 558894310 558941727 559074402 560155067 560719604 560760307 561235504 562424011 563695755 564326553
3479.5 564326553 564909706 564846725 564503822 564288521 565503197 566825829 567610741 568668671 567803459
3488.1 567803459 567606277 569046173 570193710 570938148 572100410 573526382 573573151 573627357 573515358
3496.8 573515358 573625832 574718018 575328445 576185226 577560310 577904549 577455673 578171082 579261246
3505.5 579261246 580675888 582433929 583853722 583458862 582409058 584135437 584930878 584963684 586113510
3514.2E86113510O99425Q72078J050911J085319K92778J13259J526642J868286j40572
3522.9E93481636r84344J237716J440468P63283M47769N05447J34926J039353J180801
3531.5E99247055M58412J355019Q08220J899643L73764j295243J754151J452904J140632
3540.2F07194557J174851J997451J078263M19082J060448q29124J31645o77109K253494
3548.9F13803558K800980J678238J494903k559623J221771J176262J373405K292328
3556.6F23281822k62947K054482J359214K05765O61621K692948J155395R30367N803604
3565.3F37882271j827698k854195j461715m08364N600319J796379J411934K227707
3573F42366638J315537L50189J309357J031189r34601K989654J559143O75431K284393
$$ plain form
3514.2 586113510 586812935 587685013 588735924 589821243 590114021 590227280 591753922 593622208 593481636
3522.9 593481636 592497292 593735008 595175476 595938759 596386528 596891975 597026901 598066254 599247055
3531.5 599247055 599705467 601060486 601868706 603768349 604142113 602846870 604601021 606053925 607194557
3540.2 607194557 608369408 610366859 611445122 611864204 612924652 612095528 612227173 611550064 613803558
3548.9 613803558 616604538 618282776 619777679 617218056 618439827 619616089 620989494 623281822
3556.6 623281822 623018875 625073357 626432571 626638336 627299957 629992905 631148300 632078667 637882271
3565.3 637882271 636054573 633200378 631738663 631330299 636930618 638726997 640138931 642366638
3573 642366638 643682175 644032364 645341721 646372910 645438309 648427963 649987106 650662537 652946930
3581.7F52946930K020264Q14819J003189O734619J810913m397278k255249k297515
3589.4F56380692N877227M457474L224869m51508Q0796M224090l312073L070221L556671
3598.1F77108459l95584L853531k11639M6768J849823Q48236K848129M591065K055740
3606.8F92594528k417602L705444k081223N56870R596176j884689l730011L917312
3614.5G00256805k060089O282196N393982j718979k90985l806228J781158M535599
3622.2G10373459L019867K493286L410187K799377K560043Q333512p018738j9086685
3629.9G06884308Q934936Q733063P762680k83890k863617L673096M154434K628250
3637.6G39623260p85980J061631K668533K447967M46549R7351L793793N529785O150284
$$ plain form
3581.7 652946930 654967194 655782013 656785202 663519821 665330734 660933456 658678207 656380692
3589.4 656380692 662257919 666715393 669940262 669488754 669569550 673793640 670481567 673551788 677108459
3598.1 677108459 676712875 680566406 680354767 680401535 682251358 683099594 685947723 690538788 692594528
3606.8 692594528 690176926 693882370 691801147 692358017 701954193 700069504 696339493 700256805
3614.5 700256805 698196716 704478912 709872894 708153915 707862930 704056702 705837860 710373459
3622.2 710373459 713393326 715886612 719296799 722096176 724656219 732989731 725970993 706884308
3629.9 706884308 715819244 724552307 732314987 732031097 729167480 732840576 736995010 739623260
3637.6 739623260 738837280 739898911 742567444 745015411 745461960 745559311 749353104 754882889 761033173
3646.3G61033173o177979m804230O182709n942306o140824K448960Q968963N410843
3654G60979309N470429L401794j4985962M766846P103271Q54950J043854J50299K271423
3662.7G71056213K98539J628799J830750P11212N867920J729126l477326m305343r401627
3671.4G65938263P577438J2835007J1304703j0117264k9638901J1252594J2566986
3678.1G81718826N211563n485611K5254L895187J777878Q99582l06549J082763N790253
3686.8G94609146O636200j4738464k097321Q295136j2909088K860183P226868n50766
3694.5G89331894J556854J71433r7199J998902J159973L168335J305160j0520553j069413
3703.2G87005386P436600J542053m99725O34384M692917L460922j0319900N916595
$$ plain form
3646.3 761033173 754855194 750050964 756233673 750291367 744150543 746599503 755568466 760979309
3654 760979309 766449738 769851532 754865570 759632416 766735687 767590637 768634491 768784790 771056213
3662.7 771056213 771354752 772983551 774814301 775525513 781393433 783122559 779645233 775339890 765938263
3671.4 765938263 773515701 786350708 797655411 787538147 757899246 769151840 781718826
3678.1 781718826 786930389 781444778 781470032 785365219 787143097 788042679 787736130 788818893 794609146
3686.8 794609146 801245346 786506882 784409561 792704697 779795609 782655792 789882660 789331894
3694.5 789331894 790888748 791060181 790962982 792961884 794121857 797290192 798595352 788074799 787005386
3703.2 787005386 794441986 795984039 795484314 796118698 800811615 804272537 793952637 799869232
3710.9G99869232k62375j6914978R568939N504838k2431J607132K975159k48337m798737
3719.6G97278442L329621P015609q531112m751892Q026809J04523j811142m300461
3727.3G96360397J240845N440064K023315O416855p369843o082458J2353592m681702
3735H05701065j2474747J849976K127914O07605M247513L609162m341126O317139J2327881
3743.7H19972382k8492814j0594787J8042984Q076630P137756q681564r488602J4133148
3751.4H10105133j4665985n810928R728546P542648K602158q596802N136642M834671
3759.1H10876083j4725647K01722O680221J945267K004166M407348o240082n565338
3766.8G99583740O139374O422424l685074j3018875M823761M518891K72979Q49915
$$ plain form
3710.9 799869232 799606857 782691879 792260818 797765656 797743225 799350357 802325516 802077179 797278442
3719.6 797278442 800608063 807623672 799092560 794340668 802367477 802472000 800660858 796360397
3727.3 796360397 797601242 803041306 805064621 811481476 804111633 798029175 810382767 805701065
3735 805701065 793226318 795076294 797204208 797811813 802059326 805668488 801327362 807644501 819972382
3743.7 819972382 791479568 780884781 798927765 807004395 814142151 805460587 795971985 810105133
3751.4 810105133 795439148 789628220 799356766 806899414 809501572 800904770 806041412 810876083
3759.1 810876083 796150436 796352158 803032379 804977646 806981812 811389160 805149078 799583740
3766.8 799583740 805723114 812145538 808460464 795441589 800265350 804784241 805057220 805907135
3774.5H05907135j31073J675262J238556K986756m464112j0854492N780411L748169
3782.3H05886612J913757J888581n382538r74808J487503Q18176P06253j51977N31387
3790.9H06722946m17480K93045L05481K758331L157272q584976m473343N463486P530365
3799.6H12755127P017746j5972519j4683990Q205490O776657P765884M100647j7934112
3807.3G98030930j956253P658538K241669N90897K94799N05524L761749O990891j0286179
3816H07832565j6398773J2605438Q980561O383667l383408k8030167P177887P640381
3823.7H02808151K884064L319855j979676o231384K411041M373627M761047j521530
3831.4H10825195j2624283P481156Q259354r682923L625260J0030288j7641830k565842
$$ plain form
3774.5 805907135 805776062 807451324 808689880 811676636 807212524 796358032 802138443 805886612
3782.3 805886612 807800369 809688950 804306412 803331604 804819107 805637283 806343536 806191559 806722946
3790.9 806722946 806305466 806598511 806903992 809662323 812819595 804234619 799761276 805224762 812755127
3799.6 812755127 819772873 803800354 789116364 797321854 804098511 811864395 815965042 798030930
3807.3 798030930 796074677 803733215 805974884 806565781 806860580 807366104 811127853 818118744 807832565
3816 807832565 791433792 804039230 813019791 819403458 816020050 787989883 795167770 802808151
3823.7 802808151 805692215 809012070 807032394 800801010 803212051 807585678 812346725 810825195
3831.4 810825195 798200912 805682068 813941422 804258499 807883759 817914047 800272217 797706375
3839.2G97706375J0758896r267654L098220Q538514p190018m162750N425491K168121
3846.9H07075195L71170K377015j580811M132233P980880r410629m522705k8743820
3854.6G77678528J2720947J6163178l466950j248093M068757L330078J511917p837143
3862.3H02921219K636948O564178j3775711l530121R319077Q797073N887222j8688965
3870H00130920r755706R506683J0126572Q61053j6024628M826127N620956P15713M350510
3878.7H10358200L928909j3255386o592102J0498276J631164M415055J993560k2533569
3886.4G90444107O720352P399750L050232N748596n663452j2553635M848481M621582
3894.1H04616013j870346L002548K258148K987442j983337j2332077J0297622J4038
$$ plain form
3839.2 797706375 808465271 799197617 802295837 810834351 803644333 799481583 804907074 807075195
3846.9 807075195 807446365 809823380 808242569 812374802 820355682 810945053 806422348 777678528
3854.6 777678528 790399475 806562653 803095703 801847610 805916367 809246445 810758362 802921219
3862.3 802921219 805558167 812122345 798346634 794816513 804135590 812932663 818819885 800130920
3870 800130920 790375214 799881897 810008469 810869522 794844894 799671021 805291977 806007690 810358200
3878.7 810358200 814287109 801031723 794439621 804937897 806569061 810984116 812977676 790444107
3886.4 790444107 797164459 804564209 807614441 813363037 807699585 795145950 799994431 804616013
3894.1 804616013 802745667 805748215 808006363 810993805 809010468 796678391 806976013 806990051
3901.8H06990051o509933O798096n712357k374725o26908K240525L937912p8965p171
3910.5H04656525n16281M31137l04718K44674K714081N18036p371750k242355P435150
3919.2H05564499j780930m466552M604950K552795N19333n309906l479004L970718
3926.9H02175903L000946J223755j611328L61481J211319n022354j470795K546692
3934.6H02415619J058044Q73108N40619o44073p66602l44009K864074Q57010o584625
3943.3H00269165J2970K394714K250595J129609m134598J079101m13894k509842K209472
3952H02287292j16500k41242O00510P91626j54495q27790P69196K25220J544189q21610
3961.6H04056396k576141J043854K69241n91659r0638J23749J59912k33459Q55179
$$ plain form
3901.8 806990051 800480118 807278214 801565857 799191132 798564224 800804749 804742661 804663696 804656525
3910.5 804656525 804140244 804571381 804266663 804511337 807225418 807743454 800371704 798129349 805564499
3919.2 805564499 803783569 799317017 803921967 806474762 806994095 801684189 798205185 802175903
3926.9 802175903 805176849 806400604 804789276 805150757 806362076 801339722 799868927 802415619
3934.6 802415619 803473663 804346771 804887390 804243317 803476715 803132706 805996780 806853790 800269165
3943.3 800269165 800282135 802676849 804927444 806057053 801922455 803001556 802587662 800077820 802287292
3952 802287292 802170792 801929550 802530060 803321686 803167191 802339401 803108597 803333817 804878006 804056396
3961.6 804056396 801480255 802524109 802793350 802201691 802111053 802234802 802394714 802161255 803016434
3970.3H03016434J778869k27661j714477l38898j51444l91922K5559M58298M7760j9989
3980H02482529P78961l78418p80335N98832M14657o75659K8152L02506j01624K88773
3989.6H02958374q15964q94241J98517J263656Q39463r37577q9264K50626J602q4076
3999.2H02691116m84466
4000.2H02206650
$$ plain form
3970.3 803016434 804795303 804567642 802853165 802514267 802362823 801970901 801996460 802454758 802502518 802482529
3980 802482529 803261490 802883072 802102737 802701569 803116226 802440567 802468719 802771225 802669601 802958374
3989.6 802958374 802142410 801248169 801446686 802710342 803549805 802612228 802522964 802773590 802775192 802691116
3999.2 802691116 802206650
4000.2 802206650
##END=$$ End of the data block
