##TITLE=$$ Begin of the data block
##JCAMP-DX=5.00 $$ ACD/SpecManager v 10.08
##SPECTROMETER/DATA SYSTEM=Varian
##DATE=18 Dec 2012 14:13:40
##DATA TYPE=INFRARED SPECTRUM
##DATA CLASS=XYDATA
##ORIGIN=
##OWNER=
##NPOINTS=3735
##FIRSTX=399.26403809
##LASTX=4000.35498047
##MAXX=4000.35498047
##MINX=399.26403809
##MAXY=81.68379211
##MINY=15.89889050
##XFACTOR=1.0000000000
##YFACTOR=0.000000100000000
##FIRSTY=70.29462433
##DELTAX=0.96440572
##XUNITS=1/CM
##YUNITS=TRANSMITTANCE
##XYDATA=(X++(Y..Y))
399.3G02946243J1697159K4948J784516K131500n601883Q994827O676483p505874j0800705
407.9G10347214l227463J024857l593750L399124J0334015N818786k917023l365249
415.7G17820511j584320m270096k5457687k2057114J7807770Q908081L789062O017151
423.4G00973358J1500473P567825j53045K789917m774780l020478l6239n998536l457641
432.1G05390854m606400l593750O91223N904694J0168305Q73794l717499q64486m26941
440.7G09819794p36313K222061J835480m852524l473358M150543j334457n416794k10495
449.4G02003937j28861N77469O45447q698Q73261j347427k750931k748108j750641
458.1F95365448J985703M738845L199768J855088m92401p183762l559418j378555m321060
$$ y = [702946243, 714643402, 714668350, 716452866, 718584366, 712982483, 721977310, 728653793, 721147919, 710347214, 707119751, 708144608, 704550858, 707949982, 718283997, 724102783, 721185760, 717820511, 716236191, 711966095, 686508408, 664451294, 682259064, 691167145, 694956207, 700973358, 712473831, 720041656, 719888611, 722678528, 717903748, 714883270, 714847031, 708848495, 705390854, 700784454, 697190704, 697881927, 703786621, 713954926, 714828720, 711111221, 710246735, 709819794, 709083481, 711305542, 713141022, 708288498, 704815140, 708965683, 707631226, 702214432, 702003937, 701875076, 702452545, 703097992, 703089294, 703962555, 702615128, 699864197, 697116089, 695365448, 697351151, 702089996, 705289764, 707144852, 706652451, 699468689, 695909271, 694530716, 690209656]
466.8F90209656m310074J22375N344468K980499J334076n08576J745911K412262k981415
475.5F96349182m968033K72751M396362r93881j246261M166488N555802K632522k642288
484.1G03522644K471924L401871o9886k351989o117707k725677J285553K883758J889649
492.8G04190140k208710j973495K864685O562881L942413j020660l623276l734131
500.5G04999847m751281o103821P65991K819901K116241K745361J981125k22244M19464
509.2G04770584J896591k237701n569916l658600l417358j237488J3275o97479K050171
517.9F91912079L540115K460785q70132o00434K50855l128128l685532k117309j267395
526.6F86494904r76639o78101K022476M065628L197251P3547p89032l06091n96085
$$ y = [690209656, 685899582, 686021957, 691366425, 694346924, 695681000, 695172424, 696918335, 699330597, 696349182, 691381149, 691653900, 696050262, 695056381, 693810120, 697976608, 703532410, 706164932, 703522644, 705994568, 709396439, 709326553, 706974564, 700856857, 698131180, 699416733, 702300491, 704190140, 701981430, 700007935, 702872620, 709435501, 713377914, 712357254, 708733978, 704999847, 700248566, 694144745, 694910736, 697730637, 699846878, 702592239, 704573364, 704351120, 704770584, 706667175, 704429474, 698859558, 695200958, 691783600, 690546112, 690559387, 689861908, 691912079, 695452194, 697912979, 697042847, 696442413, 696693268, 693565140, 689879608, 687762299, 686494904, 685518265, 684840164, 686862640, 690928268, 694125519, 694199066, 693410034, 693103943, 692507858]
535.2F92507858j098938k724914k443085j430969k5635J964035K827606M587403L100357
543.9F97263718R15527Q01086q13369k272721j212463j534805k765961r44138O89850
552.6F90126724L457413L793793L03344K51923J193085R59701j946945k665710p23725
561.3F94749603j870422j528015p42417J879197L897934K756195K522964J208954n22156
570G02351837k477875m237060k723541L69949J032562j501083o44150N97687J872558
578.6F94640884L029557J126709Q63571l1891j687393k693253l212280k224350q23898
587.3F88987656J509781J886825J330719Q15353O28739r9945r65729j34125j325302
596F92633972l541336m770355k454376q09555k394715j83258k23770j573791k950745
$$ y = [692507858, 691408920, 688684006, 686240921, 684809952, 684784317, 686748352, 689575958, 694163361, 697263718, 698179245, 698980331, 698166962, 695894241, 694681778, 693146973, 690381012, 689436874, 690126724, 693584137, 697377930, 697681274, 697933197, 699126282, 700085983, 698139038, 695473328, 694749603, 692879181, 691351166, 690608749, 692487946, 696385880, 699142075, 701665039, 702873993, 702351837, 699873962, 695636902, 692913361, 693283310, 694315872, 692814789, 692170639, 692768326, 694640884, 697670441, 698797150, 699660721, 699628830, 697941437, 695248184, 692035904, 689811554, 688987656, 690497437, 692384262, 693714981, 694530334, 695159073, 695059128, 694093399, 693959274, 692633972, 689092636, 684322281, 681867905, 681058350, 678663635, 678480377, 678256607, 676682816, 673732071]
604.7F73732071o662827r207153j1388245j2358665j4468994j6963082j9309463j7900429
612.4E65473213j5105400j1847954p346954l344536n08079j349221k751274p796516
620.1E15423279j2879029j7409629j8095589j2090797l198014R826546J7350578K4400254
627.8E03327599K5386390K2485657J6364937Q248825J324425p122994r402580j1101151
635.5E49511108r747161q429947p003289o22253N254936J4365845K0108337K4018250
643.3E87455826K2436523K0496178J7471428J2657471J0849685R369354Q276749O266937
651F95280151M746247L522491J868057N53437j074601j462631m97284K75040J352997
659.7G04563904J801910K726212K621078K012787K739487K435379J967926k253266
$$ y = [673732071, 667069244, 657862091, 646473846, 634115181, 619646187, 602683105, 583373642, 565473213, 550367813, 538519859, 531172905, 527828369, 527320290, 525971069, 523219795, 515423279, 502544250, 485134621, 467039032, 454948235, 451750221, 461576767, 478927345, 503327599, 528713989, 551199646, 567564583, 575813408, 577137833, 570014839, 560612259, 549511108, 539763947, 531334000, 524330711, 523708458, 528963394, 543329239, 563437576, 587455826, 609892349, 630388527, 647859955, 660517426, 671367111, 680736465, 689013214, 695280151, 700026398, 703548889, 705416946, 705970383, 704895782, 703433151, 702935867, 703210907, 704563904, 706365814, 709092026, 711713104, 713725891, 716465378, 718900757, 720868683, 718615417]
667.4G18615417j5525054M931640M100800O22940M78287K066803L311538L462143K501068
676.1G24565582K52533p50198j269837n77011p22427k311783j766281Q7509K009506
684.7G19517593J905594J519699J651841J056213q4152j684342j543274j871032l102646
693.4G17365494k725296j382675j39924J032029J886215K006378J638260J96457k07214
702.1G19669724j47248k079468k615585j461944k19956J452637K007446K200775L040314
710.8G21846695K675934K549591J830978q95233j132965r00116r47342r7961L43704
719.5G25273285J478805J928711K670136L045120J618500O65130m0740j147461k310868
728.1G33180618k223739k110291j847458o42090N25742J584702J503601P90557J412888
$$ y = [718615417, 703090363, 708022003, 712122803, 712745743, 713224030, 715290833, 718602371, 722064514, 724565582, 724818115, 724067917, 722798080, 722221069, 721498642, 719186859, 717420578, 717508087, 719517593, 721423187, 722942886, 724594727, 725650940, 725566788, 723882446, 722339172, 720468140, 717365494, 714640198, 713257523, 713117599, 714149628, 716035843, 718042221, 719680481, 719876938, 719669724, 719522476, 717443008, 714827423, 713365479, 713145523, 714598160, 716605606, 718806381, 721846695, 724522629, 727072220, 728903198, 728007965, 726875000, 725974884, 725027542, 724929581, 725273285, 726752090, 728680801, 731350937, 734396057, 736014557, 736679687, 736638947, 735491486, 733180618, 730956879, 728846588, 726999130, 726357040, 726882782, 728467484, 729971085, 730761642, 732174530]
736.8G32174530J744766o31866k465821k388153k101669p93075M24270P96433J852340
745.5G28611755K659378J891633K363815L268966J903611M00161o43158l94821l22113
754.2G39739227K48490J421661J973953L598099J988907K93198J800766K055435L85437
762.8G53505173j779099j301803j93711n35354q51975J37329J171265P46689J030426
771.5G51928940J651230P68356m94995j70212j08414l48281l24631L2959J113586J130371
781.2G55178909K473679L121185K465439K108002P22580J53427q69980j015472j046372
789.9G63291397m55627J72271l04794J578674K346192K076034R47266m62418l41720
798.5G68847275m73480j060181j618652k64054p4463L54157J625824J393509J207809
$$ y = [732174530, 733919296, 733287430, 730821609, 728433456, 726331787, 725538712, 725962982, 726759415, 728611755, 731271133, 733162766, 735526581, 738795547, 740699158, 741099319, 740456161, 740061340, 739739227, 739987717, 741409378, 743383331, 746981430, 748970337, 749263535, 751064301, 753119736, 753505173, 751726074, 750424271, 750230560, 749695206, 748843231, 748980560, 750151825, 750898514, 751928940, 753580170, 754348526, 753853531, 753683319, 753574905, 753226624, 752901993, 752934952, 754048538, 755178909, 757652588, 760773773, 763239212, 765347214, 766069794, 766223221, 765353241, 764337769, 763291397, 762835770, 763008041, 762703247, 764281921, 766628113, 768704147, 769651413, 769188995, 768847275, 768373795, 767313614, 765694962, 765430908, 765356445, 765710602, 767336426, 768729935, 769937744]
807.2G69937744Q61588J332626J2360r73969r55429j729126p46002M75082L51105R2850
816.9G68658829K259750K464981Q77381M95452k52075K89231j176224k582245j247711
825.5G69787369J31912J90353L13569J002807j104050j858291l18756j86081j254196
834.2G66704636k293320k543717l153228k789078j574173q61893l51028m82712r65805
842.9G51689682n05600K67639p57828j119766j40762q55484j338577N6228J649246
851.6G48944778K384110K346115K787781K750320J690979R16443J43585P53174N51758
860.3G63269043l57513J501236J268310J314163K157669J303864J592865Q81958J66092
868.9G73097687j005097j243057j63422M74778J484222J115646N70374l23715J012954
$$ y = [769937744, 770799332, 772131958, 772144318, 771170349, 770214920, 768485794, 767739792, 768214874, 768565979, 768658829, 770918579, 773383560, 774260941, 774756393, 774504318, 774793549, 773617325, 771035080, 769787369, 769919281, 770109634, 770423203, 771426010, 770321960, 768463669, 768144913, 767958832, 766704636, 764411316, 761867599, 758714371, 755925293, 754351120, 753489227, 753138199, 752655487, 751689682, 751184082, 751451721, 750693893, 749574127, 749433365, 748577881, 747239304, 747295532, 748944778, 751328888, 753675003, 756462784, 759213104, 760904083, 761820526, 761964111, 762717285, 763269043, 762911530, 764412766, 765681076, 766995239, 769152908, 770456772, 772049637, 772931595, 773097687, 772092590, 770849533, 770686111, 771160889, 772645111, 773760757, 774331131, 774007416, 775020370]
877.6G75020370J664963j118469j174469j494369k050019j156311j874847j753235
885.3G66063614k7161o82373j177597O45218R92050J74942o2713J25274o54220q89130
895G64507904m52805n49240K75422r8343J95083J439896J380310L98102q53272r01642
904.6G65341415j926193k406692j912918j760331j417007j180954p10144p78046m41513
913.3G52807617o99310j413803j631775k160950j918564k129287k145844j700516j397705
922G37609863j63879M9057p18918j009293j050262p23267r48104j536255j263199j32065
931.6G30113678N93796L87192Q99581J599045K008362J941299J156388J639099K276459
940.3G42614899J704254R01108M14199J239090J803971K028579K184601J443177J876754
$$ y = [775020370, 776685333, 775566864, 774392395, 772898026, 770848007, 769691696, 767816849, 766063614, 766036453, 765354080, 764176483, 764821701, 765813751, 765988693, 765925980, 766051254, 765397034, 764507904, 764055099, 763505859, 763781281, 763682938, 763878021, 765317917, 766698227, 767096329, 766243057, 765341415, 763415222, 761008530, 759095612, 757335281, 755918274, 754737320, 754027176, 753249130, 752807617, 752108307, 750694504, 749062729, 746901779, 744983215, 742853928, 740708084, 739007568, 737609863, 737445984, 737495041, 736776123, 735766830, 734716568, 733993301, 733045197, 731508942, 730245743, 730113678, 730707474, 731094666, 731994247, 733593292, 735601654, 737542953, 738699341, 740338440, 742614899, 744319153, 745220261, 745634460, 746873550, 748677521, 750706100, 752890701, 754333878, 756210632]
949G56210632K264634J254653n05218j683045j523437j140747p76978n57251j41449
957.7G53401794l53088n32074m70505j254501k009506k014771k046051k932892k920761
966.3G38867645k302856j285019n77011p20902l3416j50986p26319o67190j494980
975G30908966k048340j660003j947403k117386j319428r31854q32672n73959q37555
983.7G18640366j331177j376496k886657m177704l786240m552383n669480p036972
991.4F87823257p927322j0796661j7607880k4249611k0530777J728249K2202644K3836556
999.1F54478455J3995361N652542J929703P52640O33773N10559P5608K78549J253662
1007.8F79560852J030579J88980n85251j414719j492920k078781k600937k489090j762695
$$ y = [756210632, 758475266, 759729919, 759224701, 757541656, 756018219, 754877472, 754100494, 753543243, 753401794, 753048706, 752516632, 752046127, 750791626, 748782120, 746767349, 744721298, 741788406, 738867645, 736564789, 735279770, 734702759, 733981857, 733948441, 733797455, 733071136, 732403946, 730908966, 728860626, 727200623, 725253220, 723135834, 721816406, 720884552, 720051880, 719477921, 718640366, 717309189, 715932693, 713046036, 708868332, 705082092, 700529709, 694860229, 687823257, 679895935, 669099274, 651491394, 627241783, 606711006, 608439255, 630641899, 654478455, 668473816, 674126358, 676056061, 676808701, 677442474, 677953033, 678028641, 678307190, 679560852, 680591431, 680780411, 680195160, 678780441, 677287521, 675208740, 672607803, 670118713, 668356018]
1016.5F68356018j133041q73490o73675q41980o18744j404801j388015k475891l608857
1025.2F55337524k228164k682572j974182j571045j621399q00323j142044p10144m39224
1033.8F42168427j230164k600708k100411j933708k168655j634712j520920J89857
1041.6F29169006L77350k57149K02599J145020M78096n90630m62914k84271Q09059
1050.2F30586166K45285L75367N49926N32113J290550J064262J574860R46617K70424
1058.9F37435570j318550k049866j451378j856461j659431j773605J54152k71187o68106
1067.6F26541138P99102o78024k257423l599549k792244k428436k375870k843666l527145
1076.3F06837883k061501j884155j062279k015953k056388j615067k849159l215599
$$ y = [668356018, 667222977, 666349487, 665675812, 664833832, 664215088, 662810287, 661422272, 658946381, 655337524, 653109360, 650426788, 648452606, 646881561, 645260162, 644459839, 643317795, 642607651, 642168427, 640938263, 638337555, 636237144, 634303436, 632134781, 630500069, 628979149, 629169006, 629546356, 629289207, 629491806, 630636826, 631114922, 630524292, 630061378, 629777107, 630586166, 630831451, 631206818, 631756744, 632288857, 633579407, 634643669, 636218529, 637165146, 637435570, 636117020, 634067154, 632615776, 630759315, 629099884, 627326279, 627480431, 627209244, 626541138, 627340240, 626662216, 624404793, 620805244, 618013000, 615584564, 613208694, 610365028, 606837883, 604776382, 602892227, 601829948, 599813995, 597757607, 596142540, 593293381, 590077782]
1084E90077782m070511m887123o302529n073509n000687n984649p209892q686600q752709
1092.7E34109573j1638374j1884994j4127198j5257911j5216065j6538429j5180931
1099.4D34265671j5694313j4013329j5248489j3073311j3861466j4620552j2797393
1106.2C34956818j5185204j1952076j4124451j1582908j1040421r967613p649689r054069
1113.9B44400387m273491n985222k318420k394410m70581Q17566r07955K767391M8752
1122.6B31684017L539925J731872K606793K565746J363011L581466k0847K123375j873779
1131.2B47301579j437340l243275n320492l453178o208534l440876n691224k479286
1139B16027374l430938l449707k064457m539624k726841o948604l139878m724407m845257
$$ y = [590077782, 586007271, 581120148, 574817619, 569744110, 564743423, 558758774, 551548882, 542862282, 534109573, 522471199, 510586205, 496459007, 481201096, 465985031, 449446602, 434265671, 418571358, 404558029, 389309540, 376236229, 362374763, 347754211, 334956818, 319771614, 307819538, 293695087, 282112179, 271071758, 261104145, 253454456, 244400387, 240126896, 234141674, 231823254, 229428844, 228958263, 229775829, 228867874, 231635265, 231684017, 235223942, 236955814, 239562607, 242128353, 243491364, 247072830, 247051983, 249175358, 247301579, 245864239, 242620964, 237300472, 233847294, 227638760, 224197884, 218506660, 216027374, 212596436, 209146729, 207082272, 202542648, 199815807, 192867203, 189727325, 185002918, 180157661]
1147.6A80157661m102172n692158k807999m894886j89552k332955k43625r0866q14543
1156.3A58988905J987505p54738L710537J100101K786751J830101K885895N496368
1164A78031425L472310P329826M274635Q136559P362327Q154526R694748Q319492J1643124
1172.7B46418972Q741035J1812649J0504647J2054252J2504311J1026993J2561416
1179.5C25624275R823914J2706260J1005517J1730155J1168938R841042J0083999Q408013
1187.2D10392113J0256538P889404R168702P846412O971283P991867P066384Q366890
1194.9D75949593O721344Q440780P766533P522659Q071709Q084908R152641P594337
1202.6E39304504Q601761P462731P069931O459465N711555N981713M967422N754051
$$ y = [180157661, 176055489, 170363331, 167555332, 162660446, 162470894, 160137939, 159894314, 159803448, 158988905, 160976410, 160221672, 163932209, 165032310, 167819061, 169649162, 172535057, 178031425, 181503735, 188833561, 193108196, 201244755, 208607082, 216761608, 226456356, 234775848, 246418972, 255160007, 266972656, 277477303, 289531555, 302035866, 313062859, 325624275, 335448189, 348154449, 359159966, 370890121, 382059059, 391900101, 401984100, 410392113, 420648651, 428538055, 437706757, 445553169, 452524452, 460516319, 467582703, 475949593, 482670937, 491111717, 498878250, 506400909, 514472618, 522557526, 531710167, 539304504, 547906265, 555368996, 562438927, 568898392, 574609947, 580591660, 585559082, 591313133]
1210.3E91313133M858856N056496N165138N655671N523071M139938M315033L142510
1218F29169846L177948K372245K278405K380066J343765J446686J006240K278214K017593
1226.7F47471008J824951K080002J328049J666107R56040P14569O40564Q74862P29905
1235.4F58286057R61685J670456J254120J520843J199570J504364J371155N50003J99737
1244.1F68517990J93787K36435m74396M98733P29752P80792J190796R99069J237564
1252.8F73910522J006318R51843k76871k13470K86636k29M10919M1428R35669J414719
1262.4F78467484J423873J226502R79614J008988O64291Q22601K49176N89447R24759
1271.1F86356735O77872J151428J763611K064285J418457J565399J711045J659241
$$ y = [591313133, 596171989, 601228485, 606393623, 612049294, 617572365, 621712303, 626027336, 629169846, 632347794, 634720039, 636998444, 639378510, 640722275, 642168961, 643175201, 645453415, 647471008, 649295959, 651375961, 652704010, 654370117, 655326157, 656040726, 656681290, 657556152, 658286057, 659247742, 660918198, 662172318, 663693161, 664892731, 666397095, 667768250, 668318253, 668517990, 668711777, 668948212, 668473816, 668972549, 669702301, 670483093, 671673889, 672672958, 673910522, 674916840, 675868683, 675591812, 675378342, 675664978, 675664749, 676075668, 676117096, 677052765, 678467484, 679891357, 681117859, 682097473, 683106461, 683770752, 684593353, 684842529, 685431976, 686356735, 687034607, 688186035, 689949646, 692013931, 693432388, 694997787, 696708832, 698368073]
1278.8F98368073J081237P08313J395111J116410P64618Q52432J565857J846695J650314
1287.5G09349060J632309J366425J397476J073227Q52966N91888N72968P91473O19889
1296.2G18247681J074676J450653J621475J160965M13361O93436J029205P18231J37253
1304.8G26546936J51596K05460p4692N22232R42688R14001Q69599q2703j01776J104584
1314.5G30997925O92520j9989K44827Q07038L92379q93402J58005J387787J170807
1323.2G34937897J239547P06482J15204L35694M81414p7056l13721L91769K78473J17722
1332.8G38213425Q1405N5466Q1482P6981J94244r28269q01925M39529P41425L75747
1342.4G38529510r1247L33252j37634K08740L93448m04969j28707k06681j22757n01403
$$ y = [698368073, 699449310, 700157623, 701552734, 702669144, 703433762, 704286194, 705852051, 707698746, 709349060, 710981369, 712347794, 713745270, 714818497, 715671463, 716263351, 716836319, 717627792, 718247681, 719322357, 720773010, 722394485, 723555450, 723968811, 724662247, 725691452, 726409683, 726546936, 726698532, 726903992, 726829300, 727351532, 728294220, 729208221, 730077820, 729995117, 729893341, 730997925, 731690445, 731670456, 731915283, 732722321, 733114700, 732221298, 732379303, 733767090, 734937897, 736177444, 736883926, 736999130, 737334824, 737816238, 737739182, 737425461, 737817230, 738095703, 738213425, 738294830, 738350296, 738431778, 738508759, 738703003, 737774734, 736972809, 737412338, 738153763, 738529510, 738438263, 738771515, 738633881, 738842621, 739236069, 738831100, 738702393, 738495712, 738372955, 737871552]
1352.1G37871552m27247k06451n89905j43585K84805L74375m578J69449m42200q63800
1361.7G36022415o97098j117859P53785m0970p71179j36414m69971j72882j86004m95224
1371.4G32688599l43552n84641j715316r62067M03671k64740j130676o30722k10419
1380.1G27250137n07736n21927j242676j036758L81775J127548L40119l85819J238937
1388.7G26643600R67713M94156K52685K26746O63528j437454j818313M54406K52915
1397.4G26699982j91651k141266n63049O46134l21045l94593o25076j744003M05578
1406.1G21771011J131974N874o180k89230o86493o60782m45327J52206O3400J74484
1415.7G21210937r0713L28369Q04291k756729L54767J491623K88314n80139j031952
$$ y = [737871552, 737444305, 737237854, 736647949, 736504364, 736789169, 737163544, 737158966, 737328415, 736886215, 736022415, 735325317, 734207458, 734961243, 734920273, 734149094, 734012680, 733542709, 733369827, 733183823, 732688599, 732345047, 731760406, 730045090, 729083023, 729486694, 729221954, 728091278, 727460556, 727250137, 726742401, 726220474, 724977798, 723941040, 724322815, 725450363, 725790482, 725404663, 726643600, 727611313, 728105469, 728358154, 728584900, 729248428, 727810974, 725992661, 726447067, 726699982, 726508331, 724367065, 723804016, 724450150, 724129105, 723734512, 723109436, 721365433, 721771011, 722902985, 722908859, 722902679, 722613449, 721926956, 721266174, 720820847, 720973053, 721036453, 721210937, 721120224, 721448593, 722252884, 719496155, 719850922, 721342545, 721630859, 721050720, 720018768]
1424.4G20018768J499405J606369M66080J109467O63986l16620J414795J177292k15149
1433.1G27424393K14767Q90427K0218k882309J056976K760468J704406J122742O18286
1441.8G32930374m0817P59506M75617j48774L7461n65949j261139R95789J517715P9727
1451.4G34779510O36902J457138O71692n569j026535l965607o53534L349076J746902
1460.1G36989975J308060P19833J316757J869736j254883R72672K448272J381607N26734
1468.8G46278763M1809O64902r50013j812057J852646K978973K148133L89099K488479
1477.5G54080734K363892J127090P67212o07071m21447J14822o8436K71759K86026
1486.1G57914581m31900K93503J236191j652298N86853K067261N57327l88718n55420
$$ y = [720018768, 721518173, 723124542, 723590622, 724700089, 725364075, 725047455, 726462250, 727639542, 727424393, 727639160, 728529587, 728549805, 725667496, 726724472, 729484940, 731189346, 732312088, 732930374, 732889557, 733649063, 734124680, 733975906, 734013367, 733447418, 732186279, 733182068, 734699783, 734779510, 735416412, 736873550, 737545242, 737539673, 736513138, 732547531, 731893997, 735243073, 736989975, 738298035, 739017868, 740334625, 742204361, 740949478, 741922150, 744370422, 745752029, 746278763, 746320572, 746985474, 746035461, 744223404, 746076050, 749055023, 751203156, 751592255, 754080734, 756444626, 757571716, 758338928, 757731857, 757310410, 757425232, 757356796, 757628555, 757914581, 757482681, 757776184, 759012375, 757360077, 757946930, 760014191, 760571518, 760182800, 759627380]
1494.8G59627380q61053m613495P40585m77295n24139K354660M88739k3651L08304
1503.5G57020035N10559p63321j1380539q984909M854584L336792Q86993J747208q86765
1512.2G46340637m25262J678390Q4381q35571m491806j826248K214661O02798m534760
1520.8G38807220n605697L140640K907105J656417r61685Q06656L40424j768494k32239
1529.5G39090347k61001j190033j451264l128967l968430K281342J574402Q65784J141967
1538.2G34954147n731735l394012K707519k20184j521607O71387j540451j790085K442475
1546.9G26577454J469802J373978p96127L9520K767639J047974N96695l640366m73861
1555.6G28962708K056808J58768m727555p350006P999649L508759L283768K130737
$$ y = [759627380, 758766327, 754152832, 754893417, 754416122, 753891983, 756246643, 756735382, 756711731, 757020035, 757530594, 756767273, 745386734, 736401825, 741256409, 744593201, 745480194, 747227402, 746340637, 745915375, 747593765, 747678146, 746842575, 742350769, 740524521, 742739182, 743341980, 738807220, 733201523, 736342163, 739249268, 740905685, 739944000, 740750656, 741091080, 739322586, 739090347, 738829346, 737639313, 736188049, 733059082, 729090652, 731371994, 732946396, 733812180, 734954147, 729222412, 725828400, 728535919, 728315735, 726794128, 727465515, 725925064, 724134979, 726577454, 728047256, 729421234, 728625107, 728664627, 731432266, 732480240, 733076935, 729436569, 728962708, 731019516, 731178284, 726450729, 719100723, 727100372, 730609131, 733892899, 736023636]
1563.3G36023636N39551p86972l20969L00674k90832o42319n650482J437683J966171
1572G32576141L20969P48596M15650q52585n535965K420807Q82415j298294j456375
1580.6G28221359j988678r14459j203690k38952n95932l46756j9913j278915q06809
1589.3G20827255j975174j845627k673034j906357k078629k813415r70459j235428
1597G05329132R2087r79080p45392j270371k237243k001648l327637j608734k103500
1605.7F91147614j968079k615128j060485o75889j394577O11802j326752j037140k421799
1614.4F79259567j591034k418670r166565J990967k50016l55530j482849J45493q02536
1623.1F65328827l815765Q01620o71234j40000l157730j985550j363754j751404m56237
$$ y = [736023636, 736563187, 735776215, 735455246, 735755920, 735465088, 734822769, 729172287, 730609970, 732576141, 732897110, 733645706, 734061356, 733208771, 727672806, 730093613, 730976028, 729677734, 728221359, 726232681, 725318222, 724114532, 723875580, 723279648, 722932892, 722912979, 721634064, 720827255, 718852081, 717006454, 714333420, 712427063, 710348434, 707535019, 706564560, 705329132, 705421219, 704442139, 703696747, 702426376, 700189133, 698187485, 694859848, 693251114, 691147614, 689179535, 686564407, 685503922, 684828033, 683433456, 684045258, 682718506, 681681366, 679259567, 677668533, 675249863, 666083298, 668074265, 667824249, 667468719, 665985870, 666131363, 665328827, 661513062, 662314682, 661643448, 661503448, 658345718, 656360168, 654996414, 653245010, 652788773]
1631.7F52788773j308670R27810p62558m048538o3858J919174J027374k38800j22833
1640.4F50117874j662674l1433n81436J231232P97500k057190J246262n93948M544296
1649.1F53010483J453399J091385M10309q189239q08869L383866M708862J957931K370377
1657.8F59388504K017670K077942J976394J022873N57480j01929K511902Q29697R07287
1666.5F71187820J464158Q91494O18744J928864L929977J681519L157119K918549k29111
1675.1F87549133n02853K700195K464142J042938J702195O07604L278504M163971k49558
1683.8G02756271j552887M481583N555344K163238J26038J275024J190415K549438
1691.5G18544464K429199K520523K483750K482223k43454L768082M649734M014359
$$ y = [652788773, 651480103, 652407913, 651645355, 647596817, 647532959, 649452133, 650479507, 650240707, 650117874, 648455200, 648423767, 647842331, 649073563, 649871063, 647813873, 649060135, 648466187, 653010483, 654463882, 655555267, 655965576, 647776337, 646967468, 650351334, 655060196, 657018127, 659388504, 661406174, 663484116, 665460510, 666483383, 667040863, 666938934, 669450836, 670280533, 671187820, 672651978, 673543472, 674162216, 676091080, 680021057, 681702576, 684859695, 687778244, 687549133, 687046280, 689746475, 692210617, 693253555, 694955750, 695563354, 698841858, 703005829, 702756271, 701203384, 705684967, 711240311, 713403549, 713529587, 714804611, 715995026, 718544464, 720973663, 723494186, 725977936, 728460159, 728216705, 731984787, 736634521, 740648880]
1699.3G40648880J790543n119400M818878L544540J654358M52957J934357K684555
1707G52409668K933960L322830J168823N27115J611023J137772P47223j452790n97457
1715.6G61808167K775039K045288l178482K614823K662735J433715J337052j54190
1723.4G71344147r91440q9340o6071J35498N90821R78546q45642M26101K858353K089157
1733G76430130k816849l066330M674301K502518J8463O51779j641540j059952L449326
1741.7G79141846J944656o06766J306000K401199J213150Q97294K78472l28826J668472
1750.4G87915497r85489N1727L161850K058106J800460J625443r6283J003037J740875
1759G98275223J041870N55038k935638r46884J915207J179809R49784Q56323r9259
$$ y = [740648880, 742439423, 737320023, 742138901, 745683441, 747337799, 747790756, 749725113, 752409668, 755343628, 758666458, 759835281, 760362396, 761973419, 763111191, 763858414, 762405624, 761808167, 764583206, 766628494, 763450012, 766064835, 768727570, 770161285, 771498337, 771344147, 770352707, 770263367, 770197296, 770332794, 770923615, 771902161, 771056519, 771482620, 774340973, 776430130, 773613281, 770546951, 775221252, 777723770, 777742233, 778394012, 776752472, 775692520, 779141846, 781086502, 780479736, 781785736, 784186935, 785400085, 786297379, 786575851, 786247025, 787915497, 786930008, 786981735, 790143585, 792201691, 794002151, 795627594, 795531311, 796534348, 798275223, 799317093, 799872131, 796936493, 795989609, 797904816, 799084625, 800034409, 800890732, 800791473]
1767.7H00791473q10928K476425K140198j402664l323441q52203K854156P39823q28018
1776.4H01784821J360473P68051J127091L63083m13132R88693R01642N02548j239471
1785.1H06143799r73587P11441M03900Q0261N09262k2201k34680j048966J112061K677841
1794.7H09359131N0659j018295O49948M19083j260071j041718J223068j89743R65424
1803.4H09157486J738815K62146K02332n19486n61676M58298j01852j264725J30691
1812.1H09502029N10407J20392P45315O88324N87998n1270L57971K67563p76672k15302
1821.7H11736755n41305K94266K72445j414718R32617J450958R16290p41577k256698
1830.4H10649033J676788J288834o57044l49808r7808l1052j49536P8201J097336P55386
$$ y = [800791473, 799980545, 802456970, 804597168, 803194504, 799871063, 799018860, 801873016, 802612839, 801784821, 803145294, 803913345, 805040436, 805403519, 804990387, 805979080, 806880722, 807383270, 806143799, 805170212, 805881653, 806285553, 806365814, 806875076, 806852875, 806618195, 805569229, 806681290, 809359131, 809409790, 808391495, 809041443, 809460526, 808200455, 807158737, 808381805, 808192062, 809157486, 810896301, 811158447, 811360779, 810841293, 810279617, 810737915, 810636063, 809371338, 809502029, 810012436, 810132828, 810878143, 811566467, 812154465, 812103195, 812461166, 812728729, 811952057, 811736755, 811195450, 811489716, 811762161, 810347443, 811280060, 812731018, 813647308, 812905731, 810649033, 812325821, 813614655, 812957611, 812607803, 812509995, 812478943, 812329407, 812407608, 813504944, 814260330]
1840.1H14260330P31430J69602K67029p20444m121323J317063J345367m16870j48010
1848.7H12684174Q57162M26865k3728J223755N68085o9199j85165k98081k02179r01489
1858.4H14080200j41449l2196l18680K42081P86591O57043M81339P36999j16882o05164
1868H15769882j791458j052017P26471K79465R3688P0344N87005P40738O70700L83835
1877.7H16478653m4022K365p9422l35083r49249n94101m14200K3423O23245O20499
1887.3H15332108J005020l36075q60291Q29773N11933k51007m55323r84344p96127
1896H13995667M94155N45502N64575M75693M61884L00445l40881k7771m26865l46145
1905.6H15696259k56424q74176n31159k72140J44958P37839R04693L84827L75366J15586
$$ y = [814260330, 814991760, 815161362, 815428391, 814707947, 810586624, 811903687, 813249054, 812832184, 812684174, 813541336, 813968201, 813944473, 815168228, 815736313, 815667114, 815481949, 815183868, 814981689, 814080200, 813938751, 813906555, 813587875, 813829956, 814616547, 815273590, 815754929, 816491928, 816375046, 815769882, 813978424, 812926407, 813652878, 813932343, 814026031, 814096375, 814683380, 815424118, 816094818, 816478653, 816434631, 816436996, 816357574, 816022491, 815073242, 814479141, 814064941, 814088364, 814711609, 815332108, 816337128, 816001053, 815140762, 815970535, 816482468, 816231461, 815776138, 814791794, 813995667, 814489822, 815035324, 815599899, 816075592, 816537476, 816837921, 816497040, 816469269, 816042404, 815696259, 815439835, 814565659, 814034500, 813762360, 813907318, 814645157, 815549850, 815934677, 816310043, 816425629]
1915.3H16425629k57111k00424k024689l69110P04651P2632K24991n88532N41992J328125
1924.9H15858154K50473m35257J4267K80686l59345p87048o96869k54517Q2169L36914
1934.6H14289627L49426M92936L81774j29089j72653j09482Q8120j270829j699447
1943.2H12220383N99975N49469Q240L93829O60782J29090L03802M13132j14365l98483
1952.9H14765854p89948m42199l35465k49634K62757L20434K92054L01284N65415J96228
1962.5H14886780l01209m35943k68555k97546j046982n06058K43607L52630L89481
1971.2H13016205M18548N36042K93884r9640l05939l23639m72107n11779p28760n21393
1980.8H11301422J99432K06681L41797L73306K95715M5548n78308m88205j31989J11389
$$ y = [816425629, 816168518, 815968094, 813943405, 813574295, 814278946, 814351578, 814576569, 813988037, 814530029, 815858154, 816108627, 815673370, 815687637, 815968323, 815608978, 814821930, 814125061, 813870544, 813952713, 814289627, 814639053, 815131989, 815513763, 815384674, 815212021, 815102539, 815190659, 813919830, 812220383, 812820358, 813369827, 813378067, 813771896, 814432678, 814561768, 814865570, 815278702, 815164337, 814765854, 813975906, 813533707, 813198242, 812948608, 813211365, 813531799, 813823853, 814125137, 814690552, 814886780, 814585571, 814149628, 813881073, 813583527, 812536545, 812030487, 812274094, 812626724, 813016205, 813434753, 813970795, 814264679, 814165039, 813859100, 813535461, 813063354, 812551575, 811822815, 811301422, 811500854, 811707535, 812049332, 812422638, 812718353, 812763901, 812185593, 811697388, 811565399, 811676788]
1990.5H11676788l64914j127014m6997O58112P31735P90710M4938r6665L86353p9346
2000.1H12573700l30734m99115p39518m20684k09351r7961L44772M81491J08032K36893
2009.8H11447525K83279j81579n57785l43552M8523l75213q70057o65893L85437P19681
2019.4H09890366M59900M68215J09330L85360J03684p83005q60596n16510l13644n93948
2029.1H08349152o0044K50550L73001Q61664M44793J18256m1733j82190m26559o46897
2038.7H09039993m33426o02569r27658j01166P23953M18625K95715L55225L18832M8676
2048.4H09136200j93100k87704q09784m20914m66766o82984J16577M34876K83737J06277
2058H07216415O27823M05731l61251n15519p76672o58188q44879l35236K66877k26288
$$ y = [811676788, 811311874, 810184860, 810137863, 810795975, 811527710, 812318420, 812363358, 812266693, 812653046, 812573700, 812242966, 811743851, 811004333, 810583649, 810374298, 810276337, 810621109, 811102600, 811210632, 811447525, 811730804, 811549225, 810991440, 810647888, 810696411, 810321198, 809451141, 808785248, 809170685, 809890366, 810350266, 810818481, 810927811, 811313171, 811416855, 810633850, 809773254, 809256744, 808943100, 808349152, 808289108, 808539658, 808912659, 809774323, 810219116, 810337372, 810295639, 810113449, 809686890, 809039993, 808606567, 808003998, 807076340, 806975174, 807699127, 808117752, 808413467, 808768692, 809087524, 809136200, 808943100, 808655396, 807845612, 807424698, 806957932, 806274948, 806391525, 806826401, 807110138, 807216415, 807844238, 808249969, 807888718, 807373199, 806596527, 805938339, 805093460, 804758224, 805025101, 804798813]
2067.6H04798813j10626l4867j08795K11563n188o31637q57468q55331q83561q69751
2077.3H00653152n24978j44653o485L22494K59323Q2550L56369L49961k07444p57293
2086.9H00382996o01426j51825j24130l47824j13220J95465N38254O37817M14734N66559
2096.6H01397400j39771k72903L06473k50550n16204k55433J57929K69089P46460R71145
2106.2H02413635L25547N58166M42429q3771l06091k97852k72369n20020k66952P9269
2115.9H02071991L69720N57328N39932J58691j37558n9967j69830k95105r40323j050873
2125.5H01044006m42276o7672R9029J61514M05045K16370J16806J60980J76391j59759
2135.1H01710434p64084k57110j36948k94953K41395K78701N7297N34515R13315N47180
$$ y = [804798813, 804688187, 804653320, 804544525, 804756088, 804750900, 804119263, 803261795, 802406464, 801522903, 800653152, 800128174, 799983521, 799977036, 800299530, 800558853, 800641403, 800997772, 801347733, 801140289, 800382996, 799781570, 799629745, 799505615, 799157791, 799044571, 799240036, 799778290, 800416107, 800830841, 801397400, 801257629, 800984726, 801291199, 801040649, 800524445, 800269012, 800426941, 800696030, 801442490, 802413635, 802739182, 803297348, 803739777, 803656006, 803349915, 803052063, 802779694, 802259674, 801992722, 802071991, 802441711, 802999039, 803538971, 803697662, 803560104, 803500137, 803330307, 803035202, 802094879, 801044006, 800601730, 800534058, 800633087, 800794601, 801199646, 801416016, 801532822, 801693802, 801870193, 801710434, 800946350, 800689240, 800552292, 800257339, 800498734, 800777435, 800834732, 801369247, 802282562, 802829742]
2144.8H02829742L90168j0529l15018m38842o15616k03476q545L21274L82919M59824
2154.4H02791901J077270L54691m68293j76010j75628l71628m35944m66232j82648
2163.1H01947479j1978L94745N81131K51923K97927m3258j55258j06583n81513p11288
2172.8H01863327o71310o83747o76269k7314O22407N12390K47573K20414K28805j84784
2182.4H01451492k10952k60315m07029k72750l38517Q2245L87497L79639N55191O06766
2192H01973267O60934M60739J5030j52j19248o22330k57263J28098L11508P64618N80368
2202.6H03895569L60336L04642M5242k05154M8828p553l98865j25122k54135j08414
2212.3H03555374K91901K55737O49262O61621j3962k23541K09198J9836o15692p39594
$$ y = [802829742, 803219910, 803209381, 802894363, 802455521, 801839905, 801636429, 801627884, 801949158, 802332077, 802791901, 803869171, 804223862, 803755569, 803579559, 803403931, 803032303, 802596359, 802130127, 801947479, 801935501, 802330246, 802911377, 803163300, 803461227, 803417969, 803262711, 803156128, 802574615, 801863327, 801192017, 800508270, 799832001, 799804687, 800427094, 800939484, 801187057, 801407471, 801636276, 801451492, 801240540, 800980225, 800573196, 800300446, 799961929, 800044174, 800431671, 800811310, 801366501, 801973267, 802634201, 803094940, 803109970, 803109818, 802990570, 802368240, 802110977, 802239075, 802550583, 803315201, 803895569, 804255905, 804560547, 804605789, 804400635, 804449463, 804441910, 804043045, 803917923, 803663788, 803555374, 803847275, 804103012, 804752274, 805413895, 805399933, 805176392, 805385590, 805405426, 804789734, 804050140]
2221.9H04050140j35040M08936o4392k91062J32218M65774N17044M54178J38550n25055
2231.6H05151291m96445k07290l40424m15344j29013L7002k50015j05362M89044N18570
2241.2H04252014K20261K46582n5924p10449q95843l32489N2490k75040o2408M48456
2250.9H02887650O63909N38407L17459J28403l46604k49405r4223k86407l98941m79584
2260.5H02680664l71551P2860O60248M92477J88141J48774R1018J45035J14212k06222
2270.2H04015656o26755l71094k25220o942L92456K17208J1063K76260O74973j02234
2279.8H04255371n72510k80685j05515n4626n24902j17341L1357o866L30658J32065
2289.4H03087006J02691O0272L8605n10101l72543J90506j56022m40826l54767M92020
$$ y = [804050140, 803915100, 804324036, 804259644, 803968582, 804100800, 804566574, 805083618, 805537796, 805676346, 805151291, 804654846, 804447556, 804107132, 803691788, 803562775, 803599777, 803349762, 803244400, 803733444, 804252014, 804472275, 804718857, 804662933, 803952484, 803056641, 802724152, 802776642, 802501602, 802439194, 802887650, 803551559, 804089966, 804407425, 804535828, 804189224, 803939819, 803845596, 803559189, 803160248, 802680664, 802309113, 802381973, 803042221, 803534698, 803722839, 803871613, 803962631, 804107666, 804221878, 804015656, 803388901, 803017807, 802792587, 802785645, 803178101, 803395309, 803406372, 803682632, 804357605, 804255371, 803682861, 803402176, 803296661, 803242035, 802717133, 802599792, 802631149, 802624283, 802954941, 803087006, 803189697, 803249969, 803288574, 802778473, 802405930, 802596436, 802440414, 801999588, 801644821, 802136841]
2299.1H02136841J75247o0883L49045J11084J32370m07181J37253J81732j004333p97882
2308.7H00953293l56369J89438J99356p782o2027J28326K15225n87234n68237k12479
2318.4G99891510m5700m3411k8076R689p91474m38461M48074m17861o20499J08108
2328G98071899l85589j31684k01034o75278O65360J071090K02713k10342K93045j21078
2337.7G98579102O3400R36355o68563j299439M425R27811R3384n60685L54538K82288
2347.3G98712616Q95996J565781O16226q28323j014405m45556M3945q80432j346588
2356G97319260k594k518k42615m08325l82996N01404R03244M17328j050949p28607
2365.6G96322632N79071Q81576J099015J177826J23901j80130P93991L80249L46375
$$ y = [802136841, 802312088, 802251205, 802600250, 802711334, 802843704, 802436523, 802573776, 802755508, 801751175, 800953293, 800596924, 800786362, 800985718, 800977936, 800915909, 801044235, 801259460, 800672226, 800103989, 799891510, 799845810, 799802399, 799774323, 799784012, 798992538, 798554077, 799002151, 798584290, 797963791, 798071899, 797686310, 797554626, 797353592, 796678314, 797343674, 798414764, 798617477, 798407135, 798700180, 798579102, 798642502, 799578857, 798910294, 797610855, 797615280, 798543091, 798636475, 798075790, 798430328, 798712616, 799608612, 801174393, 801790619, 800962296, 799947891, 799502335, 799546280, 798665848, 797319260, 797316666, 797314148, 797071533, 796663208, 796280212, 796781616, 797684860, 798102188, 797051239, 796322632, 796901703, 797783279, 798882294, 800060120, 800184021, 800003891, 800797882, 801178131, 801524506]
2374.3H01524506N56793K76260J67542m9134J73111J84784L10288L11126k2201K6703
2383.9H03459778J79519L94593L76358M5776j03378J01089j76010l36151k49023l82691
2393.6H03309860L83225L53088k76565j8845P2174L8376j4343N6762K02408L7918l94821
2404.2H03749237j42593M6844m77829Q3084N57709O8436j92643j71508k40479r2163
2413.8H03188095K14386r4910l98559j73493L00827n7754k26669K89001j30768j2970
2423.5H02897186K34604k8610j54114j67618P7286l44009l78266L5172J61743L43094
2433.1H02676468Q0414k32544j49384j86615k79770O1417l8147P9346K52914m58450
2442.8H01805649m31977K4338K80075l5247l64151Q4152L19824J66321l07770l38593
$$ y = [801524506, 802081299, 802357559, 802525101, 802475967, 802649078, 802833862, 803144150, 803455276, 803433075, 803459778, 803639297, 804033890, 804410248, 804456024, 804352646, 804453735, 804277725, 803941574, 803692551, 803309860, 803693085, 804046173, 803769608, 803750763, 803822937, 803861313, 803846970, 803903732, 804106140, 804144058, 803749237, 803606644, 803653488, 803175659, 803258743, 803816452, 803884888, 803692245, 803520737, 803280258, 803188095, 803402481, 803307571, 802909012, 802735519, 803036346, 802978592, 802751923, 803040924, 802910156, 802897186, 803131790, 803103180, 802949066, 802781448, 802858734, 802514725, 802136459, 802171631, 802333374, 802676468, 802756882, 802524338, 802374954, 802188339, 801908569, 801969986, 801931839, 802011185, 802264099, 801805649, 801373672, 801398010, 801678085, 801642838, 801278687, 801362839, 801682663, 801848984, 801541214, 801202621]
2452.4H01202621l09829j28021K30789j15738J45492J73645m9591K15988k66265n15671
2462.1H00583420l57437l59116j4801J86615J34735j23825j02310N11246J05056k62680
2471.7H00300903J87073j38550m03213n55802n42526P4463K79846J9760q6212L3264
2481.3G99169006Q9569J40229r4681j34201j5564j33820q3084l44391m15191k71607
2491G97906265l3264J97678J50070J61743j72501j37481j05896k34070J16119R5749
2500.6G97944412k44446j93405L52249J70670k40402j31760j80588j40228k53143k48642
2510.3G96834717j18256j69906j50300k50320l90243j03302L56521K00577j63651j47934
2519.9G95897903J45417M9820l5096K67487M8294o5613p2632l68118l95508r1247K3269
$$ y = [801202621, 800892792, 800764771, 800995560, 800879822, 801025314, 801198959, 801149368, 801365356, 801099091, 800583420, 800225983, 799866867, 799852066, 800038681, 800173416, 800049591, 799947281, 800458527, 800563583, 800300903, 800487976, 800349426, 799946213, 799390411, 798847885, 798922348, 799202194, 799221954, 799135742, 799169006, 799258575, 799398804, 799304123, 799169922, 799154358, 799020538, 798937454, 798593063, 798177872, 797906265, 797873001, 798070679, 798220749, 798382492, 798209991, 798072510, 797966614, 797732544, 797848663, 797944412, 797699966, 797506561, 797858810, 798029480, 797789078, 797657318, 797476730, 797336502, 797083359, 796834717, 796716461, 796546555, 796396255, 796145935, 795755692, 795652390, 796008911, 796209488, 796045837, 795897903, 796043320, 796093140, 796058044, 796325531, 796373825, 796308212, 796235580, 795867462, 795471954, 795380707, 795403976]
2530.5G95403976k30560k51160j0376K93046L07693P8354l19901l06549o103k97165
2540.2G94661255n0812K77634N9204l38059k96630J06353j43966j3276Q7052N6839
2549.8G94405594r4376n20706j72043M9134J0604q0490o6223l68271l15399M73251
2559.5G93321075O0273j95389J52q0108J2588m7912k40403m26406j02082K63596K11029
2570.1G92776413k34757r1094K86865j07117l18680m16717M6234J39694l45154p7896
2579.7G91657791J65939l6773l48892j1368j1292k23999j7853k90756k53906J16348
2589.4G90745239N6381m24346n5390M07639k84424m99954J07574K60010m76151m60891
2599G89375687p5226p0496J66779R4452N1346k19422l41110j96228n2643N1117l24783
$$ y = [795403976, 795173416, 794922256, 794911880, 795204926, 795512619, 795590973, 795271072, 794964523, 794958420, 794661255, 794610443, 794888077, 794947281, 794609222, 794312592, 794418945, 794274979, 794261703, 794348755, 794405594, 794311218, 793790512, 793618469, 793667603, 793678207, 793597717, 793531494, 793163223, 792847824, 793321075, 793381348, 793185959, 793186111, 793106003, 793118591, 793070679, 792830276, 792403870, 792301788, 792565384, 792776413, 792541656, 792450562, 792737427, 792630310, 792311630, 791894913, 791941147, 792080841, 791735687, 791657791, 791823730, 791786957, 791438065, 791426697, 791415405, 791191406, 791173553, 790882797, 790628891, 790745239, 790801620, 790377274, 790321884, 790729523, 790445099, 789945145, 790052719, 790312729, 789836578, 789375687, 789300461, 789229965, 789396744, 789491196, 789542542, 789323120, 788982010, 788785782, 788733139, 788784256, 788459473]
2609.6G88459473j52665m9133q0719K92511K23999k59781n66177k90604m883J32599
2619.3G87704620n6686l94135j82952J00326m9438k15912j47095j53275M7303k9373
2628.9G86623383l65754n50537l14331M23432K30941p5912j11771l27148j63345l09220
2638.5G85059738k95410p019l9520P248j03684l32107L8375M6463k13012K02102j85318
2649.1G84177856o41174p8583K08893j92947k84424J755m10309n48859k6397K82211
2658.8G82488022R460l42712k84500j96381o0196j94473J15051Q1101l97415J61590
2668.4G81379547K47574j88217n13535j62277N06744o866m83780j00555J9378l76053
2678.1G80321960j08566J33362l03345o55365l86352N6610j08490J02157R4147O8741
$$ y = [788459473, 788306808, 788257675, 788176956, 788469467, 788693466, 788433685, 787867508, 787576904, 787572021, 787704620, 787647934, 787253799, 787070847, 787171173, 787121735, 786905823, 786758728, 786605453, 786652756, 786623383, 786257629, 785707092, 785392761, 785816193, 786047134, 785971222, 785859451, 785532303, 785368958, 785059738, 784764328, 784757309, 784717789, 784725037, 784621353, 784289246, 784327621, 784374084, 784161072, 784363174, 784177856, 783536682, 783458099, 783666992, 783474045, 783189621, 783191376, 782781067, 782232208, 782205811, 782488022, 782497482, 782154770, 781870270, 781673889, 781613693, 781419220, 781534271, 781615372, 781217957, 781379547, 781627121, 781438904, 780925369, 780763092, 781269836, 781262970, 780779190, 780678635, 780698013, 780321960, 780213394, 780346756, 780043411, 779388046, 779001694, 779058304, 778949814, 779051971, 779146118, 779214859]
2687.7G79214859M4556m68445k06757j14059j21231k67792j89209J51978k21634k06223
2697.4G77616043j21002K89535K80838k06375j01700o21566p55310n3101J65100j52664
2707G76339798j67770P6370J03302l79791m91028L38745j08566m79050J57776k65579
2716.6G75124207p31812j1749N57098j06048j59455J29090J0223q7891m39377l82308
2726.3G73901978o41480n42831J29699L78723J62735n95321o31333p0571K28424j22528
2735.9G72197495j55640L06549n1041k44446m32662o41099n6610J95084l74298l81622
2745.6G70361710M92782P34940j00250p81861k88544j28631l60870J53579J05057l96805
2755.2G69791107m89807j32294J03608k57111k38190J33896l12347m67148P400l65753
$$ y = [779214859, 779259415, 778790970, 778584213, 778470154, 778348923, 778081131, 777891922, 778043900, 777822266, 777616043, 777495041, 777784576, 778065414, 777859039, 777757339, 777135773, 776380463, 776327362, 776492462, 776339798, 776172028, 776248398, 776351700, 775971909, 775480881, 775819626, 775711060, 775232010, 775389786, 775124207, 774392395, 774380646, 774937744, 774831696, 774672241, 774801331, 774811554, 774723663, 774284286, 773901978, 773260498, 772717667, 772847366, 773226089, 773388824, 772793503, 772162170, 772091599, 772320023, 772197495, 772041855, 772348404, 772297363, 772052917, 771620255, 770979156, 770922546, 771117630, 770743332, 770361710, 770854492, 771589432, 771489182, 770707321, 770418777, 770290146, 769929276, 770082855, 770187912, 769791107, 769301300, 769169006, 769272614, 769015503, 768777313, 768911209, 768598862, 768131714, 768139114, 767773361]
2764.9G67773361l03802k7695j93253o4239p7133J16348p6599l01895R8037J52970
2774.5G67096100n57709p49359j0529j66854j26801o8665l82232k3270k09579j13221
2784.2G64687881m4555m26636l58810j38398m0893m55856n18113l01666J18866M44565
2793.8G62966385k38190n92575k51770j44806o44150o33545J6633k10953n64652l83300
2803.4G59319077j02692k90909q51364k01950O85425J70364n39322o16608l06930j42212
2813.1G57122879m14429o75659k86026J1139l35388j6709r9411n63201p6828o5232
2822.7G54601135n53512o77872p3624n7678q57544r44214n93490J50299Q3313l78189
2832.4G50698624p2556r3307l05176n45883r72290j155548p24640n81437m51965n02624
$$ y = [767773361, 767469559, 767441864, 767248611, 767184372, 767107239, 767223587, 767146988, 766845093, 766943130, 767096100, 766538391, 765789032, 765778503, 765611649, 765484848, 765416183, 765033951, 765010681, 764801102, 764687881, 764643326, 764216690, 763857880, 763719482, 763678589, 763222733, 762704620, 762402954, 762521820, 762966385, 762728195, 762135620, 761883850, 761739044, 761094894, 760461349, 760477982, 760267029, 759702377, 759319077, 759216385, 758925476, 758074112, 757872162, 758557587, 758727951, 758188629, 757572021, 757265091, 757122879, 756708450, 756032791, 755746765, 755757904, 755422516, 755405807, 755306396, 754743195, 754666367, 754601135, 754047623, 753369751, 753296127, 753238449, 752380905, 751436691, 750843201, 750993500, 751076813, 750698624, 750626068, 750532761, 750227585, 749681702, 748709412, 747553864, 746829224, 746247787, 745795822, 745293198]
2842G45293198r74198n95321j048890j411285r23309q26340q36716j474914j177216
2850.7G36025009n43442m80728k98462l07541J26038J06354k73514J0529M47387n0049
2860.3G34761581p23114l69567r0256l89557n50842l205J14517n01937j112900r64203
2870G30170517R308j22910n22155k76795l47977q55712p80335j96304l47672j27792
2879.6G26602173j05591m67987k88620l41492k42233l08380n86167l86886l31574o34002
2889.3G22909241m89884m77752m96598p3700l02429l25546k92053n43289n11475m18472
2898.9G18978043n27192r33990o95877m18244J16272R4681o11572m36096p21817k47422
2908.6G14596786J93787n75256p69730o89621r73663j199799m63028k59247m38842
$$ y = [745293198, 744319000, 743723679, 742674789, 741263504, 740340195, 739513855, 738677139, 737202225, 736025009, 735481567, 735000839, 734702377, 734394836, 734520874, 734627228, 734353714, 734364243, 734811630, 734761581, 734038467, 733668900, 733578644, 733189087, 732638245, 732635040, 732749557, 732247620, 731134720, 730170517, 730179825, 730056915, 729534760, 729257965, 728909988, 728054276, 727273941, 727077637, 726729965, 726602173, 726496582, 726028595, 725739975, 725398483, 725156250, 724847870, 724261703, 723874817, 723543243, 722909241, 722419357, 721941605, 721445007, 721371307, 721068878, 720743332, 720451279, 719907990, 719396515, 718978043, 718450851, 717516861, 716820984, 716402740, 716519012, 716613693, 716002121, 715566025, 714844208, 714596786, 714790573, 714215317, 713445587, 712755966, 711782303, 710582504, 710119476, 709860229, 709421387]
2917.2G09421387q85392j367340p38830o60477q8882l0670n46723k0065r232m11377
2926.9G04662399m34646K47345K11181J88294j76773o99540N52598N77011P9498J33362
2936.5G05340729J49002L81546k0752L55072Q32748M71192K43301r0484k68021K7237
2946.2G07421570L0517J6556K66953J20392j05896p61338p80563K84271K31247l18756
2955.8G06404953m52957m12750J72042M00773j90583j74560m1123j92032l3187j53428
2965.5G05327148K08283O16836P74155O84281M2800K89612M77829L85437N62287J80053
2975.1G09548721N5313N48783O63681L88183N22919L68958r4529J10321N61753M81643
2984.7G13155746K9831M02756Q58002o561m76609J99967L86886M10462M50058R6130
$$ y = [709421387, 708535995, 707168655, 706429825, 705769348, 705680466, 705649796, 705103073, 705083008, 705073776, 704662399, 704227753, 704475098, 704686279, 704874573, 704697800, 703998260, 704550858, 705127869, 705207367, 705340729, 705489731, 705871277, 705850525, 706205597, 707038345, 707509537, 707752838, 707662354, 707394333, 707421570, 707452087, 707468643, 707735596, 707855988, 707750092, 706988754, 706208191, 706492462, 706723709, 706404953, 705951996, 705539246, 705711288, 706112061, 705921478, 705746918, 705705795, 705513763, 705480576, 705327148, 705535431, 706152267, 706926422, 707610703, 707653503, 707943115, 708420944, 708806381, 709368668, 709548721, 709604034, 710152817, 710816498, 711204681, 711727600, 712096558, 712002029, 712112350, 712674103, 713155746, 713185577, 713588333, 714446335, 714439774, 713963165, 714163132, 714550018, 714960480, 715410538, 715506668]
2994.4G15506668J51672K96402K92283k11716n86548o2943Q469j97220k70157l46069
3004G14580841j01318L47442J59378m62341p3700J07651l33328j10779j1063k32544
3013.7G13870239p8964m9820m79126o03027l60947J0986J49918l24631p73849n54962
3023.3G10805817J63269J44958m00314l58505n11094p15942k99301j20850J068L32566
3033G09041672j03989q04748q79364o49491o09970m95758j96915L205J99432k20489
3042.6G05283585n84412m24576m61578l32871j40457L3875n05753p85522o4164k48107
3052.2G01770020n51377n06363m01840l06320q83637o68182P5760r4986l42941k28882
3061.9F97861252l13797n27725o63071j75324K90223o12336j009521j19324j5030l49197
$$ y = [715506668, 715658340, 715954742, 716247025, 716035309, 715448761, 715385818, 715394287, 715197067, 714926910, 714580841, 714479523, 714826965, 714986343, 714524002, 714450302, 714557953, 714224625, 714113846, 714102783, 713870239, 713791275, 713741455, 713262329, 712659302, 712298355, 712309341, 712459259, 712134628, 711360779, 710805817, 710969086, 711114044, 710713730, 710355225, 709844131, 709128189, 708828888, 708708038, 708709106, 709041672, 708937683, 708132935, 707253571, 706604080, 705994110, 705498352, 705301437, 705304642, 705504074, 705283585, 704699173, 704274597, 703813019, 703480148, 703339691, 703373566, 702867813, 702082291, 702018127, 701770020, 701218643, 700712280, 700310440, 700004120, 699120483, 698452301, 698528061, 698433075, 698090134, 697861252, 697547455, 697019730, 696356659, 696181335, 696471558, 695859222, 694849701, 694730377, 694715347, 694366150]
3071.5F94366150k43607m28772n48477j16806L2349j29318k03400q49152j079178k6321
3081.2F90773468k6932m51202j93405m97284l25394j35879k53754k32086n90134n11780
3090.8F87555618l74222k47268r7504l35770n97610q13522m46472P5454l02887p97119
3100.5F83618698m59671n29327l30811L09677k36816o62689m71650k57034m32052m36097
3110.1F80112228k47573p46537n72052o3629L6316l35312o82525l88337m19845l14331
3119.8F76378403k32773p34406j222534p92846k61918j90124k89459j043549o32095
3128.4F70978699R689n18265m67071k2354k19727p63931n70603m96978o46897o40030
3138.1F66642532m50439j55640p83615p33719l7002j45874o88401r61990q77228r50622
$$ y = [694366150, 694122543, 693693771, 693145294, 693028488, 693060837, 692931519, 692728119, 691878967, 690799789, 690773468, 690746536, 690295334, 690101929, 689604645, 689279251, 689143372, 688889618, 688657532, 688067398, 687555618, 687181396, 686934128, 686836624, 686500854, 685903244, 685089722, 684643250, 684718704, 684415817, 683618698, 683159027, 682629700, 682298889, 682608566, 682371750, 681709061, 681237411, 680980377, 680548325, 680112228, 679864655, 679118118, 678546066, 678482437, 678518753, 678183441, 677500916, 677112579, 676692734, 676378403, 676145630, 675411224, 674188690, 673395844, 673133926, 672943802, 672654343, 671610794, 670978699, 670988388, 670470123, 670003052, 669980698, 669760971, 668997040, 668426437, 667929459, 667282562, 666642532, 666192093, 666036453, 665252838, 664519119, 664482117, 664336243, 663647842, 662685852, 661808624, 660858002]
3147.7F60858002m97437J0300J40838k98080q41141p22198p30972m86985o82144q38394
3157.4F55911789k21253l29589p84150r27200o15768l21579m97208l86734l99170r08966
3167F50520172p76138n59769o27975m19388m66004n04455p52106q11615n67322l12652
3176.6F44722748j31378q39463j108932o42853n4474l74832p64465l54920j138611
3185.3F39312820j023330k56195m53606n57327n32112n15366p43751l54958n86166
3194F34290009j213913p75147l60908m42696n38521P6332j1749p15027j042900q87108
3203.6F28378372l44505k94304n02663q35266p17163q70590q38623m60053l64303n2338
3213.3F23098564j060181q05130L15247l09029p35168p33337m58069o69060r81941
$$ y = [660858002, 660360565, 660370865, 660511703, 660213623, 659372482, 658650284, 657919312, 657432327, 656750183, 655911789, 655690536, 655360947, 654576797, 653649597, 653033829, 652712250, 652215042, 651828308, 651429138, 650520172, 649744034, 649184265, 648556290, 648136902, 647670898, 647166443, 646414337, 645602722, 645035400, 644722748, 644591370, 643751907, 642642975, 642000122, 641945648, 641570816, 640806351, 640451431, 639312820, 638289490, 638033295, 637579689, 637022362, 636490250, 635974884, 635231133, 634876175, 634290009, 633076096, 632300949, 631940041, 631497345, 630958824, 631035156, 631023407, 630308380, 629265480, 628378372, 628033867, 627739563, 627236900, 626401634, 625684471, 624813881, 623975258, 623515205, 623150902, 623098564, 622038383, 621233253, 621548500, 621239471, 620504303, 619770966, 619312897, 618643837, 617661896]
3222F17661896m77562j47896q28285r21097k22206o04820l79944j39313p36198r75495
3231.6F12229080m37050J08910o00929n02091l26576r61761r02329l85361l30009q32253
3241.3F07059631n47371k44941k64359k51770l45497o77948p33681k06260o15578p16629
3250.9F02455597k89421M2953j48620q41217k50054l13606j089897j107941o75316
3259.6E97782478J9799J79596l76168o07681l01399m29344l15056p04613q03833o3133
3269.2E94380646l79257m73938n67742o72188p19528n13801K1095m08707l64342m29077
3278.9E89873161m29802q3084o76079p95173l68462l72124m65736l74832n27115n8021
3288.5E85722733K22549p12662q14972j75247k5024l84598q52890q05931o7711m0054
$$ y = [617661896, 617184334, 617036438, 616208153, 615287056, 615064850, 614460030, 614080086, 613940773, 613204575, 612229080, 611792030, 611900940, 611300011, 610797920, 610471344, 609509583, 608607254, 608221893, 607891884, 607059631, 606512260, 606267319, 606002960, 605751190, 605405693, 604727745, 603994064, 603787804, 603172226, 602455597, 602166176, 602209129, 602060509, 601219292, 600969238, 600655632, 599565735, 598457794, 597782478, 597802277, 597981873, 597605705, 596998024, 596696625, 596267281, 595952225, 595247612, 594443779, 594380646, 594001389, 593527451, 592959709, 592287521, 591567993, 591054192, 591075287, 590666580, 590302238, 589873161, 589443359, 589360275, 588684196, 587889023, 587520561, 587148437, 586682701, 586307869, 585780754, 585722733, 585945282, 585232620, 584417648, 584242401, 584217377, 583832779, 582979889, 582173958, 582106247, 582066193]
3298.2E82066193m47426m83208o41441j56594l22609q08219o02990j56555j66664r36546
3307.8E77343941l18680l93868j230316q58459l98560J87912j26533k78626r2163o47507
3317.4E73187141r07516o61087m52843m81682n32570m74357j36185l50189l58467n35813
3327.1E68296432j167678q36869o92672k77214l85323m90150j98174r71031o09779
3335.8E62667542r6360n71403q38738m48189m72526q73070k35443m30107q54263n82352
3345.4E57265091n75333n14679k35328l68271o92597k04048m10194q58994o71692p06977
3355.1E52026978o65093m93622m25796o24352m50516k25334q4839m26712r31778n37834
3364.7E47161102n53856p68661o55480l37448m38423l87764P3395p70149j246910n18151
$$ y = [582066193, 581618767, 581135559, 580494118, 580337524, 580014915, 579206696, 578603706, 578447151, 578280487, 577343941, 577025261, 576631393, 575401077, 574542618, 574144058, 574331970, 574205437, 573926811, 573834648, 573187141, 572279625, 571618538, 571165695, 570684013, 570151443, 569677086, 569540901, 569190712, 568832245, 568296432, 567128754, 566291885, 565599213, 565321999, 564936676, 564446526, 564248352, 563277321, 562667542, 562571182, 561999779, 561161041, 560712852, 560240326, 559367256, 559131813, 558701706, 557847443, 557265091, 556689758, 556175079, 555939751, 555571480, 554878883, 554674835, 554264641, 553405647, 552733955, 552026978, 551361885, 550868263, 550442467, 549818115, 549367599, 549142265, 549057426, 548630714, 547698936, 547161102, 546607246, 545838585, 545183105, 544845657, 544407234, 544019470, 544092865, 543322716, 542075806, 541557655]
3374.3E41557655Q6022k27776m06456l28293r12323n23376J297k42043m86145j26533
3384E38392029J06926n73578o45485o35834o59637j26152J80855k53296q84514q57926
3393.6E34043388l39126j91078m32244L0213K07901j40725m90112m73366o8245m41207
3403.3E31705399k40326o1264n15786q10089m11682N66940M83818j41220n83114k46697
3412.9E29745979j44157k02675k04010p24297l29551l0976R6779m48265j36299N06249
3422.6E28128777o44265j74331J38015j14402R2620n5007j17150p6370J43051j71852
3432.2E27149086L01552M8103k33459M42199L63923N96160k02751o99081l01743q3046
3441.8E27380943n2108k2545L04260K04086N61562J27563N1689K83776J75934N44014
$$ y = [541557655, 541643677, 541415901, 541009445, 540681152, 539768829, 539245453, 539246750, 539004707, 538518562, 538392029, 538498955, 537925377, 537279892, 536644058, 535984421, 535858269, 536039124, 535785828, 534901314, 534043388, 533704262, 533513184, 533080940, 533111153, 533319054, 533178329, 532688217, 532214851, 532146606, 531705399, 531465073, 531403809, 530888023, 530077934, 529666252, 530233192, 530717010, 530575790, 529992676, 529745979, 529601822, 529399147, 529195137, 528470840, 528141289, 528110313, 528207092, 527758827, 527622528, 528128777, 527484512, 527310181, 527448196, 527333794, 527426414, 527371407, 527254257, 527177887, 527320938, 527149086, 527450638, 527498741, 527265282, 527707481, 528071404, 528667564, 528464813, 527765732, 527463989, 527380943, 527328835, 527306290, 527610550, 527814636, 528376198, 528503761, 528555450, 528839226, 529015160, 529559174]
3451.5E29559174R4833L39241L14407J4954n0621K09541M13666k58636L58848O39572
3461.1E31634979N84755j67122m04739R20563R41391J61323q66508K62413R62829M71955
3470.8E34501839O72264J47323R62792P30705m26369m2991L99513N00565M59938R55391
3480.4E38860970N82695n86968n81360J250687J269226M883Q06312N57709q6555K63290
3490.1E42340889R16367R31282K49595O60057P62978P68127K61727l22304M69398O01082
3499.7E47639198L13530R70536P37953m70886R8114J128082J049461K38648P48825
3508.4E52453461M84199m55436J157531R12094Q90808J247139L88413L63846J27144
3517.1E57569199L98140M98390J34392K43225J231460J476441j92604n2796J028023
$$ y = [529559174, 529654007, 529993248, 530307655, 530322609, 530271988, 530481529, 530895195, 530636559, 530995407, 531634979, 532219734, 532052612, 531647873, 532568436, 533509827, 533671150, 532804642, 533067055, 534029884, 534501839, 535174103, 535321426, 536284218, 537014923, 536588554, 536545563, 536945076, 537445641, 537905579, 538860970, 539443665, 538856697, 538275337, 539526024, 540795250, 540800133, 541606445, 542164154, 542077599, 542340889, 543257256, 544188538, 544438133, 545098190, 545861168, 546629295, 546891022, 546568718, 547038116, 547639198, 547952728, 548923264, 549661217, 549190331, 549288445, 550416527, 551465988, 551704636, 552453461, 552937660, 552482224, 553639755, 554551849, 555442657, 556689796, 557078209, 557442055, 557569199, 557967339, 558465729, 558600121, 558843346, 560074806, 561551247, 561358643, 561305847, 562333870]
3525.7E62333870J030998J09787J210518J296883K63137J153336R69467N55802L0746
3534.4E68954544R34410J028290p38411L71246R78470J170311J135407O39572j12839
3543.1E74361000P85141J157417p83996P67898R82972J444740J265678R86366J893235
3551.8E82860451n65453L06664Q72001J106224J262055k7504J414184J148568O80084
3560.5E89057274L71284J026802O28472L9825L581963J270828j216545p74384p91702
3569.1E93193817K756119J791420Q99048J065292J090126O38046J241417J808014J22910
3577.8F04606209J038132L90930K57606J916084J263581M97894J315689L934937Q27331
3586.5F16048393k804069J174011l128K351723K387123J781692Q95119K97203K152557
$$ y = [562333870, 563364868, 563474655, 564685173, 565982056, 566245193, 567398529, 568367996, 568923798, 568954544, 569888954, 570917244, 570178833, 570550079, 571528549, 572698860, 573834267, 574473839, 574361000, 575146141, 576303558, 575519562, 576287460, 577270432, 578715172, 579980850, 580967216, 582860451, 582294998, 582601662, 583473663, 584579887, 585841942, 585814438, 587228622, 588377190, 589057274, 589428558, 590455360, 591083832, 591123657, 594705620, 595976448, 594759903, 593985519, 593193817, 595949936, 597741356, 598640404, 599705696, 600795822, 601433868, 602675285, 604483299, 604606209, 605644341, 606035271, 606292877, 608208961, 609472542, 609970436, 611286125, 615221062, 616048393, 613244324, 614418335, 614415207, 616766930, 619154053, 620935745, 621830864, 622128067, 624280624]
3595.2F24280624j062774J147918K394677K45819K170791Q01087K66113J126938J031036
3603.9F32402229J640587J947861J292724r30747J985778q83789K09656N933266N27343
3612.5F44124908k066345K341690k6855L509979L521805P9422q57239k257614J754074
3621.2F50123825L039856K381134J845474J449204J539078J452789M421921J229019
3628.9F67482300q018036L050842L400269L729324J153870j486435K138138K811660
3636.6F74261932J597596J49002J671219K076339R62601Q52051L86581J101532K025376
3645.3F85084229M137115N0354l497772M420166K78549k757492L79486L888779K637176
3654F94620590K070084L401031n044632R30786L905793J683044J430893L76129J211167
$$ y = [624280624, 623217850, 624365768, 626760445, 627006264, 629177055, 629978142, 630244255, 631371193, 632402229, 634042816, 635990677, 637283401, 636352654, 638338432, 637454643, 637664299, 643597565, 644124908, 642058563, 644400253, 644373398, 647883377, 651405182, 651484604, 650627365, 648369751, 650123825, 653163681, 655544815, 657390289, 658839493, 660378571, 661831360, 666253281, 667482300, 659464264, 662515106, 665915375, 669644699, 670798569, 669312134, 671450272, 674261932, 675859528, 676008530, 677679749, 679756088, 680718689, 681570740, 681957321, 683058853, 685084229, 689221344, 689271698, 685773926, 690194092, 690472641, 687715149, 688094635, 691983414, 694620590, 696690674, 700091705, 695047073, 695977859, 699883652, 701566696, 702997589, 703373718, 704584885]
3662.7G04584885M51278R20716R84039p3319K835770J844025j327057j866455l449936
3671.4G04903946L587646O175766O458893r00268j3233567K564621M786835L112259
3679.1G17456131j235733n58395J327819J670380J791534J08414k10724K402191L848038
3687.8G26599655o243286j918030O896286m597320j969300K606278j53427R98077O4926
3696.4G22283859j63727M93775N112K224502K412186k990799j591797L181457R67560
3705.1G26822128o96182K12021J995468L959427l377075J700821K640381r945221L495102
3713.8G26806870L756484K24762K78702R70688M4251k031098Q38318L604660r11407
3722.5G33582230k507630K911377P477j131744j160736M89883K644882K07596K665024
$$ y = [704584885, 705036163, 705956879, 706940918, 706867599, 709703369, 711547394, 710220337, 708353882, 704903946, 708491592, 714667358, 721126251, 720225983, 706992416, 709557037, 714343872, 717456131, 716220398, 715662003, 716989822, 718660202, 720451736, 720560150, 720349426, 722751617, 726599655, 720356369, 718438339, 725334625, 720737305, 718768005, 721374283, 721220856, 722218933, 722283859, 722120132, 722613907, 722619019, 724843521, 727255707, 724264908, 722673111, 725854568, 726822128, 726125946, 726337967, 728333435, 732292862, 728915787, 730616608, 733256989, 723311768, 726806870, 730563354, 730788116, 731066818, 732037506, 732081757, 730050659, 730888977, 734493637, 733582230, 731074600, 733985977, 733993454, 732861710, 731700974, 732190857, 734835739, 735043335, 737708359]
3731.2G37708359j559677m381104M997101n46112n805664P0267K107086M27932J758347
3739.8G34776535K511444l130188K004242P655106q777314j0484085O781845L799057
3747.5G35136642M069672k087326p006302O727753n179978l412399N062637L294068
3755.3G36604767K171173l451233J721268L711014o540375n74723L771592N85861l30124
3763.9G37669220K058792k509689l488007K209015K579880l14179m626007J524430
3771.7G35103455K132721L59954L92075k79694M64096K34681J597900n13306m738998
3780.3G34752884K164993J567307N41992J224060k078476o11038L75213J49994M53644
3789G38540573o30112q3465R6969K31324L86963J103439J780167k177353k029953R48257
$$ y = [737708359, 736148682, 731767578, 736764679, 736218567, 730412903, 730483170, 732590256, 733018188, 734776535, 737287979, 734157791, 736162033, 743817139, 735039825, 724555740, 731337585, 735136642, 739206314, 737118988, 730112686, 736840439, 731660461, 728248062, 733310699, 736604767, 738775940, 735324707, 737045975, 740756989, 734216614, 733641891, 737413483, 737999344, 737669220, 739728012, 737218323, 733730316, 735939331, 738519211, 738205032, 733579025, 735103455, 737236176, 737596130, 737988205, 737708511, 738172607, 738407288, 740005188, 739491882, 734752884, 736917877, 738485184, 739027176, 740251236, 738172760, 737561722, 737936935, 738086929, 738540573, 737910461, 737826996, 737923965, 738155289, 738542252, 739645691, 741425858, 739248505, 737218552, 738166809]
3798.7G38166809J770020L077163m298858p172242K508011K733918L661880L581238
3806.4G44027939p452011k316666L523636P24335r7962P3929k43835P82394L750687
3815.1G42772446p62024r194412L497314L427811K193832M04816j0273056K258835
3822.8G34325562L162612Q41370J620789j79520k890778P38907R44290J748581Q53653
3831.4G41165466o854324K250671N108261l640899N67398M554901q771439l018646
3839.2G31361389O457825k525406q163L807296j976928j633759K060547N17883J25199
3847.8G38185883J793136j343307M85611L379287p739486m72107n079041K927857P148437
3856.5G39286270j434784j756439J543884J041184O89239l270340Q49762M060974m992141
$$ y = [738166809, 739936829, 743013992, 738715134, 731542892, 734050903, 736784821, 740446701, 744027939, 736575928, 734259262, 737782898, 738507233, 738409271, 738483200, 738239365, 739021759, 742772446, 742010422, 732816010, 736313324, 739741135, 741934967, 742339783, 732066727, 734325562, 737488174, 738329544, 739950333, 739770813, 736880035, 737618942, 738563232, 740311813, 741165466, 734311142, 736561813, 741670074, 738029175, 738596573, 743151474, 734380035, 731361389, 737819214, 735293808, 735285645, 739092941, 737116013, 735482254, 737542801, 738060684, 738185883, 739979019, 738635712, 739121323, 742500610, 734761124, 734289017, 729209976, 732137833, 739286270, 737851486, 736095047, 737638931, 738680115, 739369354, 736099014, 736948776, 741009750, 736017609]
3865.2G36017609k586518L166809L014756L598404o049195o114578K823105M530411
3872.9G38400803K020263p575531J901627L391571l70483J111526L109894l577805
3880.6G38411865n296860L634263J63498P56759K583923r101181J468659L510208J305695
3889.3G37436829K701416q22068o033096R30100K503891o50483Q80204L13568J398697
3898G38659058R56802p170181L932953K188034m062958K791443j854477j314697j70594
3906.7G33955383J05744J869354P15790L17459r7428M7608K36740n16052N2261R55811
3916.3G37642670k836609k533341L812104O77032k630081J724472Q76312k9220j340866
3925G35362473j521454R72137N51148M04663m29383L97644J228333k015457r92890
$$ y = [736017609, 733431091, 736597900, 739612656, 743211060, 737161865, 731047287, 733870392, 738400803, 740421066, 732845535, 734747162, 738138733, 737768250, 738879776, 741989670, 738411865, 733115005, 736749268, 736912766, 737669525, 740253448, 731152267, 732620926, 736131134, 737436829, 740138245, 739316177, 733283081, 734213181, 736717072, 736066589, 736946793, 737260361, 738659058, 739615860, 732445679, 736378632, 738566666, 734503708, 737295151, 735440674, 734125977, 733955383, 734061127, 735930481, 736646271, 736963730, 736866302, 736913910, 737150650, 736634598, 736686859, 737642670, 734806061, 732272720, 736084824, 736761856, 734131775, 735856247, 736732559, 736703339, 735362473, 733841019, 734813156, 735364304, 735768967, 735339584, 735737228, 736965561, 734950104, 733957214]
3933.7G33957214R79233O09436O37207R7199r04923m02832J83792J052933O95648l327408
3943.3G33577499p50351J374970J062088J157379j978073m52728K5940j039353J766205
3952G34743576K93732r35364J26801M05578O2561n35660J65863n8517J51596K68860
3961.6G34689026m90723q8043o4774J86234K21100R5062J37940j200715j013565M05808
3971.3G32877350M48837N46112L39813M86680O8054q42514K72674J17340k59399M70886
3980.9G34525833J0224m78974j60675J17340n44510k89459J79443K99149N46036m50669
3990.6G33753738o28967m57916j79520J11542p3929M83093P14798M51050n95779m43573
4000.2G33134537
$$ y = [733957214, 734936447, 735545883, 736183090, 736280289, 735375366, 734972534, 735156326, 736209259, 736904907, 733577499, 732827148, 734202118, 735264206, 736421585, 734443512, 733990784, 734016724, 732977371, 734743576, 735037308, 734101944, 734228745, 734634323, 734696884, 734161224, 734327087, 734268570, 734420166, 734689026, 734198303, 734110260, 734045486, 734231720, 734452820, 734547882, 734685822, 733485107, 732471542, 732877350, 733326187, 733872299, 734212112, 734698792, 734766846, 733924332, 734197006, 734314346, 734054947, 734525833, 734536057, 734057083, 733896408, 734013748, 733469238, 733179779, 733359222, 733658371, 734204407, 733753738, 733124771, 732666855, 732487335, 732598877, 732524948, 733008041, 733722839, 734173889, 733578110, 733134537]
##END=$$ End of the data block
