##TITLE=$$ Begin of the data block
##JCAMP-DX=5.00 $$ ACD/SpecManager v 10.08
##SPECTROMETER/DATA SYSTEM=Varian
##DATE=18 Dec 2012 14:13:36
##DATA TYPE=INFRARED SPECTRUM
##DATA CLASS=XYDATA
##ORIGIN=
##OWNER=
##NPOINTS=3735
##FIRSTX=399.26403809
##LASTX=4000.35498047
##MAXX=4000.35498047
##MINX=399.26403809
##MAXY=82.08473969
##MINY=15.94966507
##XFACTOR=1.0000000000
##YFACTOR=0.000000100000000
##FIRSTY=71.65313721
##DELTAX=0.96440572
##XUNITS=1/CM
##YUNITS=TRANSMITTANCE
##XYDATA=(X++(Y..Y))
399.3G16531372o068649m80805N227127K775345k401886O867066M058609J90811n118408
407.9G21580582p511521l078460J373M508819M617539N771637j432877l653335J267318
416.6G22071075j377792n766373o381759l244782J333466M571152M06570j909866M20456
425.3G10122147M859466R831314J98822n571899o421280q590622j547394Q5297J813125
434G04778976L348084J251144L299942J706620J850891K313614L48053k374878p844010
442.7G08678436m750671l045578l390579K705078M761429k003632k846451K844315
450.4G02952347N279922J267624l606338m644318l822403j812897J380005j934662
458.1F95059280N446549P447433q65936M52576r51844m530334l935318n847626j600723
$$ y = [716531372, 710462723, 709981918, 715209045, 717984390, 715582504, 722449570, 726508179, 726698990, 721580582, 714069061, 710990601, 710991974, 715500793, 720118332, 725889969, 724457092, 720803757, 722071075, 720693283, 714926910, 708545151, 705300369, 706633835, 711204987, 711611557, 709701691, 710122147, 714981613, 724812927, 725011749, 719439850, 713018570, 704427948, 702880554, 702965851, 704778976, 708127060, 709378204, 712678146, 714384766, 716235657, 718549271, 718897324, 716522446, 708678436, 703927765, 700882187, 697491608, 700196686, 704958115, 702954483, 700108032, 702952347, 708232269, 709499893, 705893555, 701249237, 697426834, 695613937, 696993942, 695059280, 700505829, 707953262, 707087326, 707539902, 706588058, 702057724, 698122406, 692274780, 690674057]
466.8F90674057j655884R92279N909653M444046l8910o229706K057419O33926p49969
475.5F96036911J676483J73569j923065m572220J686096N381699M624481K323913j370468
484.1G04037399L496552K881546r55200l345032l347778j000748k081299j466827L011856
492.8G01230469J528930m47235K866898K777786K917633J262284l569718l015747l383331
501.5G02167969j725388K56348l241654j318588L560410N414428K265168J042404m71649
510.2G07949448l161240l927460m608230k880249o69403m241639l777313M699860M838409
518.9F94222183K691498J698914M29000j173019m733734l341522j75629k097855k754516
527.5F84765320N74798L732377L074417J151809m60968Q85315P56378j370086j847382
$$ y = [690674057, 689018173, 690010452, 695920105, 700364151, 700325241, 694095535, 696152954, 696786880, 696036911, 697713394, 697886963, 695963898, 691391678, 693077774, 698459473, 703083954, 705407867, 704037399, 707533951, 710415497, 709460297, 706115265, 702767487, 701766739, 699685440, 698218613, 701230469, 702759399, 702312164, 705179062, 707956848, 710874481, 712136765, 708567047, 705551300, 702167969, 700442581, 700698929, 697457275, 696138687, 699699097, 705113525, 707378693, 708421097, 707949448, 704788208, 700860748, 696252518, 693372269, 692702866, 688461227, 684683914, 689383774, 694222183, 696913681, 698612595, 699041595, 697868576, 693134842, 689793320, 689617691, 687519836, 684765320, 685340118, 689072495, 692146912, 693298721, 692837753, 693723068, 694479446, 693109360, 691261978]
536.2F91261978l267059j506348n12619j098175J576691M342956O378861K503891k174072
544.9F97506104k097703m02069j187133k386856q5984j736755k345657J516799M103241
553.6F92883987N130616J646194K35138J92490j759110p97882j414490k641754j423492
562.3F92051697L18756M11987Q25653J772309K232895L909378J645355j912995j863937
570.9F99391098k903976k538681j373444j018982o43387J230087J641770J344681J835937
579.6F96965103O08444J570588J431884j751938l134231k994843j403045r03321N23224
588.3F90911865J633835Q23593M78058J58691Q21610o15845k074890k027435k825241
597F87284241k991486k885666j152115k23159j128998p43256j484833m799652p391205
$$ y = [691261978, 687994919, 686488571, 685975952, 684877777, 686454468, 690797424, 697176285, 699680176, 697506104, 695408401, 695006332, 693819199, 691432343, 691346359, 689609604, 687263947, 688780746, 692883987, 698014603, 699660797, 699895935, 700088425, 698329315, 697531433, 696116943, 693475189, 692051697, 692370453, 692782440, 693608093, 695380402, 697613297, 701522675, 703168030, 701255035, 699391098, 696487122, 693948441, 692574997, 691556015, 690912628, 692142715, 693784485, 695129166, 696965103, 697573547, 699144135, 700576019, 698824081, 695689850, 692695007, 691291962, 690388641, 690911865, 692545700, 693369293, 693847351, 694006042, 694827652, 694211807, 692136917, 690109482, 687284241, 684292755, 681407089, 680254974, 680031815, 678902817, 678159561, 676674728, 671875076, 664483871]
605.6F64483871p856216r461136j3515739j6157151j5935745j8286400j8299217j6483955
613.4E48488312j2689553p306633k322196O99996r59281k343827q296051j3737030
621.1E01533737j6131897j5468330j1721153n343209Q902550J7765236K4206047K4729385
628.8E28472366K1883049J6102639Q489151K461547o399154r989395j2323838j1042747
636.5E37653618q825836o271553J028518O211968J4060936J9951095K4232788K3371430
644.2F11412964K0691719J6552086J2189560J0136718Q439942Q897934Q065643L974228
651.9G00360794K145081L227005R54971o99005l3341p17392j59301R35211R74197K631760
661.6G09619980K988586K614746K688370J254501J046143k471695j2925186M434814
$$ y = [664483871, 656627655, 647166519, 633650780, 617493629, 601557884, 583271484, 564972267, 548488312, 535798759, 528492126, 526169930, 526869926, 525910645, 523566818, 515270767, 501533737, 485401840, 469933510, 458212357, 452869148, 461771698, 479536934, 503742981, 528472366, 550355415, 566458054, 574947205, 577408752, 571009598, 561020203, 548696365, 537653618, 528827782, 522556229, 523584747, 529796715, 543857651, 563808746, 588041534, 611412964, 632104683, 648656769, 660846329, 670983047, 679422989, 688320923, 696386566, 700360794, 702505875, 705732880, 706687851, 705988846, 705955505, 705238113, 705078812, 706014023, 706988220, 709619980, 712608566, 715223312, 717911682, 719166183, 720212326, 717740631, 704815445, 709250259]
669.3G09250259L073044J443405O18287J233825K988587L021774K999878N95093n78461
678G24645691m58069j433487j575012j061478n98221m98428J017685J776733J416016
686.7G23231430J428833L37296n87922n78689j434097k960816k076568j353989k429199
695.3G13576279p02820J749496J681671K062836J976013p9116q15278q64181j262207
704G17322693j577912j631774k64512J165390K010575K681961K886352K328949K359391
712.7G27281113J923752m75922q92105o46286r87854p92847L70636J881104J746292
721.4G29407883K817840L385086J841126O27899l53546j822586l184433j668244r97238
730.1G30053787k163620q18634J210938J586837J361084J254197J129684M38919p14187
$$ y = [709250259, 712323303, 713766708, 714384995, 715618820, 718607407, 721629181, 724629059, 725224152, 724645691, 724187622, 722754135, 721179123, 720117645, 719519424, 719020996, 720038681, 721815414, 723231430, 724660263, 724997559, 724409637, 723830948, 722396851, 719436035, 717359467, 716005478, 713576279, 712873459, 714622955, 716304626, 718367462, 720343475, 720264359, 719449081, 718584900, 717322693, 715744781, 714113007, 713848495, 715013885, 717024460, 719706421, 722592773, 724921722, 727281113, 729204865, 728728943, 727836838, 727190552, 726202698, 725409851, 725780487, 727661591, 729407883, 732225723, 735610809, 737451935, 738079834, 737726288, 735903702, 732719269, 731051025, 730053787, 727890167, 727071533, 728282471, 729869308, 731230392, 732484589, 733614273, 734053192, 733339005]
738.7G33339005j363450k537078k549668r60312N34211J755371J455307K042465K812881
747.4G34528732K231827K026520J902923Q64182o32553L07770K59781j71967O48880
756.1G41966095J584930L665314K517319J357422J701431J526108P88269j447830j796341
764.8G51862717r82590k13852j229095n50309K313538J664886M98581R64890J209869
773.5G55538635m32205J70593J149750r63135j074066J35422J138916J680450K562867
782.1G59907227K277298J848754K389527R02252j43509j241455l64761J71814j481553
790.8G64265594j160507J45035J713791J895447J957397R30481k06299M86222j23444
799.5G69903717j110992j664734n49927K83127R21860J426773P83386R49249N53742
$$ y = [733339005, 731975555, 729438477, 726888809, 725928497, 726462708, 728218079, 729673386, 731715851, 734528732, 736760559, 738787079, 740690002, 741554184, 740921631, 741229401, 741489182, 741317215, 741966095, 743551025, 747216339, 749733658, 751091080, 752792511, 754318619, 755106888, 753659058, 751862717, 750880127, 750666275, 749437180, 748886871, 751200409, 752865295, 753363876, 754328766, 755538635, 755106430, 755277023, 756426773, 755463638, 754389572, 754524994, 755663910, 757344360, 759907227, 762184525, 764033279, 766422806, 767325058, 767181549, 765940094, 765575333, 765747147, 764265594, 763105087, 763250122, 764963913, 766859360, 768816757, 769747238, 769540939, 770027161, 769903717, 768792725, 767127991, 766578064, 766861191, 767783051, 769209824, 769993210, 770942459, 771496201]
808.2G71496201M87594J54953J95236j43356k029266j800309P54471J825638j65024
816.9G70776138M50592K072220J372299Q19092K91672j08490j517563j881180r34753
825.5G71340027m22516L357N56564K56882j018295l33863J26648j331024k193451j932754
835.2G65051575k384568l080062k064667p49664j219941j811599p56836m94614K06757
843.9G52696381K70309j257706j230468j427155r23767j52893P41272K070770J888580
852.5G52675323K077866K091751J919708J811448J551361J001968R63059J142272n27496
861.2G64707260L31650J677627J977845J887665N07583J230011J620560N53360q27561
869.9G73666000r08889r03702q59070R41696J427994J007309K28271J242218J621247
$$ y = [771496201, 771983795, 772138748, 772333984, 772190628, 770161362, 768361053, 769115524, 770941162, 770776138, 771226730, 773298950, 774671249, 775490341, 775782013, 775673523, 774155960, 772274780, 771340027, 770917511, 770920868, 771477432, 771734314, 770716019, 770382156, 770508804, 769177780, 766984329, 765051575, 762667007, 759586945, 757522278, 756772614, 755552673, 753741074, 752984238, 752489624, 752696381, 752966690, 751708984, 750478516, 749051361, 748127594, 747974701, 748715973, 750786743, 752675323, 754753189, 756844940, 758764648, 760576096, 762127457, 763129425, 764092484, 765234756, 764707260, 765038910, 766716537, 768694382, 770582047, 771089630, 772319641, 773940201, 774493561, 773666000, 772757111, 771853409, 770994339, 771936035, 773364029, 774371338, 774599609, 775841827, 777463074]
878.6G77463074k42920m64783j639099k519302j666718j813507k210388j128388o99310
887.3G65078659K23236J508179O60400O5842l82843o12946j200943j122818n3024M5624
896.9G64209366K82516O7063M01535N50995J149597R17434j221694j714097j942825
905.6G62699890j350021j219712j012191j031800j716766j054840j414719q86764p94678
914.3G52218399q19550q55712k519989k555161k515030j927566j214676r70307k99530
922.9G38540878n92422p67822l68882j49841q84857j260224j366882j625137p06177
931.6G30818634K18201O28357P73849J103211J996307K976837K715531J496047J005784
940.3G43732758P40509J144485J044540Q65784J596680K282410J997375O07071J538162
$$ y = [777463074, 777220154, 776755371, 775116272, 772596970, 770930252, 769116745, 766906357, 765777969, 765078659, 765301895, 766810074, 767470474, 767536316, 767153473, 766540527, 765339584, 764216766, 764163742, 764209366, 764491882, 764558945, 764960480, 765511475, 766661072, 767578506, 766356812, 764642715, 762699890, 761349869, 760130157, 759117966, 758086166, 756369400, 755314560, 753899841, 753013077, 752218399, 751398849, 750543137, 748023148, 745467987, 742952957, 741025391, 739810715, 738840408, 738540878, 737948456, 737180634, 736811752, 736661911, 735777054, 734516830, 733149948, 731524811, 730818634, 731036835, 731665192, 732439041, 733542252, 735538559, 738515396, 741230927, 742726974, 743732758, 744473267, 745617752, 746662292, 747528076, 749124756, 751407166, 753404541, 754011612, 755549774]
949G55549774K324982Q05588n06363n03540l22800j323776j219788o92062k85263n90439
958.6G53236313j358261q34046m60662j018754k082290k154236k438736k936325k343216
967.3G37609787j465988n80597o20499n81054m02985o27899o93665j845550k378540
976G28413010j690903j712265j612473j342849j035385j168366j378097r2011l32718
984.7G18047943j569061k337189m410019n262832m472962n051041p063598p943878
992.4F79937363j0833512j7677002k4191284k0091629K118988K2274399K3411255J3483505
1000.1F68432083O355820K269592K15836J251373N88455l96576P90711P78808P3014
1008.8F80359116M6463k24076j253357k003173k134095k374038k305298j337357r88693
$$ y = [755549774, 757874756, 758680344, 758173981, 757670441, 757347641, 756023865, 754804077, 754112015, 753826752, 753236313, 751878052, 751044006, 750583344, 749564590, 747482300, 745328064, 742889328, 739953003, 737609787, 736143799, 735563202, 734942703, 734361649, 733958664, 733330765, 732637100, 730791550, 728413010, 726722107, 725009842, 723397369, 722054520, 721019135, 719850769, 718472672, 718380661, 718047943, 716478882, 714141693, 709731674, 704468842, 699995880, 694944839, 687881241, 679937363, 669103851, 651426849, 627235565, 607143936, 609262924, 631537323, 654948578, 668432083, 674787903, 677057495, 677273331, 678524704, 679113159, 678716583, 679507294, 680286102, 680359116, 680405579, 680181503, 678928146, 676924973, 674790878, 672416840, 670111542, 668774185, 667785492]
1017.5F67785492j629486r70383L59497K07443j376037k333450k652512k695999k717819
1026.1F53976746k591019j974335k260513j379700n31387r57413j065216o54983p79190
1034.8F41782990j767273j468773k263985k945671k385559j455612m53530j14784J091538
1043.5F30019341P76939J091423L59497o02989j52817r14993L29132N86052k44217
1052.2F31247368n32341J034660K090798J245918K009468J111031K53448j194077j866531
1060.9F35399742j407738k075729j272087j446457n23148o0348n10559j63345k73400
1069.5F27666931j526222l549881k843895k598419k694550l748703l609237j995621
1077.2F05100403k448616q50296j248589j888504k552948l037605k899590m042778
$$ y = [667785492, 666156006, 665185623, 665545120, 665752563, 664376526, 662043076, 659390564, 656694565, 653976746, 651385727, 649411392, 647150879, 645771179, 645239792, 644282379, 643217163, 642562180, 641782990, 640015717, 638546944, 636282959, 633337288, 630951729, 629496117, 629042587, 628927803, 630019341, 630796280, 631887703, 632247200, 631644211, 631491394, 630576401, 630905533, 631491585, 631247368, 630715027, 631749687, 633840485, 635086403, 637095871, 638206902, 638460350, 637266273, 635399742, 633992004, 631916275, 630644188, 629197731, 628674583, 628614235, 628103676, 627940331, 627666931, 626140709, 622590828, 619746933, 617148514, 614453964, 610705261, 607096024, 605100403, 602651787, 601801491, 600552902, 598664398, 596111450, 593073845, 590174255, 586131477]
1085E86131477m352607o152459n414352n709915o136246o500168q379631r115028j2166710
1093.6E22204361j1946182j4508248j5948867j5624924j6073647j4618187j6713981
1100.4D16770325j4027405j4421463j3439255j4100342j5091819j2995453j4074784
1107.1C18619804j1459674j4548245j1093216j0673599j0639305p634659q194771l458557
1114.9B40917778n715199k611713k965031r90543R05075r24168K885933O13175L300018
1123.5B35415325J302395K869625L034725J335717L220958r9487K080784j864300k212467
1132.2B45083275m164963m494076k782955o316833l063660n571327k465325l126411
1139.9B13097725l095913k360706n536976k515087n875187l427601n648422m989796
$$ y = [586131477, 581778870, 575626411, 570212059, 564502144, 558365898, 551865730, 543486099, 534371071, 522204361, 510258179, 495749931, 479801064, 464176140, 448102493, 433484306, 416770325, 402742920, 388321457, 374882202, 360781860, 345690041, 332694588, 318619804, 307160130, 292611885, 281518669, 270845070, 260205765, 252571106, 244376335, 240917778, 235202579, 232590866, 229625835, 228635292, 229540367, 228616199, 231502132, 232115307, 235415325, 236717720, 239587345, 242622070, 243957787, 247178745, 247079258, 249160042, 247295742, 245083275, 240918312, 236424236, 233641281, 227324448, 224260788, 218689461, 216224136, 213097725, 210001812, 207641106, 202104130, 199589043, 193713856, 190286255, 184637833, 179648037]
1147.6A79648037m084759n193062j600322m730168o29329k156601m44737o06994p05414
1156.3A59496651K483253o04057L283920P88994L142376K207203K853889N454064L326473
1165A82432766P464619N175819Q527603O692181P781925R775639P927074J1252632
1172.7B47030258Q799706J2059173J0631695J1843281J2362175J0929394J2821521
1179.5C26477203J0569802J2823524J0669823J1640434J0988808R529419J0135269
1186.2D02834282Q662720J0739708Q290443Q527412P442399P462882Q183594O800041
1193.9D68943481P887536O503868Q643837Q206253P795334Q065719Q398094R258538
1201.6E33702660P346458Q638458P553940P198753O806450N917054N737609M504395
$$ y = [179648037, 175563278, 170370216, 168769894, 164039726, 163410397, 161253796, 160809059, 160202065, 159496651, 161979904, 161375847, 164659767, 165448761, 168591137, 170798340, 173652229, 179106293, 182432766, 189897385, 195073204, 203600807, 210292988, 218074913, 227850552, 235777626, 247030258, 255829964, 267889137, 278520832, 290364113, 302726288, 313655682, 326477203, 337047005, 349870529, 360540352, 372180786, 383169594, 392699013, 402834282, 411497002, 422236710, 430527153, 439054565, 446496964, 453959846, 462143440, 468943481, 476831017, 483334885, 491978722, 500184975, 507980309, 516046028, 524444122, 533702660, 541049118, 549687576, 557241516, 564440269, 571246719, 577163773, 582901382, 587405777]
1209.4E87405777N699120N153121N246506N237732N349426N437584M587365M358406
1217.1F28475037K900276L009796K323341K118912J982422J172638J828461J490249
1224.8F45301132K173233J951752J791077K115326J591568J277084R00497R72138L72619
1233.5F58446426O37055O21719R66492J491775J313172K026748J538392J197815R91058
1242.2F69230652J184921J77841p48367J90887K80991J082306L39203N76706J319580
1250.8F73634720N08575Q59375Q49381J296768O29730L2196k04162j36414N78384N2720
1260.5F78101273R22317J268005J287766J127243J276398J545334M00314M87366M16412
1269.2F86832428N77774P76749R23538J304321J402359J817703J413193J973953J929093
$$ y = [587405777, 593104897, 598258018, 603504524, 608742256, 614091682, 619529266, 624116631, 628475037, 631375313, 634385109, 636708450, 638827362, 640809784, 641982422, 643810883, 645301132, 647474365, 649426117, 651217194, 653332520, 654924088, 656201172, 657101669, 658073807, 658446426, 659083481, 659705200, 660671692, 662163467, 663476639, 665503387, 667041779, 668239594, 669230652, 670415573, 670593414, 669845047, 670035934, 670316925, 671399231, 671738434, 672315140, 673634720, 674143295, 675002670, 675852051, 677148819, 677778549, 677810745, 677606583, 677470169, 678048553, 678101273, 679023590, 680291595, 681579361, 682706604, 683983002, 685528336, 685928650, 686416016, 686832428, 687410202, 688186951, 689110489, 690414810, 691817169, 693634872, 695048065, 697022018, 698951111]
1277.8F98951111J086273Q27255Q09479J203766J078033J248703J007004J294174J863251
1286.5G09369049J817322J965408J413651J253814Q17490K36969O34537R90982J114425
1295.2G19613647J000290J088562J101914J256943J246185O74896R44367J019897K33994
1303.9G28180695m1886K18506L42941K24457O99692Q81576P11670Q75092N0888l81622
1313.5G31762009O59332R61685K42005j85700O67267R00192J52130L87116K83813N31159
1323.2G36361008J250839P45621M96673N90439K73666r0866l0594L39509K33383J45111
1332.8G40314789k97318J28861N83114r5672N7068m94843q58230J08642Q09479N32379
1342.4G40788269j60141M9210r4986P5912J50604j20239k30179k62069K23388o45981
$$ y = [698951111, 700037384, 700864639, 701674118, 702877884, 703955917, 705204620, 706211624, 707505798, 709369049, 711186371, 713151779, 714565430, 715819244, 716636734, 716873703, 717508240, 718499222, 719613647, 720613937, 721702499, 722804413, 724061356, 725307541, 725982437, 726926804, 727946701, 728180695, 728138809, 728357315, 728700256, 728924713, 729624405, 730505981, 731217651, 732092743, 732143631, 731762009, 732421341, 733383026, 733625031, 733439331, 734106598, 735006790, 735158920, 735546036, 735829849, 736361008, 737611847, 738357468, 738854141, 739444580, 739718246, 739627380, 739596786, 739936295, 740169678, 740314789, 740017471, 740146332, 740729446, 740633774, 740690842, 740195999, 739337769, 739446411, 740255890, 740788269, 740628128, 740677338, 740582352, 740658264, 740808868, 740688629, 740458450, 740196381, 740419769, 739773788]
1352.1G39773788m86526j04904l98789K12250Q6441K74048K08054j32142q04138p18918
1361.7G37909164o62689j448898Q44574M02679m50439l21198q25805N340K73285l99856
1371.4G35326157p16935j081543j721496n48096P6599p18078p76291k12631J22909
1380.1G29750595Q392o35299j400681r49554M16412J218186K57644p97500J103363
1388.7G28971558J190719K43530K2584N96160N11475j466675j587601K06299J63651
1397.4G28851700n21393k173767l80249R27200o2408m96445m73709j335449N29327
1406.1G24864807R07974j78909k30026o59256q42972r90753m64172L63388K58483M35334
1415.7G23463898k05460J75934R87549k385178K92664J690216L33557j057358j435776
$$ y = [739773788, 739287262, 739182358, 738783569, 738995819, 739082260, 739356308, 739564362, 739432220, 738628082, 737909164, 737246475, 735797577, 736642151, 737044830, 736594391, 736273193, 735447388, 735452728, 735726013, 735326157, 734609222, 733527679, 731806183, 731258087, 731334686, 730616608, 729840317, 729627686, 729750595, 729758987, 729123688, 727723007, 726773453, 727189865, 728408051, 728665695, 727868195, 728971558, 730162277, 730405807, 730428391, 731024551, 731536026, 730069351, 728481750, 728688049, 728851700, 728330307, 726156540, 725776291, 726703491, 726641083, 726144638, 725670929, 724335480, 724864807, 725772781, 725593872, 725363846, 724704590, 723861618, 722870865, 722406693, 722770081, 723028564, 723463898, 723258438, 723434372, 724421921, 722036743, 722329407, 724019623, 724353180, 723295822, 721860046]
1424.4G21860046J426850J884689P34634R58252L63999k81754J432801R98153Q7128
1433.1G29464798K21558P42797K4567l019485J459121K690430J678467R73434O53000
1441.8G34888687N31159O51092m1733j52511M16183l37524j249542N86929J218796
1450.5G36511536L33404O05087J759720J136856l11050j236572k680817q13751J742630
1459.1G37047043J545563J793747J040573J214523J515198j101074J139526K367630
1466.8G46562729J073151K51693M56543J064606r06601k068253K193528K977981J974945
1475.5G53580322J013336K442322J921616J006317P44095m82941m18854L2578q6441
1484.2G59752350J99890P21664l4713m2267J772232j463699o88706K364731R84573
$$ y = [721860046, 723286896, 725171585, 725906219, 726864471, 727228470, 726946716, 728379517, 729377670, 729464798, 729686356, 730429153, 730453720, 727434235, 728893356, 731583786, 733262253, 734235687, 734888687, 735419846, 736070938, 736029205, 735876694, 736292877, 735955353, 734705811, 735292740, 736511536, 736844940, 737450027, 739209747, 740346603, 740035553, 738798981, 736118164, 735304413, 737047043, 738592606, 740386353, 741426926, 742641449, 744156647, 743055573, 744195099, 746562729, 747635880, 747887573, 748344116, 749408722, 748502121, 746433868, 748627396, 751605377, 753580322, 754593658, 757035980, 758957596, 759963913, 760708008, 760225067, 759806213, 759838791, 759752350, 759952240, 760673904, 760639191, 760596924, 762369156, 760905457, 760216751, 762581482, 763566055]
1492.9G63566055p19223j123657j189957m728927J469803O8359q78220K045288K91520
1501.6G58801041J0757L08304N22766p96280p980804n129929j43356J799316N70908
1510.2G47962723J464615m03824l44544J226044J82343j81122m494629k346344K301712
1518.9G45366974J79596n231171m627685K425460K840348K019806j567383Q08029J069183
1527.6G43283157j525192l65677m66156j581344j785813k371063l020782K152404J740036
1536.3G36059570N65338O13556m595108m016647J824417J390991r56726M09928r88465
1545G30306854k368088K003174J023407N46418j220093K90985L388901J404953J21078
1553.6G35497589l720245q8730K101517J274261k64511j2585068N928345M825287L437042
$$ y = [763566055, 762846832, 761723175, 760533218, 755804291, 757274094, 757342453, 756464233, 758509521, 758801041, 758811798, 759120102, 759642868, 758846588, 750865784, 745735855, 745592499, 747391815, 747962723, 749427338, 749023514, 748678970, 749905014, 750087357, 749906235, 745411606, 743065262, 745366974, 745546570, 740315399, 735687714, 738113174, 740953522, 742973328, 741405945, 742213974, 743283157, 741757965, 741392288, 740926132, 739344788, 737558975, 735187912, 732167130, 734319534, 736059570, 736624908, 737238464, 732643356, 728626709, 730451126, 731842117, 730885391, 731295319, 730306854, 727938766, 729941940, 730965347, 731511765, 730291672, 730582657, 733971558, 735376511, 735497589, 731777344, 731688614, 733790131, 735064392, 734799881, 722214813, 728143158, 732968445, 736405487]
1562.3G36405487K376404R26971j405334m41284N91430o09512j336441n340653K364502
1571G33531570K552338N13840M29916L17383l15399o418381J957626J231385j159668
1579.7G32640610j694184k125167p54319j186447n50308o75507j43432L5858j364288
1588.4G24182816j009293k157974k062989k705154j580200k133408k984466j000367
1596.1G08548965j396102K7847q16498n68695j631165k410965j753234l349228j816483
1604.7F94834442k263489j981125k884750r85870l36151j696244N1728j779480q74100
1613.4F82084961k136002j134567j570053r921646J465912m26102l43857j424255J99127
1622.1F66793518o99692l776169J002808o62918l27682m046250k455215p11289j480408
$$ y = [736405487, 738781891, 739708862, 738303528, 737862244, 738453674, 737844162, 736507721, 731167068, 733531570, 736083908, 736597748, 737027664, 737345047, 737029648, 730611267, 732568893, 733800278, 732640610, 730946426, 728821259, 728066940, 726880493, 726330185, 725654678, 725511246, 725547104, 724182816, 723173523, 721015549, 718952560, 716247406, 714667206, 712533798, 709549332, 708548965, 707152863, 707180710, 706364212, 705795517, 704164352, 701753387, 700000153, 696650925, 694834442, 692570953, 690589828, 687705078, 686719208, 686383057, 684686813, 684738541, 682959061, 682084961, 679948959, 678814392, 677244339, 667322693, 668788605, 668362503, 668018646, 666594391, 666793518, 666093826, 662317657, 663320465, 662657547, 662329865, 658283615, 655828400, 655117111, 653636703]
1630.8F53636703o90383j373215Q40912m30832k408753j008072J692963Q89130l88794
1639.5F50759659J11999j391296J24359p40280R11865O60019j934280J467361k55051
1648.1F49714355M277726J367950J695023J475296m418335n361634K386170N253067
1655.9F56389618K167740K457275K079621K231140K073517J020278M63868m72947K596436
1664.5F71006546J303253J685639J745987M43420L56216K494202M045410J593399L402024
1673.2F88076096L002166l2653n50004K255631K422180P85065J623764J579742L208695
1681.9G02370682L068847k458038M84467N608978M821167J556854J025162J801224
1689.6G18279343O09893K662354K549286K432861K678452K745590n02091L823548M992523
$$ y = [653636703, 652946320, 651573105, 652414017, 651983185, 649574432, 648566360, 650259323, 651148453, 650759659, 650871658, 649480362, 649604721, 648864441, 649776306, 650436325, 648502045, 649969406, 649714355, 653992081, 655360031, 657055054, 658530350, 654112015, 648750381, 651136551, 656389618, 658557358, 661014633, 663094254, 665325394, 667398911, 668419189, 668883057, 668410110, 671006546, 672309799, 673995438, 675741425, 676184845, 676541061, 679035263, 683080673, 684674072, 688076096, 691078262, 691045609, 690495605, 692751236, 695173416, 695958481, 697582245, 699161987, 702370682, 705439529, 702981491, 703465958, 709074936, 713896103, 715452957, 716478119, 718279343, 718889236, 721551590, 724100876, 726533737, 729212189, 731957779, 731455688, 735279236, 740271759]
1698.3G40271759M448395P89795o151734N413514L430709J856919J478805K050400
1706G53588562J929398K827530L627853J408234O17294J720123J211701P32193j528550
1714.7G66134338j408004J532974R55887k628784L770217L670731J948624R77630m72641
1723.4G74480972o46667K13470m6463l22189M19922J636658j99814L13034K629471
1732G78478394K305603j126099m202423L131866K187424M32358Q57925j554031r75495
1740.7G79535522L223801J899567o10199J395874K676468J313324M77600j25275j1673
1749.4G89775009K112580j139222k32925L662414K208863J363754R32617l29590J735382
1758.1H00088882J719666O39343J57624k620545J04218J976699R47876R24530J235886
$$ y = [740271759, 744720154, 745509949, 739358215, 744771729, 748202438, 750059357, 751538162, 753588562, 755517960, 758345490, 761973343, 763381577, 763998871, 765718994, 766930695, 767662888, 766134338, 764726334, 766259308, 767215195, 764586411, 768356628, 772027359, 773975983, 774953613, 774480972, 773834305, 774047775, 774001312, 773679123, 774099045, 775735703, 775535889, 775848923, 778478394, 780783997, 779657898, 775455475, 778587341, 780774765, 781207123, 782065048, 780511017, 779535522, 782759323, 784658890, 784048691, 785444565, 788121033, 789434357, 789911957, 789786682, 789775009, 791887589, 790748367, 790515442, 794177856, 796386719, 797750473, 798683090, 798353500, 800088882, 801808548, 802447891, 802605515, 799984970, 800089188, 802065887, 803013763, 803938293, 805174179]
1766.8H05174179l6774j453704K544784K353211j759263l500061k136K748184N13306
1775.4H06581726r06677J038971P26089J278610N06058k78396R54589R05304M49067
1784.1H11255341j247025p88879P20138K98157J45187M52500j37787k71759r05762
1792.8H09520111J237030K363510J02005j065826L33938P24030r22699j172867J194611
1801.5H12313843p0877N33600J288909N35584N91431m02451m77982O90842k24228k015991
1811.1H12762680l2577R69848O27594P26776L73841N83572J79901L19824k8152p80945
1820.8H15702362J83106l03879N3863q3618j847610J083603J923141R21402j184464
1829.4H16447906k005767J904602J132736n79758k44980j10702J14212k62680M8675
$$ y = [805174179, 805137405, 803683701, 806228485, 808581696, 806822433, 803322372, 803320236, 806068420, 806581726, 805675049, 806714020, 807440109, 808718719, 809224777, 808946381, 809900970, 810806274, 811255341, 810008316, 809219437, 809939575, 810237732, 810382919, 810835419, 810697632, 810425873, 809520111, 810757141, 813120651, 813222656, 812156830, 812490768, 813214798, 812292099, 811119232, 812313843, 812242966, 812776566, 814065475, 814601059, 815192490, 814790039, 814312057, 815002899, 814778671, 812762680, 812730103, 813699951, 814327545, 815054321, 815428162, 816011734, 816191635, 816511459, 816483307, 815702362, 815885468, 815581589, 815635452, 815551834, 813704224, 814787827, 816710968, 817632370, 816447906, 814442139, 816346741, 817479477, 816899719, 816654739, 816544037, 816658249, 816395569, 816444244]
1838.1H16444244J333008O95725M73251r4681P2785n38788l571549J380387J280670
1846.8H17475052p31430k84195P42950M99726N20095J027527K53067J26038j34354
1855.5H19494476m11453l20511p09457l45383k93121j908L00446Q42895R82285O17218
1865.1H20155487N62820m01535p67669j698837j006089O36444L11661R5139K22473
1873.8H18109894O55365O01654N92575L80478L29132L738m96826l11127q90579l34472
1883.4H18639832l1891l40729N1575O79168J425248j96763q40683R47342M43421k46430
1893.1H20530090n30700j253510q02765M74777M09317M97284N55039M84466M39682
1901.8H20803680M3717k0371m76455l91846l60870p12738n83573l55835K14615P84302
$$ y = [816444244, 817777252, 818472977, 818946228, 818851547, 818924332, 818385544, 814813995, 816194382, 817475052, 816743622, 816459427, 817202377, 817702103, 818222198, 819249725, 819502792, 819628830, 819494476, 819083023, 818762512, 818053055, 817707672, 817414551, 817412643, 817713089, 818555984, 819538269, 820155487, 820718307, 820316772, 819549103, 817850266, 816844177, 817480621, 817792282, 817887421, 818109894, 818765259, 819366913, 819959488, 820339966, 820669098, 820672836, 820176010, 819864883, 818974304, 818639832, 818607941, 818267212, 818318787, 818997955, 820423203, 820226440, 819385757, 820333099, 820776520, 820530090, 819999390, 818745880, 817943115, 818417892, 818827209, 819324493, 819879532, 820363998, 820803680, 820847397, 820827026, 820350571, 819958725, 819597855, 818885117, 818301544, 817945709, 818160324, 818944626]
1911.4H18944626J047592L57742J53580O6757j91650j56861j974792o65741O30493
1920.1H18211746L02353L14560n02777K66724J095581O11724r6664j19476L8604n32226
1929.7H19590149r22241m21677J58157j8539N8823J95007M00772N34592Q9645j42288
1939.4H19522400j21918K22473q40683j652908J57623J24207j77918M73023P88421
1948.1H18494720O52848L80630j65558j82876k60773n66788k19574m32434n09109q3313
1957.7H17107773J98059L44620L91464O50024M96903J00708n07508n64804o16302j119614
1967.3H16481323k19574K48032J69830K49863L50723P17850N44052R3307k37579m90646
1977H17907181n37720n67932o14090k83585m8980l5477K43607M73709N97381K35291
$$ y = [818944626, 819992218, 820349960, 820503540, 820570297, 820378647, 820221786, 818246994, 817581253, 818211746, 818514099, 818828659, 818325882, 818592606, 819688187, 820299911, 820203247, 820083771, 820122375, 819590149, 818667908, 818246231, 818404388, 818385849, 818444672, 818639679, 819040451, 819575043, 819664688, 819522400, 819400482, 819622955, 818782272, 817129364, 817286987, 817411194, 817233276, 817706299, 818494720, 819147568, 819528198, 819362640, 819179764, 818918991, 818352203, 818132629, 817700195, 817191086, 817107773, 817305832, 817650452, 818041916, 818691940, 819188843, 819289551, 818782043, 818217239, 817600937, 816481323, 816261749, 816509781, 816679611, 816929474, 817280197, 817998047, 818542099, 818635406, 818397827, 817907181, 817369461, 816801529, 816187439, 815903854, 815854874, 815819397, 816063004, 816536713, 817134094, 817369385]
1986.6H17369385l40424p37762m89884R5368l79563q74481j4572N19180O27747P67593
1996.3H16542587L57590O9122K80838k74429m35562n91660j065979l63464M501k86560
2005.9H14236984J36719N09796M38461M95072M65546Q3618m43573n36042l99627n06974
2015.6H14479980p13043n60531J78070L70254M29688N89752M44946K62299j32675k46048
2025.2H15102692o70853q62427l83911k70462j24741P5303N48553N01022K26365L77426
2034.9H14518967L15780K07215m18854q50525o88095o65817r64661n3024Q49457K19726
2044.5H12470169M46549O94351M31442Q7204n37643o17066q19168n82046m71344k73209
2054.1H10829239K61154L64685L94135J15585M39072L47519l46299n06515q24127q15201
$$ y = [817369385, 817028961, 816291199, 815801315, 815896683, 815517120, 814642639, 814628067, 815147247, 815774994, 816542587, 816900177, 816969299, 817250137, 816975708, 816540146, 815948486, 814882507, 814519043, 814523544, 814236984, 814373703, 814883499, 815321960, 815817032, 816282578, 816366196, 815922623, 815386581, 814986954, 814479980, 813766937, 813206406, 813384476, 813754730, 814184418, 814774170, 815219116, 815481415, 815348740, 815102692, 814431839, 813569412, 813185501, 812915039, 812790298, 812865601, 813414154, 813915176, 814141541, 814518967, 814834747, 815041962, 814623108, 813772583, 813084488, 812418671, 811454010, 811400986, 812250443, 812470169, 812916718, 813611069, 814042511, 814129715, 813592072, 812975006, 812155838, 811573792, 811102448, 810829239, 811090393, 811455078, 811849213, 811964798, 812403870, 812751389, 812405090, 811898575, 811074448, 810259247]
2063.8H10259247p43790o60934k15836M9591J71204J17645j35117p705j755l51105
2073.4H08481445o01959r89914p79266o95572p05719k74048m730N10788N86166L85971
2083.1H05913162l128l71322n0507l5019m43497o96716n52216l07846L6774K62756
2092.7H03752441P65458R00421J43661O3400J05820L32031k3880n45959j86920k28806
2102.4H05077667K31247K01874M04739R29261M91333O85272M85840o8207j55869p0266
2112H08212891n94483p44552L9215J32675L08227L51639M91257L21503j74714j10931
2121.6H08232727k77786j44043o29578q24890n48019n36118L4256R1171L84751N99746
2131.3H06382217K33536Q4076j00708k07977k66342j95313k77405l79104j59836L89404
$$ y = [810259247, 809515457, 808854523, 808638687, 808688278, 808859482, 808977127, 808842010, 808834305, 808832550, 808481445, 807879486, 806889572, 806110306, 805414734, 804709015, 804434967, 804430237, 804941025, 805527191, 805913162, 805910034, 805538712, 805488205, 805453186, 805009689, 804312973, 803760757, 803452911, 803489685, 803752441, 804517899, 805418320, 805561981, 805625381, 805731201, 806063232, 806039352, 805493393, 805306473, 805077667, 805308914, 805510788, 805915527, 806844788, 807336121, 808021393, 808507233, 808439026, 808283157, 808212891, 807618408, 806873856, 806913071, 807045746, 807353973, 807705612, 808196869, 808518372, 808343658, 808232727, 807954941, 807810898, 807181320, 806356430, 805808411, 805272293, 805306549, 805397720, 805782471, 806382217, 806615753, 806699829, 806599121, 806391144, 806124802, 805929489, 805652084, 805272980, 805113144, 805502548]
2140.9H05502548O28052N62286O31714N80826L48740l86658l02734j62583o88095l63464
2150.6H06350632P5607M88739M64020M58908Q16421L98255J1368p3243j87988m96597
2160.2H08306122p34863n55115o7291L11508K65579K01721M06876N82962L3798m35486
2169.9H08315811l86047n12619o37741p05109n84488k96554J0604K80381N11245K99302
2179.5H06294785K3956J73416q1100j94092j88904m92859m01840j55411M3411M35028
2189.1H05456390O54221O40335O33774L19519K49557L09983J02844m9057k72751j62430
2198.8H07882385k30102J98364R17053M15726N9280L20206L34702p9194j28707k12403
2208.4H09477310m08706O0729O8970j48468l7994L34472N76478N21011J27182k93884
$$ y = [805502548, 806130600, 806692886, 807324600, 807905426, 808254166, 807867508, 807564774, 807402191, 806714096, 806350632, 806426239, 806914978, 807378998, 807837906, 808654327, 809052582, 809063950, 808990707, 808802719, 808306122, 807571259, 807016144, 806948853, 807260361, 807525940, 807727661, 808134537, 808717499, 808751297, 808315811, 807929764, 807417145, 806779404, 806074295, 805489807, 805193253, 805203857, 805484238, 805995483, 806294785, 806318741, 806492157, 806411057, 806216965, 806028061, 805535202, 805133362, 804977951, 805021362, 805456390, 806110611, 806750946, 807384720, 807704239, 807953796, 808263779, 808366623, 808317566, 808044815, 807882385, 807652283, 807850647, 808767700, 809183426, 809242706, 809562912, 809897614, 809818420, 809689713, 809477310, 809068604, 809129333, 809198303, 809049835, 809011841, 809346313, 809922791, 810443802, 810570984, 810277100]
2218.1H10277100K16140P7134l48816l80783l93677R7198j09787k88696J65176N63889
2227.7H09874878O62002L76587K7619m32053n73120o58340o73523l93219l8758J04599
2237.4H08276672j17645R1324P48520Q48007L04642k1439n89065p98417k35137l48053
2247H08159409k10877o7291l891O57501O89926M29611R6055j38855J10015J97297m4709
2257.6H09874191n33294o78788l05099q5449J91421N10101K29188j27030M1885J41449
2267.3H09258575k31475k63215l7384k08892k03629R5215K45209O7978p8202k19192
2276.9H08424988K68097Q53576J03989l33633k47574j75476l78876n73959J33514Q9798
2286.5H08164444j09558K00043O31027M07562l42255j79901l30429j33896j55639o61393
$$ y = [810277100, 810493240, 810570374, 810221558, 809840775, 809447098, 809544296, 809434509, 809145813, 809310989, 809874878, 810536880, 810913467, 810941086, 810509033, 809935913, 809277573, 808604050, 808210831, 808172073, 808276672, 808159027, 808250351, 808998871, 809846878, 810151520, 810130081, 809541016, 808742599, 808507462, 808159409, 807948532, 807881241, 807877350, 808534851, 809224777, 809654388, 809750443, 809611588, 809721603, 809918900, 809874191, 809340897, 808662109, 808357010, 808271561, 808462982, 808973083, 809202271, 809075241, 809117126, 809258575, 809027100, 808763885, 808726501, 808517609, 808313980, 808409195, 808654404, 808722382, 808644180, 808424988, 808693085, 809546661, 809650650, 809317017, 809069443, 808893967, 808515091, 807941132, 808074646, 808164444, 808054886, 808254929, 808885956, 809293518, 808951263, 808771362, 808440933, 808307037, 808151398, 807490005]
2296.2H07490005j51977K65961M63791R6588l5096K41318M35257R6207n95169l36762
2305.8H07970123l87268n10101o31256o6529L04413m49218L0822J49842O34002K02713
2315.5H07247543r41620k88314j82114J62582j10931l45078r6359p91626l74679N9967
2325.1H04339371k36893N035J48163r77859j27793j3046p05643J538468J81885r88999
2334.8H03162689J85547j42212L94058J435395K94799k042922o70472J280899J304779
2343.4H05202560j58462j389771O9504P57904J478806J403656j46332j131134l59573
2352.1H05727158M52957q67539j246261K97775M70734j71433q03451m10157k39639
2360.8H03210144l60107N31616N13611n7602O54449Q16193K46048L31650K09503k34604
$$ y = [807490005, 807338028, 807603989, 808067780, 808164368, 808129272, 808370590, 808805847, 808902054, 808306885, 807970123, 807582855, 807072754, 806441498, 806374969, 806679382, 806230164, 806260986, 806410828, 807044830, 807247543, 806305923, 806017609, 805835495, 805998077, 805887146, 805542068, 805445709, 804654083, 804279404, 804339371, 804102478, 804107513, 804255676, 803277817, 803150024, 803136978, 802431335, 803969803, 804151688, 803162689, 803348236, 803206024, 803600082, 805035477, 805330276, 803287354, 802616882, 803897781, 805202560, 805044098, 803654327, 803723831, 804481735, 805960541, 807364197, 807217865, 806086731, 805727158, 806180115, 805312576, 804066315, 804364090, 804834824, 804663391, 803859940, 803449783, 803210144, 802850037, 803381653, 803895264, 803837662, 804492111, 805308304, 805554352, 805886002, 806095505, 805860901]
2370.4H05860901P28836J944351J77460q30994J20468J01548L12423j41067m48456
2379.1H07825470N68314O97097K04239q8882J01776L99780J9531L3417M55246L05176
2388.8H10521164j27716l60413j41220P8278M2114O5918j10321j59912J15356j6098
2398.4H09907150j30005J25275J49536J34506j67617n14832j89896k1820R8572J69296
2408.1H09560165L1968J37329Q2397l2272l11966j57318K61612j24588l14484j18179
2417.7H09014664k289p8049o0348J80969K11639P3471k69317n9510J92032j80053j21766
2428.3H08901443k60467m75769Q4534L16543M09317K63519m90570j09939J09558k85492
2438H08462677R3079j60904k26288J2665j22376R7733q1711k88544j23138R6206J53275
$$ y = [805860901, 806589737, 808534088, 808711548, 807880554, 808001022, 808102570, 808414993, 808273926, 807825470, 808393784, 809090881, 809295120, 809206238, 809308014, 809707794, 809727325, 809760742, 810215988, 810521164, 810393448, 810033035, 809891815, 809970093, 810012207, 810078125, 809967804, 809807892, 809923248, 809907150, 809777145, 809902420, 810051956, 810186462, 810018845, 809504013, 809314117, 809292297, 809390869, 809560165, 809592133, 809729462, 809811859, 809779587, 809467621, 809310303, 809571915, 809447327, 809132843, 809014664, 809012375, 808934326, 808873978, 809054947, 809266586, 809340057, 809070740, 809011230, 809203262, 809023209, 808901443, 808640976, 808165207, 808249741, 808566284, 808975601, 809239120, 808748550, 808638611, 808748169, 808462677, 808555756, 808394852, 808168564, 808181229, 808058853, 808156586, 808074875, 807786331, 807663193, 807759399, 807912674]
2448.6H07912674k7618k76185k51541M273j62430J12228J97754k29187J07041k8382
2458.2H07358627k03933M24499K00501m42734l62702m74090p35779j71127M03137k4567
2467.8H05971832L4409O91986M4632k36893K01111j45798l52859n25513j93176M44336
2477.5H05934067Q5678k06375j04523j73874k70843l98713n4245M39148K67334J44196
2487.1H05661850k07825n41610l11966l29667j75094J18255L73459Q8806j97219K54364
2496.8H04733353p4234l62244j3733j28097n18113P2632N73731k34375j37406J18408
2506.4H04029922j33056k45590m57154j8844K36587Q8425m19388n64346L6697N2185
2516.1H02605438J00785J58309k57644k77023J36337l7003k35901J90354J96457M730
$$ y = [807912674, 807885056, 807608871, 807357330, 807361603, 807199173, 807311401, 807509155, 807279968, 807387009, 807358627, 807154694, 807579193, 807779694, 807336960, 806974258, 806500168, 805764389, 805593262, 805996399, 805971832, 806006241, 806698227, 806742859, 806505966, 806707077, 806561279, 806208420, 805682907, 805489731, 805934067, 806019745, 805813370, 805708847, 805534973, 805264130, 804865417, 804811172, 805250320, 805517654, 805661850, 805454025, 804912415, 804600449, 804270782, 804095688, 804213943, 804587402, 804676208, 804478989, 804733353, 804659119, 804296875, 804283142, 804155045, 803636932, 803709564, 804283295, 804048920, 803911514, 804029922, 803896866, 803651276, 803194122, 803175278, 803411865, 803500290, 803080902, 802516556, 802553253, 802605438, 802706223, 802864532, 802606888, 802329865, 802466202, 802429199, 802193298, 802383652, 802580109, 802584839]
2525.7H02584839O027j27182l69949j97220K67868K0828m95605j91574K03247J42212
2535.4H01843491J02768l31879j20239K89688k81372l71704j08872J98135P3472j41831
2545H01151657k18582m83627J07422K53143J4572N6686l8223q0643l16391k32009Q9645
2555.6H00303650K20489k19192j95007K26821P859n7678m41590n86548o2027K59781
2565.2G99456558l7765j74866J44272j61514j79902j00936k0371J54495P2251P4234
2574.9G99226456m50058l79792o103p8659j16196l2043J77688J22376M17404q7738
2584.5G98793335q04901l37677k26288k71301r9106J04904J32370j77078k71073m1427
2594.2G96801758J3885L9215K26517j14975m09088l36685o638J05667m01535l77121
$$ y = [802584839, 802590866, 802463684, 802093735, 801896515, 802164383, 802185211, 801689606, 801498032, 801701279, 801843491, 801946259, 801614380, 801494141, 801783829, 801502457, 801130753, 801021881, 801220016, 801293488, 801151657, 800933075, 800449448, 800556870, 800810013, 800824585, 800881271, 800843048, 800762405, 800446014, 800214005, 800303650, 800524139, 800304947, 800109940, 800336761, 800344620, 800286942, 799845352, 799258804, 799196777, 799456558, 799418793, 799243927, 799388199, 799226685, 799046783, 798945847, 798925476, 799079971, 799152222, 799226456, 798776398, 798396606, 798390503, 798311844, 798195648, 798163605, 798341293, 798463669, 798881073, 798793335, 797988434, 797650757, 797424469, 797153168, 797054062, 797158966, 797291336, 797114258, 796843185, 796801758, 796815643, 796854858, 797081375, 796966400, 796557312, 796220627, 796213989, 796319656, 795918121, 795541000]
2603.8G95541000k31475j25351J66473J55640K00805p7057k94799J45034J20850j28403
2613.5G95472717n4702k59171k63062j53884o4469M2649l48969m17175m2649q2244
2623.1G93829041l34244k5101P1945j19018P2937j95389l13263k29340N341Q6975l37219
2633.7G92512665M4937k7237l86047q2779j35804k90603j10398N2796l08533k87857
2643.4G90981140Q8959J50986P400j78070p7057k78244l11508m9210k13699k88239
2653G89832458j22528k62451j22299K18201j37253J11923J62888m78134k67029n8289
2662.6G88877487j00555l0747K01493k13929n82962K14920J31607m98046m05884k02790
2672.3G87390594K26288L64685k95333k61231K5559l06855p0495K17285K13013o21567
$$ y = [795541000, 795309525, 795184174, 795350647, 795506287, 795707092, 795630035, 795335236, 795480270, 795601120, 795472717, 795418015, 795158844, 794895782, 794741898, 794677429, 794720078, 794371109, 793953934, 793911285, 793829041, 793494797, 793469696, 793541641, 793422623, 793495560, 793300171, 792986908, 792757568, 792762909, 792849884, 792512665, 792557602, 792530365, 792144318, 792061539, 791925735, 791635132, 791524734, 791577530, 791268997, 790981140, 791070099, 791221085, 791228485, 791050415, 790973358, 790695114, 790383606, 790334396, 790120697, 789832458, 789709930, 789447479, 789325180, 789543381, 789406128, 789518051, 789680939, 789202805, 788935776, 788877487, 788776932, 788746185, 788947678, 788733749, 788150787, 788365707, 788497314, 787999268, 787593384, 787390594, 787616882, 787981567, 787686234, 787425003, 787450562, 787143707, 787073212, 787290497, 787503510, 786881943]
2681.9G86881943j095276l3569K93197K0218m0436L27912J75933m85992m33350l95202
2691.6G85215378J0147j35269k97928K7389l20053j68152K1744J44348J30616j60141
2701.2G84468079M959q8120l97110k03781J87073n1499k37960l09220k41241j08948
2710.9G83022232m81262j373M3869j37711N06210k10800p78274j21155Q1329m37469
2720.5G81485596n22995K66952L41110N3406m0512m82101l56598j91651l51486k23083
2730.2G79978638k71530l09296k10877N1194J45340q0185M4326M9134j70059l37830
2739.8G78888855k65884j27106l67813l69644K594L75671O13174M65088m71649q39996
2749.4G77903290j16883k48413n85327j48391J80053j79748l39356J55792K32392j39847
$$ y = [786881943, 785786667, 785753098, 786046295, 786066513, 786026077, 786353989, 786529922, 786043930, 785610580, 785215378, 785225525, 785090256, 784792328, 784819717, 784499664, 784331512, 784353256, 784497604, 784628220, 784468079, 784473038, 784384918, 783987808, 783784027, 783971100, 783919601, 783681641, 783372421, 783131180, 783022232, 782540970, 782539597, 782583466, 782445755, 782951965, 782741165, 781962891, 781841736, 781923065, 781485596, 780962601, 781229553, 781570663, 781624069, 781583557, 781101456, 780744858, 780553207, 780201721, 779978638, 779707108, 779397812, 779186935, 779238129, 779383469, 779303284, 779347610, 779396744, 779226685, 778888855, 778622971, 778495865, 778128052, 777758408, 777761002, 778136673, 778749847, 779214935, 778743286, 777903290, 777786407, 777537994, 776952667, 776804276, 776984329, 776804581, 776465225, 776621017, 776853409, 776713562]
2759.1G76713562l37601R4452j10779m53872o1798m61884n30395k50092r4376o3324
2768.7G74443893k22396J96075q9722l11126M8065k7237k62756m47464l71857l05023
2778.4G72650452R7656N6915m31518k99378n4397J19705j70517j88217j88752o98928
2788G70893021n14222l20358m16870m66690n1498O32553L47747k17056m12979j69067
2797.7G69304581k61689q30001m06495k37503n42602m00925m17328k30331j26648Q4991
2807.3G65936050K42463k20948m88510n63736l89404l38364m20227j87683k0141j40229
2816.9G63409271n88455n65720j30767q1787k59858j36184l36762n60379m9820m42047
2826.6G60257492o33087l43933m89731j984j25656l64456k68021m33502l95660m96826
$$ y = [776713562, 776375961, 776470413, 776359634, 775905762, 775843964, 775382080, 774851685, 774601593, 774507217, 774443893, 774221497, 774417572, 774327850, 774016724, 774064789, 774037552, 773774796, 773327332, 772955475, 772650452, 772748108, 772805023, 772373505, 772074127, 772019730, 772139435, 771968918, 771780701, 771591949, 770893021, 770378799, 770058441, 769641571, 769174881, 769123383, 769755936, 770103683, 769886627, 769473648, 769304581, 769042892, 768212891, 767806396, 767568893, 767026291, 766625366, 766208038, 765977707, 765851059, 765936050, 766178513, 765957565, 765469055, 764905319, 764515915, 764177551, 763757324, 763569641, 763549500, 763409271, 762820816, 762255096, 762124329, 762042542, 761782684, 761646500, 761309738, 760749359, 760699539, 760257492, 759624405, 759280472, 758790741, 758788757, 758663101, 758298645, 758030624, 757597122, 757201462, 756704636]
2836.2G56704636n59082o76804p08923q97141q36944l23334m49906r06524j495896
2844.9G49850082j464614q76313o82144q52051j280975j082001o07605n37262k71911
2853.6G42195206l07007m34494J98059N8594o0425O06155k38876n17578L9902p17698
2863.2G40821838q07418K4261L00369j98974q76541r89762m04663l2120l18679n63126
2872.9G36955185o78253o10504n95246l00522n2719m23202l30277k31933j93405R536
2882.5G33548660l79028m60739l85666q11691k50321K58332n58091q61740p84607l06930
2892.2G29008179Q8424k46811j48239n34439p45544o85654q67462m83246n61371n10483
2901.8G24313354k02178k92969n44510m95606n0811l48893m90036k91290n58472m45785
$$ y = [756704636, 756145554, 755468750, 754759827, 753862686, 753025742, 752702408, 752252502, 751345978, 749850082, 748385468, 747509155, 746827011, 745974960, 744693985, 743611984, 743004379, 742467117, 742195206, 741888199, 741453705, 741651764, 741710358, 741649933, 742256088, 742017212, 741499634, 741539536, 740821838, 740014420, 740038681, 740339050, 740140076, 739263535, 738273773, 737869110, 737836990, 737518311, 736955185, 736276932, 735666428, 735071182, 734770660, 734717941, 734294739, 733964462, 733732529, 733539124, 733548660, 733169632, 732708893, 732323227, 731511536, 731261215, 731519547, 730961456, 730099716, 729315109, 729008179, 729096603, 728849792, 728701553, 728167114, 727421570, 726735916, 725868454, 725385208, 724823837, 724313354, 724111176, 723818207, 723273697, 722778091, 722727280, 722378387, 721888351, 721597061, 721038589, 720592804]
2911.4G20592804k44675p03659r25140p22504p84302n70297r12552j230316o55746
2920.1G13843613m38843K24686o3401q27102J51977J23749p58667p23877l01132N69000
2929.8G11800003Q97903K900o43311j13296O95648P00912K23084J31531M4403r7886
2939.4G13641891N25589P71943J05667K8076J68075L50266M31213j96151j51596J9989
2949.1G15694962m17328n38788l90701q9798O103k50473n31845n85709l9749Q43048
2958.7G13699722L53699m57306J29013k13013n55877K73056M20837J27640j6022M94309
2968.3G14256058Q87222L19519L3646N48553Q21533O42014M59900K42767L77274L16086
2978G18904572K88620M17861K67945K67257Q8959K80991M60434N16281M48608M6006
$$ y = [720592804, 720348129, 719644470, 718719330, 717996826, 717212524, 716642227, 715729675, 714499359, 713843613, 713404770, 713629456, 713566055, 712738953, 712890930, 713014679, 712256012, 711532135, 711231003, 711800003, 712697906, 712700806, 712057495, 711944199, 712639847, 713340759, 713563843, 713695374, 713739777, 713641891, 714167480, 714939423, 715045090, 715073166, 715241241, 715591507, 716022720, 715826569, 715674973, 715694962, 715277634, 714738846, 714348145, 714258347, 714264450, 714013977, 713482132, 712896423, 712856674, 713699722, 714053421, 713596115, 713725128, 713512115, 712956238, 713229294, 713650131, 713777771, 713761749, 714256058, 715143280, 715462799, 715496445, 716044998, 716866531, 717508545, 717968445, 718211212, 718588486, 718904572, 719193192, 719611053, 719878998, 720146255, 720235214, 720516205, 720976639, 721492920, 721941528, 721987534]
2987.6G21987534K43530J72577M27551N56717r232J3657k56577k4185O01044M42276
2997.3G24154892Q1940m82254n45884j28021j87454j18408J93939J36948J03988k51999
3006.9G22957687n09872P2174M5090k96326J86768J84555n50995o58264l70179L5401
3016.6G21096039K82364N1651j29471l90396m52347l32794l91846k08893q4991m92325
3026.2G18946991p69653m89807k83356r690k79159o00281L1510j04676n00107m18701
3035.9G15523071l81241m71344n70449l37448k13547j86157k16065k66113m30680j45187
3045.5G12304840R3002m65164l49426o96411r64508j99738p63j54037n81970n85022
3055.1G08400803n88684p47529k41851o2180o8664k63138m42047j84784k64893o22635
$$ y = [721987534, 722231064, 722403641, 722831192, 723387909, 723378677, 723392334, 723135757, 723111572, 723712616, 724154892, 724236832, 723754578, 723208694, 723080673, 722893219, 722774811, 722968750, 723105698, 723209686, 722957687, 722447815, 722519989, 722565079, 722268753, 722455521, 722640076, 722089081, 721430817, 721060638, 721096039, 721378403, 721430054, 721300583, 720910187, 720457840, 720125046, 719733200, 719524307, 719439316, 718946991, 718177338, 717687531, 717404175, 717394485, 717115326, 716515045, 716546555, 716441879, 715941772, 715523071, 715141830, 714670486, 714100037, 713762589, 713549042, 713362885, 713146820, 712880707, 712450027, 712304840, 712397842, 711932678, 711583252, 710886841, 709922333, 709722595, 709721832, 709567795, 708985825, 708400803, 707812119, 707064590, 706822739, 706760559, 706691895, 706428757, 705986710, 705801926, 705537033, 704914398]
3064.8G04914398l62778j22146k69470k89231o93741n75714P8888J5488m01688o24084
3074.4G01669922l02124l9749k28653m57764m45404l22571k19879k12021l49197l44315
3084.1F98748245o32705p06254l87344l28216k89154l26539l09219k50091m273J03378
3093.7F95617828m06875p59278n78765l13492l34397n45272q29773o23475k23846p9880
3103.4F90922775p2098l61099k85339n9281j35574n02853p35932n19714k48566l32718
3113F87669601o95800l59955o75659q99964o5460l53622m93164l83072m26483o61164
3122.6F82655258j007614j31149j0529n40390p71103p18460k19040m77752m40445j72882
3132.3F78165894o19278p41120m65011k29340l23105m33655l94973n12772m83093l64914
$$ y = [704914398, 704551620, 704429474, 704160004, 703870773, 703177032, 702601318, 702680206, 702695694, 702294006, 701669922, 701367798, 701328049, 701099396, 700641632, 700196228, 699873657, 699653778, 699441757, 699092560, 698748245, 698115540, 697409286, 697021942, 696693726, 696404572, 696078033, 695768814, 695518723, 695514450, 695617828, 695210953, 694451675, 693872910, 693559418, 693225021, 692679749, 691849976, 691226501, 691002655, 690922775, 690850677, 690489578, 690204239, 690144958, 690009384, 689506531, 688770599, 688250885, 688002319, 687669601, 686973801, 686613846, 685938187, 685038223, 684972763, 684619141, 684125977, 683742905, 683316422, 682655258, 681647644, 681516495, 681505966, 680965576, 680194473, 679476013, 679256973, 678779221, 678338776, 678165894, 677546616, 676805496, 676340485, 676111145, 675788040, 675354385, 674959412, 674446640, 673963547, 673598633]
3141.9F73598633n03998j038513r08966j6632n29862j086807n08270n19715m17404
3150.6F68068466l19443m62265m73632p57142m73709m82177j085816p49359l02505
3159.3F62962418n66788p99561o80313l21426l60260n20477l90320o11267p42722p66754
3168.9F57202530n49011j97068m36096q73794q82950n44129j158905q53958J69144
3177.6F51875763m13208n06897l50113m51965o92139o97937m75769j060867q40988
3186.3F46385880l98255j80817l89175r21097r09042r06525n43136o71234m94843j88522
3195.9F40783234m39148n91393q83255l55491n12085p43752m05426q39767j032525
3204.6F34980392p63397m92859n16815l47938p76444p78427j19057m37355m80690q05206
$$ y = [673598633, 673094635, 672056122, 671147156, 671130524, 670600662, 669513855, 669005585, 668485870, 668068466, 667749023, 667286758, 666813126, 666055984, 665582275, 665100098, 664014282, 663264923, 662962418, 662395630, 661596069, 660915756, 660594330, 660234070, 659713593, 659323273, 658712006, 657969284, 657202530, 656653519, 656456451, 656020355, 655146561, 654263611, 653719482, 652560577, 651706619, 651875763, 651462555, 650955658, 650605545, 650153580, 649461441, 648763504, 648287735, 647226868, 646385880, 645987625, 645806808, 645417633, 644496536, 643587494, 642680969, 642137833, 641466599, 640971756, 640783234, 640344086, 639752693, 638869438, 638513947, 638001862, 637258110, 636852684, 636012917, 634980392, 634216995, 633724136, 633207321, 632859383, 632082939, 631304512, 631185455, 630748100, 630267410, 629462204]
3214.3F29462204p11899m19578m52004k25677m07639l09601q85811r80873l39012l21655
3223.9F24408455n32112j036988o94389l73154n51910p82623p70035j23215k04086
3232.6F19339943l86276l86429o24542o74172p81135o27900m35638p76558p09839l69110
3242.2F13568344l84521l58429m07448j86920n09720p21359l48664o95266m94462l82499
3251.9F09079056n47409m09661m13475l59878o93703n71594n30052p04918l35007j36299
3261.5F04377060n07164q51517m18052j18714l10707o79245l71170l11394o25000j21803
3271.2F00062294n34058p42454m92401j74027q8615q32977k28577j69029o94580m33159
3280.8E95672417p65572j051292n33791o5651l72734k03476j71852k44789k251n09910
$$ y = [629462204, 628750305, 628330727, 627878723, 627653046, 627245407, 626935806, 626049995, 625069122, 624730110, 624408455, 623876343, 622839355, 622144966, 621771812, 621219902, 620437279, 619667244, 619544029, 619339943, 618953667, 618567238, 617942696, 617268524, 616487389, 615859489, 615423851, 614647293, 613937454, 613568344, 613183823, 612825394, 612417946, 612231026, 611721306, 610999947, 610651283, 609956017, 609461555, 609079056, 608531647, 608121986, 607708511, 607348633, 606654930, 606083336, 605553284, 604848366, 604513359, 604377060, 603869896, 603018379, 602600327, 602481613, 602170906, 601491661, 601120491, 600809097, 600184097, 600062294, 599528236, 598785782, 598293381, 598119354, 598030739, 597197762, 596969185, 596800156, 596105576, 595672417, 594906845, 593855553, 593321762, 593256111, 592883377, 592679901, 592508049, 592263260, 592261009, 591751099]
3290.4E91751099o74019n81780m09431k03705l86505o70738o86188m77753p47337o59638
3300.1E86254005l44047k92282k9145q0604n12886m13704l40652q27637m30298Q5754
3309.7E83068504k59285q72573j168252o24771k04849l59573p56111o30722l89214
3318.4E77803154n65872o04439n94940m96636n76896k39601p9308n32036n89676q00018
3328.1E72723732q50105n70031n13687p01942m29268j90544p00455m76265j49841m73976
3337.7E67667618l31993m52919j099701q74977o01044p86171p10640r60693q12416
3346.4E61037064m81453n79605m68712k97814l73077o66847n02777k50435l23983r32273
3356E56160088j086121m80499o01616n49278p07398q77457k06947J22566j07917o76308
$$ y = [591751099, 591077080, 590495300, 590085869, 589882164, 589495659, 588824921, 588138733, 587660980, 586913643, 586254005, 585909958, 585617676, 585588531, 585507927, 584995041, 584581337, 584240685, 583413048, 582982750, 583068504, 582809219, 581936646, 580768394, 580143623, 579938774, 579579201, 578823090, 578192368, 577803154, 577237282, 576632843, 576037903, 575541267, 574964371, 574724770, 574645462, 574113426, 573523750, 572723732, 571873627, 571303596, 570789909, 570087967, 569658699, 569468155, 568767700, 568291435, 568141594, 567667618, 567335625, 566882706, 565783005, 564908028, 564306984, 563520813, 562810173, 561849480, 561037064, 560555611, 559976006, 559507294, 559209480, 558836403, 558169556, 557666779, 557416344, 557092361, 556160088, 555073967, 554593468, 553991852, 553442574, 552735176, 551857719, 551650772, 551773338, 551665421, 550989113]
3365.7E50989113r21211j026421q23936n36614p69958q07381n82161l20320P3585r0103
3375.3E45184593j236267q62732j46560o08330l05939m96216n04074p2098m54483r70611
3384.9E39527283o88210J57623j88255p12395o08711n646K1668q99277n92155r0714
3394.6E35921211k38304l73611k93541j36147O8245j26381q03833m22973l98636p09381
3404.2E32486649q8692k10762p81593m39530L7308k49100n19218k20757L56331L83072
3413.9E30753708k06299o08444l82118m1733p6409l0021l69492j64909J23291k56386
3423.5E28741188k18315M7951L29246p2021R7503J81275m06952m92325n33256J31568
3433.2E27805862K00043j03378j23634N35049P23953k80342J28212m27055m65393J66130
$$ y = [550989113, 550067902, 549041481, 548217545, 547680931, 546910973, 546103592, 545521431, 545201111, 545274696, 545184593, 543948326, 543085594, 542939034, 542330704, 542024765, 541528549, 541024475, 540952377, 540497894, 539527283, 538839073, 538996696, 538808441, 538096046, 537487335, 537481689, 537503357, 536604080, 536011925, 535921211, 535682907, 535309296, 535015755, 534879608, 534947853, 534821472, 534017639, 533594666, 533196030, 532486649, 532397957, 532187195, 531405602, 530966072, 531003380, 530754280, 530235062, 530014305, 530370636, 530753708, 530547409, 529938965, 529556847, 529515114, 529438705, 529408684, 529039192, 528874283, 528997574, 528741188, 528522873, 528570824, 528900070, 528828049, 528925552, 529106827, 528699875, 528207550, 527674294, 527805862, 528005905, 527902527, 527778893, 528313942, 529037895, 528757553, 528885765, 528458710, 527993317, 528159447]
3442.8E28159447n0812O44989M39072N96962j14403n14755M86183L89099L74908M8752
3452.5E30459442M52423N80254J6136J40839N29213N87692k89803J05362N64499Q5297
3462.1E33231354L9901K22741Q33816Q64678j64071l04832P10487K98462J10894N03158
3471.7E36346588N54695J265335O82526p0496P4311L41987L51754M83665J166916L92494
3481.4E41589775m13170K52877J009292N98374N62820J027908n52406n56679J131287
3490.1E44650078J251983P99027L23296K32505N10826K68517K95639P85637O01883
3498.7E49719391P01713L74947K16255L82729j0643J028175J113510N74875J093331
3507.4E55194283J642227K55089j072693O94236J037217J043510J029129N56297P04155
$$ y = [528159447, 528108635, 528753624, 529192696, 529789658, 529675255, 529160500, 529646683, 530035782, 530410690, 530459442, 530911865, 531492119, 531508255, 531649094, 532178307, 532765999, 532476196, 532581558, 533146057, 533231354, 533271255, 533493996, 534327812, 535192490, 535028419, 534723587, 535434074, 535732536, 535843430, 536346588, 536901283, 538166618, 538849144, 538778648, 538852959, 539194946, 539546700, 540030365, 541197281, 541589775, 541176605, 541429482, 542438774, 543037148, 543599968, 544627876, 544075470, 543518791, 544650078, 545902061, 546701088, 547024384, 547256889, 547767715, 548036232, 548331871, 549117508, 549719391, 550421104, 550796051, 551012306, 551395035, 551384392, 552412567, 553526077, 554100952, 555194283, 556836510, 557091599, 556018906, 556713142, 557750359, 558793869, 559822998, 560379295, 561083450]
3516.1E61083450L28827N32799N12390O02722J212998R79004M5852j58844P76100P09343
3525.7E66624641O51551Q42552O41212L42026J194649J212616L34320O79245L91693
3534.4E72914505J243935J179428N9509Q21075N01748N32913P48634J095467J094703
3543.1E80191917J097870N8441p60078J878204J061707P26852J026116J230507K044220
3551.8E88555756J60751Q98781P12509N16014Q69141j24436R64546J115838Q47663
3560.5E94516563N69497J964111J710968J82724K343292J00632j126251R1171O16951
3569.1F00969658K957573J387253N00335J304970J641426O94313O77796J381035O54983
3577.8F12169342J218948K32468L76930K026673J900596R31244M39415L168907J833077
$$ y = [561083450, 561412277, 561945076, 562457466, 563060188, 564273186, 565252190, 565298042, 565139198, 565915298, 566624641, 567276192, 568118744, 568759956, 569101982, 570296631, 571509247, 571843567, 572522812, 572914505, 574158440, 575337868, 575397377, 576218452, 576720200, 577253113, 578001747, 579097214, 580191917, 581289787, 581348228, 580588150, 582466354, 583528061, 584254913, 585281029, 586511536, 588555756, 588716507, 589615288, 590327797, 590843811, 591712952, 591588516, 592553062, 593668900, 594516563, 595086060, 597050171, 598761139, 598943863, 601287155, 601387787, 600261536, 600352707, 600969658, 603927231, 605314484, 605814819, 607119789, 608761215, 609455528, 610133324, 611514359, 612169342, 613388290, 613620758, 613997688, 616024361, 617924957, 618856201, 619295616, 622464523, 624297600]
3586.5F24297600j686669Q40187k97851J930504K353935J851540L21045k31324K549935
3595.2F31928902m02222J180382K415123K07634K457390J247901L50953J600265J104889
3603.9F42091217R35516J811371K253495l23792K029343n59693k65579N562286N62668
3612.5F54096832j501770K877884m71878L151627L376846r13849k77557k64664J458206
3621.2F61531677K486115K431717K202377J394501J056823K237549N141831k97547
3628.9F78185043j0021515L646393N078430M644242J706238j339722J506271K963028
3636.6F86368408J808777m8828J305542J735840J521225Q83789J78757K044830K598648
3645.3F98396988L498230j285248k543106M828033j326141j974106J038819M331970
$$ y = [624297600, 622610931, 623451118, 623153267, 625083771, 627437706, 629289246, 629610291, 629378967, 631928902, 631526680, 632707062, 635122185, 635329819, 637787209, 639035110, 639386063, 640986328, 642091217, 643026733, 644838104, 647091599, 646767807, 648797150, 648237457, 647971878, 653534164, 654096832, 652595062, 655472946, 655001068, 658152695, 661529541, 660615692, 660338135, 660073471, 661531677, 664017792, 666449509, 668651886, 670046387, 671103210, 673340759, 678482590, 678185043, 668163528, 671809921, 676888351, 681532593, 683238831, 681899109, 683405380, 686368408, 688177185, 688128357, 689433899, 691169739, 692690964, 693574753, 693753510, 695798340, 698396988, 701895218, 700609970, 698066864, 702894897, 701568756, 699594650, 700633469, 704965439]
3653G04965439L097076J652680L146667n002975J004867M143143J337585J494446O81229
3661.7G16520157J018524M67072Q86840J153412L58887K685928J003571j717453l82843
3670.4G21994095k550430K851791N215149N624161r51157j3913803L155594N314789
3678.1G26740189K813339j592560N90515K681351J187591O32096j8616L41110L013382
3686.8G36388397L854676o997147l010559O435165l321609j052017L231277P3624O24313
3695.5G36226120l89252m14581P59506q8653K297287K856598m057694k274704L161087
3704.1G38075714J313629L27225M46625J921921L441085n524444J893158N731048q003311
3712.8G39622650J477661K445755N56870N54580R41391N92423j966782P50504L871765
$$ y = [704965439, 708062515, 709715195, 712861862, 707858887, 708863754, 713006897, 714344482, 715838928, 716520157, 717538681, 718005753, 718892593, 720046005, 720404892, 723090820, 724094391, 722376938, 721994095, 719443665, 722295456, 727510605, 733134766, 732183609, 718269806, 721425400, 726740189, 729553528, 727960968, 728551483, 731232834, 732420425, 733052521, 733033905, 733375015, 736388397, 740243073, 733245926, 730235367, 736670532, 733348923, 732296906, 735528183, 735601807, 736226120, 735836868, 735422287, 736181793, 736093140, 738390427, 741247025, 737189331, 734914627, 738075714, 739389343, 739716568, 740163193, 742085114, 745526199, 740001755, 741894913, 747625961, 739622650, 741100311, 743546066, 744102936, 744657516, 745598907, 746191330, 744224548, 744975052, 748846817]
3721.5G48846817k296295l908234L119202O92901j20086j196594n494K568589M97284
3730.2G48198090L158493k192841m816666N523377n87006n030517M78363J367950L91236
3738.9G46490479J923904J842194l119126K880860Q457946o264419j2165451N248718
3746.6G45295105L108215M162598j25504n970764O245728o424790m498901N186310
3754.3G46977997L340759J644669l091889K211685K794953o770554j88217L841171
3762G50760574R70841m16489J852265k504502l401794K497101L217926J24435n398636
3770.7G47701721J639862K514496J44196J15661j92642N49316Q8654J176376j602783
3779.4G52134857n328522K457200K240448J274032J340561k029419m64859O40564K23389
$$ y = [748846817, 746550522, 742642288, 745761490, 746454391, 746334305, 745137711, 745132217, 747700806, 748198090, 751356583, 749163742, 744347076, 749870453, 749283447, 744252930, 744731293, 746099243, 746490479, 748414383, 750256577, 747137451, 750018311, 758476257, 752211838, 740046387, 745295105, 748403320, 752565918, 752440414, 746469650, 752715378, 746290588, 741791687, 746977997, 750318756, 751963425, 748871536, 751083221, 753878174, 747107620, 746919403, 750760574, 751731415, 751314926, 753167191, 750662689, 747260895, 749757996, 752975922, 753100357, 747701721, 749341583, 751856079, 752000275, 752115936, 751923294, 752472610, 752561264, 753737640, 752134857, 746806335, 749263535, 751503983, 752778015, 754118576, 752089157, 751624298, 752264862, 752488251]
3788G52488251L17154l90091k7161j87759R1934K56119J125488J808853k662048k213059
3797.7G50607681Q97064K287903M087296n284119p790832K642440K880021M112701
3805.4G54440155L704529p317658k629547L512802J108704L65524J10855q67691R1324
3814.1G52518997K774277o34995q042984L356400L816681K375564L88413j1545792
3821.8G45006561K140198M082794J026917R99679j87988k540512J6022Q41522K079086
3830.5G53464279J201325n982132K186889N545121l520050j088486L478470q053894
3838.2G47231522j564942P268982k117157n41077L761902k102127k199096J542968
3845.9G51280975L89862N7679J104278m79126J786881L770828n633163l07923r513244
$$ y = [752488251, 752805405, 752415314, 752388153, 752200394, 752292328, 752548447, 753673935, 755482788, 752820740, 750607681, 751504745, 753792648, 757879944, 752595825, 744804993, 747447433, 750327454, 754440155, 758144684, 750827026, 748197479, 751710281, 752818985, 753184509, 753295364, 752427673, 752518997, 755293274, 754658279, 746615295, 749971695, 753788376, 756163940, 756552353, 745006561, 747146759, 751229553, 752256470, 753256149, 753068161, 750527649, 750543671, 751385193, 753464279, 754665604, 748683472, 750870361, 756415482, 752895432, 751806946, 755285416, 747231522, 745666580, 752935562, 750818405, 750277328, 754039230, 751937103, 749738007, 751280975, 751670837, 751728516, 752832794, 752353668, 754140549, 757911377, 752278214, 751970291, 742457047]
3854.6G42457047J765594Q195801o1417j797256J298370R64737R75265l360366K62298
3863.3G50700073L034287n606537j031571L900071L462448L020172n987854m096222
3871G47394867J855164L810577K291946p286071J040191K778778J66474J350631K908020
3879.7G56310577l601760n175019L994980q2092M42505L366623p896195J121292K511597
3888.3G50992508P00455K816314j275177n889587J693878K507477j044083M94690J31531
3897G51128006J614685J924210o501618L481751J874160m255371L420563k050781k504120
3905.7G48131485P56607O77109J332474M69207q9721l85895J1368q7357l55911L83148
3915.3G50842514J330566j910400k686462L093567O92977k264938J662369J118927
$$ y = [742457047, 744222641, 752418442, 752357025, 750559769, 751858139, 752822876, 753798141, 750437775, 750700073, 753734360, 748127823, 747096252, 750996323, 754458771, 757478943, 751491089, 747394867, 749250031, 753060608, 755352554, 748066483, 749106674, 751885452, 752051926, 753402557, 756310577, 752708817, 747533798, 751528778, 751446686, 751889191, 755255814, 747359619, 748480911, 750992508, 751692963, 754509277, 753234100, 747344513, 749038391, 751545868, 750501785, 750996475, 751128006, 752742691, 754666901, 748165283, 751647034, 753521194, 749265823, 752686386, 750635605, 748131485, 748888092, 749565201, 750897675, 751366882, 751277161, 750891266, 750902634, 750815277, 750459366, 750842514, 752173080, 750262680, 747576218, 750669785, 751362762, 749097824, 750760193, 751879120]
3923.1G51879120L81775j785507j848603Q81882L41034R50394l91922m47159J499710
3931.7G51460724j664276j184464J368790P29599k90756r24454p31354P02515O71997
3940.4G50138321K53143M54636k051239p68280M44031M92858J150818j440353K37350
3949.1G48911285O12259q14209J219178m91867q12302L21808N20324K91520o20957
3957.8G49137039J43128j68152O49032Q19550j215668p35702J42975J74179j25962
3966.5G48820419N07737R5138j279907k19574P37686K10114p96891n79147Q12759Q85468
3976.1G49193802j75629m31976m3259J4038Q4305O68259N33371l36991m35257l38821
3985.7G48731842q8119j99051l34320L79943k68936j048050k43683O07834N89295J43127
$$ y = [751879120, 752260895, 750475388, 748626785, 749508667, 749849701, 750800095, 750408173, 749961014, 751460724, 749796448, 748611984, 749980774, 750710373, 750419617, 749495163, 748763809, 749466324, 750138321, 750391464, 750846100, 748794861, 748026581, 748470612, 748963470, 750114288, 748673935, 748911285, 749523544, 748709335, 749928513, 749436646, 748624344, 748946152, 749466476, 749757996, 749137039, 749280167, 749112015, 749761047, 750580597, 749364929, 748629227, 748772202, 748946381, 748820419, 749328156, 749423294, 748143387, 747923813, 748661499, 748871613, 748074722, 747495575, 748308334, 749193802, 749018173, 748586197, 748542938, 748556976, 748641281, 749309540, 749842911, 749505920, 749070663, 748731842, 748643723, 748444672, 748110352, 748490295, 748221359, 747173309, 746929626, 747537460, 748126755, 748269882]
3995.4G48269882J48316J58615N0735j86538O8283
4000.2G48509293
$$ y = [748269882, 748418198, 748576813, 748627548, 748441010, 748509293]
##END=$$ End of the data block
