##TITLE=$$ Begin of the data block
##JCAMP-DX=5.00 $$ ACD/SpecManager v 10.08
##SPECTROMETER/DATA SYSTEM=Varian
##DATE=18 Dec 2012 14:13:32
##DATA TYPE=INFRARED SPECTRUM
##DATA CLASS=XYDATA
##ORIGIN=
##OWNER=
##NPOINTS=3735
##FIRSTX=399.26403809
##LASTX=4000.35498047
##MAXX=4000.35498047
##MINX=399.26403809
##MAXY=82.84569550
##MINY=16.15710640
##XFACTOR=1.0000000000
##YFACTOR=0.000000100000000
##FIRSTY=69.34286499
##DELTAX=0.96440572
##XUNITS=1/CM
##YUNITS=TRANSMITTANCE
##XYDATA=(X++(Y..Y))
399.3F93428650K0780411Q171158J731567l301468n693588J997452K591629m565964
407G15139847q410111L959198l284073r628219J0915451J3225250K774811l913193
414.7G20778961l391952j429062j159668j8314896j2904129J7752533k033920M44488
422.4F99742355J0799485K331543o24085J894455K984848o076889m718857J211395
430.1G07544250k598724l343735j946869O86341J593475N262222Q999024M023209l064881
438.8G17154312n950165k61383o16379o75735j321640q785858o73905P006073L506241
447.5G09381561j487198n592117k761536K512360L826752K879638n406189o919937
455.2F96433334k134094q1329j450043j471558J668015J159134M130478Q938598O16913
$$ y = [693428650, 714209061, 722380219, 724111786, 720810318, 715116730, 717114182, 719705811, 715139847, 706729736, 710688934, 707404861, 697776642, 708692093, 721917343, 724692154, 720778961, 717387009, 715957947, 714798279, 696483383, 683579254, 701331787, 699297867, 699742355, 710541840, 712873383, 712249298, 714143753, 717128601, 711051712, 706332855, 707544250, 704945526, 701601791, 699654922, 700341263, 701934738, 707196960, 716195984, 720219193, 717154312, 711204147, 710942764, 710326385, 709650650, 708329010, 699543152, 698869247, 705875320, 709381561, 707894363, 702302246, 699540710, 702053070, 705879822, 708759460, 703353271, 696433334, 694299240, 694217911, 692767868, 691296310, 692964325, 694123459, 698253937, 707192535, 707809448]
463.9G07809448n728607o531219p615509m768906O435165R817963L077240m87595n794906
472.6F96213074l221588J48239k62985J178512J186524j494599n363922n57022L860397
481.2F91686630M391175N133514K493439K752609J444778N11246p57675m240341k751160
489.9G00664215j948852l335801K596131K217254j248626M632110L123093J421814
497.6G08121338K480926j433410M87671n442582q679657J534424k80304K023392K142792
506.3G00954590j567993K73513k67334M42505P83692k903519n110702k430268o76498
515F89497986l821335j875305N263061M836197R10492j176300O26907J394196k439346
523.7F93216553m626313k940216l33328o77261p00913J464997K260666K806320J632538
$$ y = [707809448, 702080841, 695549622, 687934113, 683165207, 689600372, 699418335, 702495575, 702007980, 696213074, 692991486, 693139725, 692876740, 694055252, 695241776, 693747177, 688383255, 687826233, 691686630, 696077805, 701211319, 703704758, 706457367, 707902145, 708413391, 707655716, 703415375, 700664215, 698715363, 695379562, 697975693, 700192947, 698944321, 703576431, 706699524, 708121338, 710602264, 709168854, 709656525, 704213943, 695534286, 697068710, 696788406, 698811798, 700954590, 699386597, 699660110, 699392776, 699835281, 700618973, 697715454, 692604752, 690174484, 689497986, 685676651, 683801346, 689064407, 693900604, 694811096, 693634796, 694261703, 695655899, 693216553, 688590240, 685650024, 685316696, 684639435, 683938522, 685403519, 687664185, 690470505, 692103043]
532.4F92103043J40991r19495o21033L11280l037949l447418j707153K38800K151336
541F85212402J426316L991317K852555K76718R66339M43497p99866k301331j552810
549.7F90515137k761841l381271M55551M248504M573441J453705J391983Q08334k14386
558.4F97089157o84738l452454l404464k123413l7461J296997J748657J428757J703720
567.1F93564758M105301J201325j439667j394653k466584j461029j764755n88303n10788
575.8F89245605j479949J612777K612610J354828N93338J512222Q44956k100296l101883
584.4F91094208k929764j720200R1095N82123L67813J399689J461716J051483J814422
593.1F93212585j61743k789917k873230k489471k237091k080460k324676j507950L02887
$$ y = [692103043, 692244034, 691324539, 690703506, 691014786, 687976837, 684529419, 682822266, 683061066, 685212402, 686638718, 690630035, 693482590, 693759308, 694725647, 695169144, 694369278, 692067947, 690515137, 687753296, 684372025, 684827576, 689076080, 693649521, 695103226, 696495209, 697303543, 697089157, 696404419, 692951965, 689547501, 687424088, 687386627, 688683624, 690432281, 691861038, 693564758, 697670059, 698871384, 697431717, 696037064, 693570480, 692109451, 690344696, 689756393, 689245605, 687765656, 689378433, 691991043, 693345871, 693939209, 695451431, 696296387, 694196091, 691094208, 688164444, 686444244, 686535339, 687117462, 687485275, 688884964, 690346680, 691398163, 693212585, 693050842, 690260925, 687387695, 684898224, 682661133, 680580673, 678255997, 676748047, 677050934]
601.8F77050934p64465k627564m253616p176667q784484j0415345j1506500j3556251
609.5F17966042j7939530j9284820j7273827j6579857j1875725p236557k525825L81775
617.2E25631676j552353j949616q423957j3913994j6984825j6620179j1444168m668007
624.9D50074577R100304J8230934K4864769K4728356K2423896J6693688Q311081J100731
632.7E75528336p438126r127274j2076454j0176964p529068o659088j20887N880127
640.4E28280602J5399780K1510124K4806595K1685829J9744530J7795639J2785339
647.1F62008438J0724030Q413849Q002700O494065L978347L647919K342377J090088
654.8G06701813j18943j003799m47922o1645O64215J829758L018798K096253K865906
$$ y = [677050934, 676286469, 673658905, 669405289, 662228622, 653444138, 643028793, 631522293, 617966042, 600026512, 580741692, 563467865, 546888008, 535012283, 527775726, 525249901, 525631676, 524079323, 522129707, 513705750, 499791756, 482806931, 466186752, 454742584, 450074577, 459174881, 477405815, 502270584, 526998940, 549422836, 566116524, 574427605, 575528336, 568090210, 558962936, 546886482, 536709518, 529180450, 522521362, 522400475, 528280602, 543680382, 565190506, 589997101, 611682930, 631427460, 649223099, 662008438, 672732468, 681146317, 689149017, 695643082, 699621429, 703269348, 705611725, 706701813, 706582870, 705579071, 705131149, 705069504, 705733719, 707563477, 710582275, 712678528, 715544434]
663.5G15544434L868637R58175N81360j536484j2196731L943481L410950P34329k51617
672.2G15056534J000519K499008L052292M111023J331787j154022m85917r96017k536469
680.9G21878738k635879p66525J309280K356873K289047J717224M95300o3934j4267
689.6G26565857q09097j776123k751923k290878j314240j358032p16553J144257K201538
698.2G18894806J712418J319427O87637m13360j384812j899032j650849r59549N2948
706.9G16359634Q21381J342926K512207K814789K133865L361206K335663j130371m58984
715.6G30092316j55869j046982o69632j91345Q53577J648712L023148L283538J836777
724.3G38674240O94656l04565j439514k134094j414490j778336j501236K8687Q13827
$$ y = [715544434, 719413071, 720371246, 720952606, 719416122, 707219391, 711162872, 714573822, 715308151, 715056534, 716057053, 718556061, 721608353, 725719376, 727051163, 725897141, 725411224, 724415207, 721878738, 719242859, 718476334, 719785614, 722142487, 724431534, 726148758, 726644058, 726580124, 726565857, 725756760, 723980637, 721228714, 718937836, 717623596, 716265564, 715549011, 716693268, 718894806, 720607224, 721926651, 722614288, 722200928, 720816116, 718917084, 717266235, 716306686, 716359634, 717181015, 718523941, 721036148, 723850937, 725984802, 729346008, 731681671, 730551300, 730092316, 729936447, 728889465, 728219833, 728028488, 728882065, 730530777, 733553925, 736837463, 738674240, 739368896, 739064331, 737624817, 735490723, 734076233, 732297897, 730796661, 730825348, 731639175]
733G31639175J043702J10397P82852J829224Q73413j17417r76409j947861k849808
741.6G30387268j877975Q81729J519928J281357K201614K266846L162078L435746Q75320
750.3G44133911j41754j9531k71912k73971q3008O41250J740647K533798L824234L652039
760G55735703O61544P67212P26395j495361j859055j332169J47400p10067o25534P49053
769.6G52765121R64509J884613J667633J258545K3422O88934J002274j259842j660309
778.3G57334900p89642J368331J727753K398834L202591K683945K703552K36283q06961
787G70059586l77655m16108j313095j273193l50342k15301K168197K929230K011108
795.6G73222427K58561o39954K69623q60291j062469r12781J59073R34982M5471O56967
$$ y = [731639175, 732682877, 732793274, 733576126, 735405350, 736278763, 736161346, 735184937, 733237076, 730387268, 728509293, 729391022, 730910950, 732192307, 734393921, 736660767, 739822845, 743258591, 744133911, 743992157, 743972626, 743700714, 743426743, 743343735, 743984985, 745725632, 748259430, 752083664, 755735703, 756397247, 757164459, 757890854, 756395493, 754536438, 753204269, 753351669, 752641602, 752016068, 752765121, 753729630, 755614243, 757281876, 758540421, 758563843, 759252777, 760255051, 758995209, 757334900, 756545258, 757913589, 759641342, 762040176, 765242767, 767926712, 770630264, 770866547, 770059586, 769681931, 769265823, 767952728, 766679535, 766329193, 766113892, 768282089, 771211319, 773222427, 773480988, 772841034, 773110657, 772250366, 771187897, 770275116, 770434189, 771369171, 771414642, 772071609]
805.3G72071609J225358J091461N67779O38657j7471j010514n31616o26984j272964
814G72135315l32260R21783O70853J141052J759262J778183Q70285n04074l35541q60214
823.6G77244644j633072o80847L27454q17108o12030K58102j146469j164780j76773
832.3G71599121q545j319122k159958k338791k839966k736816k263489p75680j81504
841G56975250l55301j092453j090469M8752k92893k62832n76248j048508p49207L80173
850.6G51936264J782074J661301K373352K748337J704254K030334K337570Q9112j93787
859.3G66468811J491699L38669J47553L43093J226426J932754J181946J696625P77588
868G75605164L27987k57110n42527Q6441k49328N54199J069412M29611l97262J433334
$$ y = [772071609, 773296967, 774388428, 774956207, 775594864, 775577393, 774566879, 774035263, 773408279, 772135315, 771803055, 772724838, 773395691, 774536743, 776296005, 778074188, 778944473, 778440399, 778104858, 777244644, 775611572, 774930725, 775258179, 774441071, 773829041, 774087143, 772940674, 771775894, 771599121, 771590576, 770271454, 768111496, 765772705, 762932739, 760195923, 757932434, 757156754, 756975250, 756619949, 755527496, 754437027, 754485779, 754192886, 753930054, 753353806, 752305298, 751556091, 751936264, 753718338, 755379639, 757752991, 760501328, 762205582, 764235916, 766573486, 766662598, 766468811, 767960510, 768299179, 768446732, 768789825, 770016251, 771949005, 773130951, 774827576, 775605164, 775933151, 775676041, 775133514, 775219955, 774970627, 775524826, 776594238, 777023849, 776626587, 778059921]
877.6G78059921J928101m62647j334686k083054j727142j542587k114868j964798m66461
886.3G68291779L66973l18603p8659M15878J197586N49317p42035j241608j464462
895G66976166r57031j50376R28803L62014K12708Q79288P13348P0725p97501j247406
904.6G66990738j876831j097107j532898k216263j702499j649170p55692o62536k61460
913.3G55236282n63964j150055j042405k224807k728958k559510j628799j521378j489639
922G40326767m03595r33228p80258L15628p7514j078034j888656k139969q17719K96402
931.6G32819824J96915L06473P00531K119751K467498J596909J619568J109238J122665
940.3G44059372J192779J110383Q87909N84564J937408K519913J417465R33380J940842
$$ y = [778059921, 779988022, 779525375, 778190689, 776107635, 774380493, 772837906, 770723038, 768758240, 768291779, 768658752, 768340149, 768261490, 768677368, 769874954, 770424271, 769682236, 768440628, 766976166, 766019135, 765868759, 766797562, 767159576, 767372284, 768251572, 768964920, 769035645, 768238144, 766990738, 765113907, 764016800, 762483902, 760267639, 758565140, 756915970, 756160278, 755497742, 755236282, 754672318, 753522263, 752479858, 750255051, 747526093, 744966583, 743337784, 741816406, 740326767, 739923172, 738989944, 738209686, 738525314, 738447800, 737369766, 735481110, 733341141, 732523422, 732819824, 733016739, 733323212, 734023743, 736143494, 738610992, 740207901, 741827469, 742936707, 744059372, 745252151, 746362534, 747250443, 747835007, 749772415, 752292328, 753709793, 754643173, 756584015]
949G56584015K066498P25937j66169o05850j046142j244126j059494n94635K30255
957.7G54890289q77533k089080r19877j82266o53610j204376j956864l615646l625031
966.3G39766006j948165j209717r53598r41696o89545M00238O76193q86307k136993
975G32076416k107773k320862k417984j669387r21097r61685j558152j419449l93066
983.7G18306961n30930j508865k549972l654786m450683m967499n539703o887513p575759
992.4F80641251j1067963j8326798k3924827j8963776K738457K1886902K3086014J3613052
1000.1F69682312N986633K200165N04456K95486N54047P04956N56412R05075N25055
1008.8F81914597j13755l06320j468582j866837k135086k339553k152863j890259q65173
$$ y = [756584015, 758650513, 759376450, 759210281, 758604431, 757558289, 756314163, 755254669, 754660034, 754890289, 754012756, 751923676, 751003799, 750821533, 750167923, 748963547, 747006683, 743391037, 739766006, 737817841, 736608124, 735654526, 734712830, 734023285, 734423523, 735099716, 734213409, 732076416, 729968643, 727647781, 725229797, 723560410, 722639313, 721677628, 720119476, 718700027, 718306961, 717776031, 716267166, 713717194, 710062408, 705611725, 700644226, 695104523, 688217010, 680641251, 669573288, 651246490, 627321663, 608357887, 611096344, 632983246, 656069260, 669682312, 675668945, 677869110, 678373566, 678669052, 679223099, 679928055, 680484467, 681389542, 681914597, 681800842, 681494522, 680025940, 678159103, 676024017, 673684464, 671531601, 669641342, 668776169]
1017.5F68776169o51550n85938m36935p77970j417618j860504k509155l048859k887649
1026.1F54599991k980881k148361j440811r85794p06330r48181q30841o03638r05914
1034.8F43049240j776581j596527k159576k951088k204781p55806j25160M4594Q09212
1043.5F32333527k9297K86140L84865K44637j42212j131592M30221N09186N96848K89612
1053.1F33771935J31378P99713O48994J868820J224328L75480p52601k163430j928520
1061.8F33976097j213722r54285j748085r38263m61769p2517o35147q84247r03855
1070.5F26164207k753601k624321l163910k450256l068275l797798k017136k355538
1078.2F03933372j616172k600632k048798j543426k947655l145065l951416m870072
$$ y = [668776169, 668124619, 667538681, 667101746, 666323776, 664906158, 663045654, 660536499, 657487640, 654599991, 651619110, 649470749, 648029938, 647044144, 646337814, 645389633, 644558792, 643955154, 643049240, 641272659, 639676132, 637516556, 634565468, 632360687, 631604881, 631479721, 631524315, 632333527, 632304230, 632590370, 632975235, 633219872, 633077660, 631946068, 632376289, 632885475, 633482323, 633771935, 633903313, 634703026, 635352020, 637220840, 638445168, 638820648, 638068047, 635904617, 633976097, 632762375, 631808090, 630060005, 629121742, 628659973, 628587456, 627952309, 627068062, 626164207, 623410606, 620786285, 617622375, 615172119, 612103844, 608306046, 606288910, 603933372, 602317200, 599716568, 597667770, 596124344, 593176689, 590031624, 586080208, 581210136]
1085.9E81210136o685981n701027o290932o574860o761550r116822r519615j1552391
1093.6E19006958j1910057j5119591j5926552j5691871j6680603j4746361j5610428
1100.4D13321495j3806953j5906601j3680458j3177796j4041900j2300187j5210819
1107.1C15196781j2103481j3323860j0870514j0658512r196091o960602r230575m501839
1114.9B38351307m933395j086274k218513r23004N88150p45297K695275J96704L553105
1123.5B35478058J157989K414322K878056J562462K906131j041374J820030j634597
1131.2B45541077j839791l988971m840374k999020n936737k515030n225773k421646
1139B15773735l304920l183346k149143n053406k745857o503773l623581n577507m277458
$$ y = [581210136, 574524155, 568823128, 562532196, 555957336, 549195786, 540078964, 530559349, 519006958, 507096901, 491977310, 476050758, 460358887, 443678284, 428931923, 413321495, 399514542, 383607941, 369927483, 356749687, 342707787, 330407600, 315196781, 303093300, 289769440, 278898926, 268240414, 259044323, 252083721, 242853146, 238351307, 233417912, 232331638, 230113125, 229190121, 229778271, 229032974, 231728249, 231924953, 235478058, 236636047, 239050369, 241928425, 243490887, 246397018, 245355644, 247175674, 245541077, 243701286, 239712315, 234871941, 231872921, 225936184, 223421154, 218195381, 215773735, 212468815, 209285469, 207136326, 202082920, 199337063, 192833290, 189209709, 183632202, 179354744]
1147.6A79354744l171940m876594k331677m997291J79786j997280p1945N3501n70240
1156.3A61571064K433929o25343L433285J76201K791881L152428L590298N534706L159103
1165A85217552P691231N022716P739125O979103P858276R226895P815780J0845661
1172.7B48396339Q677922J2261429J0881023J1894970J1816311J0837497J2855435
1179.5C27620926J0715790J3255119J0950623J1882972J1038170J0058594J0379066
1186.2D05901260Q218041J0225601P819862Q984185P942466P673188Q557396O899986
1193.9D72221985Q203544P026902Q614769P571144Q001213Q803863P985764Q959084
1201.6E37388268P935371R014473P299805O709861O673813N732651N396233M814682
$$ y = [179354744, 176182804, 171306210, 168974533, 163977242, 164157028, 162159748, 162087803, 162141304, 161571064, 164004993, 163379650, 166812935, 166989136, 169781017, 172933445, 176523743, 182058449, 185217552, 192908783, 197931499, 205670624, 212649727, 220508003, 229734898, 237550678, 248396339, 257074261, 269335690, 280216713, 292111683, 303927994, 314765491, 327620926, 338336716, 351591835, 362542458, 374425430, 385463600, 395522194, 405901260, 414119301, 424344902, 432164764, 441148949, 449091415, 456764603, 465321999, 472221985, 480425529, 487452431, 496067200, 503638344, 511639557, 520443420, 528429184, 537388268, 545323639, 554338112, 561637917, 568347778, 575021591, 580754242, 586150475, 590965157]
1209.4E90965157O077537N143433N763015N589753N049324N457534M771004M465027
1217.1F33281784K795944K720871K450409K042465J516571J188508J892089J119690
1224.8F49008331K011795K068177J774978J812287J549911J669693O95038P64160L81012
1233.5F61735382J90735P56912J491852J583481Q83484J563873J658249J358871R02787
1242.2F72125626Q32061K25830k54745K66418K4338R22470R93195P18613L63845K27280
1251.8F76444931J407089J579285J239548J09787j16501j37940J21537M38156j86386
1260.5F80899506R33532J297608J547699J140060N58777J191864J047440P95288M65927
1269.2F89877701O01425N76706Q82034J060639J505508K116013J698684K165757J607971
$$ y = [590965157, 597042694, 602186127, 607949142, 613538895, 618588219, 624045753, 628816757, 633281784, 636077728, 638798599, 641249008, 643291473, 644808044, 645996552, 647888641, 649008331, 651020126, 653088303, 654863281, 656675568, 658225479, 659895172, 660590210, 661354370, 661735382, 661926117, 662683029, 664174881, 665758362, 666641846, 668205719, 669863968, 671222839, 672125626, 672957687, 673183517, 672928772, 673195190, 673219528, 674141998, 675135193, 675853806, 676217651, 676444931, 677852020, 679431305, 680670853, 680780640, 680664139, 680526199, 680647736, 681085892, 680899506, 681833038, 683130646, 684678345, 685818405, 686377182, 687569046, 688616486, 689411774, 689877701, 690479126, 691055832, 691937866, 692998505, 694504013, 696620026, 698318710, 700484467, 702092438]
1277.8G02092438J144180R55963R02481J322785Q56552J154785R84726J432800J831436
1286.5G12678146J403962J694259J682892J673279P11212P04422J387939N87159L85437
1295.2G22908707Q34121J249771J350403J368103J028595O95496J035080Q71963M97971
1303.9G31840210K60925L44086L48358Q0414N09949P17010R47647P61414r5673k3651
1313.5G35690689M04739P14188O91605K90832R0866l77960j021042P90482L043442
1322.2G40317841J649169K96402L81089k136L78646N07660J59378l39584m3869O86417
1331.8G43991013L36151k23847j19018J87530J44882M14277m37470j452560j70594
1340.5G42670364J045609Q37326j4038Q4686J54953J50986K62298m37164m92935o0120
$$ y = [702092438, 703236618, 704192581, 705095062, 706417847, 707274399, 708429184, 709413910, 710846710, 712678146, 714082108, 715776367, 717459259, 719132538, 719843750, 720548172, 721936111, 722523270, 722908707, 723742828, 724992599, 726343002, 727711105, 728739700, 729435196, 730470276, 731342239, 731840210, 732101135, 732445221, 732793579, 732873993, 733383942, 734100952, 735048599, 735810013, 735714340, 735690689, 736095428, 736809616, 737501221, 737792053, 737882919, 737504959, 736483917, 737274399, 740317841, 741967010, 742263412, 742644501, 742642365, 743021011, 743528671, 743688049, 743348465, 743304596, 743991013, 744327164, 744103317, 743984299, 744171829, 744316711, 744730988, 744293518, 742840958, 742670364, 743715973, 744553299, 744539261, 744623947, 744778900, 744929886, 745192184, 744755020, 744262085, 744201965]
1350.2G44201965L52249l51028n02472n8365p75070m18701L30887O24695P01751J56327
1359.8G44262238j025315r45740p34329j202850P92465j92032o91681J57395n90897
1368.5G39829254k9907J32828k64206j42899j009521k294541j066436L61404j98288
1377.2G35317688m72488j76239l42255N0430n646o87942n41306j43280P39670L05863
1386.8G34044495j481400Q42133J410675L51791P3319O62231O04248j691666j494369
1395.5G33321457M05731k12784n51147j924744o38733Q15583K14691k44065m85153
1404.2G30700836j372299M59595R80758m11987l95126n45121r58251q47702m25721
1412.8G27184982L32794M4022p629o1798L31497O63452k881393L34091J860199P24334
$$ y = [744201965, 744554214, 744203186, 743700714, 743642349, 742867279, 742448578, 742779465, 743404160, 744105911, 744262238, 743236923, 742291183, 741556854, 740354004, 741146469, 740954437, 740262756, 740420151, 739829254, 739799347, 739932175, 739667969, 739525070, 738515549, 736221008, 735154572, 735515976, 735317688, 734845200, 734668961, 734326706, 734377136, 734371490, 733683548, 733142242, 732998962, 733738632, 734044495, 732563095, 733405228, 734815903, 735167694, 735241013, 735903244, 736507492, 734815826, 733321457, 733727188, 733514404, 732963257, 731038513, 730399780, 731215363, 731430054, 731185989, 730700836, 729328537, 729788132, 730768890, 730356903, 729961777, 729416656, 728458405, 727610703, 727184982, 727517776, 727561798, 727554169, 727492371, 727823868, 728487320, 725605927, 725940018, 727800217, 728524551]
1422.5G28524551p73925j650238J251602J560058O37970J270829Q50219l97262Q70208
1431.2G32144012R11942l33786J25732J186753M03518l659591J042556L078385J536636
1439.8G36436157R45740R79538O05240Q59604K16903k02026Q621p11899j127243J265793
1449.5G39276428J343842m7302Q39004J782684J280136M16108m64936l813400k905350
1458.2G37707214L242188K549133J661072O97021J289292J554184j953736J238938
1465.9G47985306K578888J529693O24237o3476M77142j415481j703186K441101L302002
1474.6G55756226K131042J52054K792206K689972J262970O97097l35235J12076O3476
1483.2G65321884o32706l07693M39758J62354J15356J432038j434632p6K255707O05850
$$ y = [728524551, 727750626, 726100388, 727351990, 728912048, 729550018, 730820847, 731671066, 731273804, 732144012, 733055954, 732722168, 732847900, 734034653, 734438171, 730778580, 731821136, 734899521, 736436157, 737381897, 738361435, 738966675, 739826279, 740043182, 739841156, 739849777, 739137878, 738010635, 739276428, 740620270, 740572968, 741411972, 743194656, 744474792, 744890900, 744425964, 740612564, 737707214, 740949402, 743498535, 745159607, 745856628, 747145920, 748700104, 746746368, 747985306, 750564194, 752093887, 752718124, 752654648, 753131790, 751716309, 750013123, 752454224, 755756226, 757887268, 758039322, 760831528, 763521500, 764784470, 765481567, 765146332, 765258408, 765321884, 764689178, 764381485, 764821243, 764983597, 765098953, 766530991, 765096359, 765096283, 767351990, 767957840]
1492.9G67957840n60608r14764j620865n013733J348648k63596j123504K236099J089859
1501.6G63135376N11398L78800P00912k79617p592926p160034j37482J756516L15475
1510.2G51628418J495666l59802l38516J528549M08859l08075m020080k801056J747589
1518.9G48981552J38016m181442m243088J198883K834549K212982q09708J347733N91049
1527.6G48070526j908569L7765J67694j288528k293320l411712l031540K813568J657257
1536.3G40813141O49338J940918k577057m185257K060547j333237k981186J581726
1544G35968933m8370k914200J652374J282883J099930j232758m3259L665696J733398
1552.7G41164627N11475l699646k73362K018357J505813L469315j3138046L032913
$$ y = [767957840, 767397232, 766482468, 764861603, 759847870, 761196518, 760932922, 759809418, 762045517, 763135376, 763646774, 764025574, 764726486, 764446869, 756853943, 749693909, 749556427, 751312943, 751628418, 753124084, 752764282, 752425766, 753954315, 754363174, 754055099, 750035019, 747233963, 748981552, 749119568, 744938126, 740695038, 741893921, 744728470, 746941452, 746131744, 747479477, 748070526, 746161957, 746199722, 746367416, 745078888, 742785568, 739373856, 736342316, 739155884, 740813141, 741462479, 743403397, 740826340, 736641083, 738701630, 737368393, 734387207, 735968933, 735920563, 733006363, 734658737, 735941620, 737041550, 735808792, 735765533, 739431229, 741164627, 741676102, 737976456, 737703094, 739721451, 741227264, 744696579, 731558533, 734591446]
1560.4G34591446M224090L215409K165298K93656j000061M64096N04608p65457r48410
1569.1G42744675n792084J719589K264099K25830N12925M66308K66419n733872J358338
1577.7G38032227P93304j284866j413040k426987j010666j121597q07343o69708j67008
1586.4G29924316j71127j465759j146851k156067j614456k509003k161026k605667
1594.1G16094360l031692j035767j576690j37253r41849o59790j774979k825241k035522
1602.8G02075577l286362j890106k814026k410202k822495j217193q28781j626587
1610.5F85179825N50308j571960j089859k261048j565094k596664r609299J541824
1618.2F68578033o44531l75061j415863L68500j259995l886032J673661m49982k37122
$$ y = [734591446, 738815536, 742030945, 744196243, 744489899, 743489838, 743953934, 744458542, 743693085, 742744675, 736952591, 738672180, 740936279, 741162109, 741675034, 742141342, 742407761, 736673889, 738032227, 738825531, 737540665, 736127625, 733700638, 732689972, 731568375, 730761032, 730091324, 729924316, 729753189, 728287430, 727140579, 724984512, 723370056, 720861053, 718700027, 716094360, 713062668, 712026901, 710450211, 710312958, 709371109, 708711319, 706936340, 704111099, 702075577, 698789215, 696899109, 694085083, 691674881, 688852386, 687635193, 686806412, 685179825, 685730133, 684158173, 683068314, 680807266, 679242172, 676645508, 667036209, 668578033, 667933502, 667558441, 666142578, 666511078, 665251083, 661365051, 663038712, 662588730, 662351608]
1626.9F62351608m347305k649612o80848j221771n82733j476135J199798k25906l657074
1635.6F48710022j139908K290039J186524k11258K58941j707763K71530l06244J263122
1644.3F50615005J437760j134338K259750r0714L316117J251297K201309J860199p590561
1653F54125824j368256L846360M237289J445007K410965K308579K309341K202759J293945
1661.6F72811813J058960p6523K632676J210403J130524J457214P02515J217270K497711
1670.3F84642563L648453J999664L639984K892914k42615l07770K468796K473755R31015
1679G02146759J333923J018601L358612L842544j131439k13699N228653M746094K140121
1687.7G22470169Q55560J319046J075440K337112K070847K271499K640305L110352
$$ y = [662351608, 658004303, 655354691, 654673843, 653452072, 652869339, 651393204, 652593002, 652367096, 648710022, 647570114, 649860153, 651046677, 650835419, 651094360, 649386597, 649658127, 649351883, 650615005, 652052765, 650918427, 653178177, 653087463, 656403580, 657654877, 659856186, 661716385, 654125824, 652757568, 656603928, 660841217, 662286224, 664697189, 667005768, 669315109, 671517868, 672811813, 673870773, 673794250, 676426926, 677637329, 678767853, 680225067, 680927582, 682144852, 684642563, 688291016, 690290680, 693930664, 696823578, 696580963, 696273193, 698741989, 701215744, 702146759, 703480682, 704499283, 707857895, 711700439, 710569000, 710355301, 715583954, 720330048, 722470169, 723325729, 724644775, 725720215, 728057327, 730128174, 732399673, 735039978, 738150330]
1695.4G38150330M86068L180085M366989M476013O98624n522080O033020L680649J692657
1704.1G57242355N52674J566772K639084L220520L564987J605225O79397J524048J276016
1712.8G73871078R50699j925201j374817K749405J662598l069764L185120L186264
1720.5G79235382J713257J025619j39770q85544p2861o179k1973N07889J016540m62417
1730.1G81909943M82559K727737K177811k269592l497773L865891K718201N26352Q30078
1738.8G89471207j916581j861496L455735K331848p7057R16443J922607J191330R73435
1747.5G96407471Q83178J3276J569213j319274n02244L445893K401123J822891J139984
1756.2H05861511p29065J473084K169647J185608K78778l229065k43454K198639J145935
$$ y = [738150330, 738636398, 741816483, 746183472, 750659485, 751358109, 745836029, 751869049, 755549698, 757242355, 757795029, 759361801, 762000885, 765221405, 768786392, 770391617, 771071014, 772595062, 773871078, 774821777, 772896576, 771521759, 774271164, 775933762, 772863998, 776049118, 779235382, 780948639, 781974258, 781834488, 780948944, 780876083, 780869904, 780847931, 781355820, 782372360, 781909943, 782392502, 785120239, 787298050, 785028458, 781530685, 785396576, 788114777, 788641129, 789471207, 787554626, 785693130, 789148865, 791480713, 791403656, 792320099, 794242706, 795434036, 796407471, 797290649, 797303925, 798873138, 797553864, 797051620, 800497513, 802898636, 804721527, 805861511, 805132446, 806605530, 808775177, 809960785, 810239563, 807010498, 806767044, 808965683, 810111618]
1764.8H10111618P57675Q89435n7754j387024K796936K659835j646575l745957k12936
1773.5H10165253L249740L25470j448440J327133O59637R77631K53296k05612J392364
1782.2H16696472J069946O41022p03888p36847M18091L8757j81198M99268J21231N0735
1791.8H17913589q38241P81708K323150l58886j173859R03091P16935j358643j163177
1800.5H17745667J587066L42941P37992R08432J38321N62744k81220l27148L17917
1809.2H21732712j93176j393052J81885P89948J94626Q12911N15061M97665J80436
1817.9H23319016M55780K14004q82339j00251k58789M47159j53732k281265J271743
1826.5H22031326J936035Q20084j309662k053451K100296J250534n72663l17993k97622
$$ y = [810111618, 810869293, 811758728, 811700974, 810313950, 813110886, 815770721, 814124146, 810378189, 810165253, 813414993, 813740463, 812292023, 813619156, 814278793, 815256424, 815509720, 815304108, 816696472, 817766418, 818407440, 817703552, 816966705, 817384796, 817423553, 817242355, 817741623, 817862854, 817913589, 817075348, 817857056, 820180206, 819821320, 818647461, 819550552, 820267487, 818908844, 817745667, 819332733, 819675674, 820413666, 821322098, 821460419, 822023163, 821741943, 821414795, 821732712, 821539536, 820146484, 820328369, 821118317, 821312943, 822125854, 822640915, 823138580, 823319016, 823774796, 823988800, 823106461, 823006210, 822747421, 823194580, 823040848, 820759583, 822031326, 823967361, 824787445, 823477783, 821424332, 823524628, 824775162, 824202499, 823884506, 823586884]
1835.2H23586884m9134q6593J48620J159973P12510Q85849K89611q6898j106492l769149
1844.9H21685181J536941J027832q24661J03912J159821O34918L18451J248627N46646
1853.6H27437668O1874j88522n31464m52347p87582k83813k53678K2354J90964O07529
1863.2H25822983J090622O74667K78626p64618q93555j304016l79105P55692K46582
1871.9H25527878K59933J71051M10157O12793O32705L46604K11029J76162k65579n24216
1881.5H27558517q60672l37677l00521n5924K97394K14004Q62656n2719n91507Q01849
1891.2H27535400N36881m73251n14527q04748q01239L10897L47596R39712O28815K29492
1900.8H27935028N21927j97601j63880m98199k51160k63138p45926k53372m76608m6158
$$ y = [823586884, 823537750, 823451157, 823599777, 824759750, 825472260, 826358109, 826647720, 826560822, 825454330, 821685181, 823222122, 824249954, 823425293, 823529205, 824689026, 825323944, 825642395, 826891022, 827437668, 827499542, 827311020, 826779556, 826327209, 825539627, 825255814, 825002136, 825024490, 825215454, 825822983, 826913605, 827588272, 827866898, 827102280, 826208725, 824904709, 824525604, 825281296, 825527878, 825787811, 825958862, 826369019, 826981812, 827614517, 827961121, 828172150, 828348312, 828082733, 827558517, 826697845, 826360168, 826059647, 826003723, 826301117, 826515121, 827377777, 827325058, 826733551, 827535400, 828072281, 827599030, 827084503, 826279755, 825478516, 825789413, 826137009, 827076721, 827705536, 827935028, 828456955, 828259354, 828095474, 827597275, 827346115, 827082977, 826337051, 826083679, 825607071, 825560913]
1910.4H25560913P27921Q69751M17251M63486K10495l36838k31628k032929n87616
1919.1H25060806O18668J73721K21939o80771M66996J205825N71290o6453N951K12479
1928.8H27790451n14755r11408p49130j66702P6752L68347N16967L80784M99649J6326
1938.4H27307281o9580J31455N1422j331024k087937L04642M37927j14975N67322Q48160
1948.1H26044693K90451L62625M43497j87378m99725n57404n03616n43747j94397K46734
1957.7H24901733R9564L47290P28607M45709N3940o0501n14297n28260n75561j137314
1967.3H23760910j12534N73731J51749J74484N12924O23322M65469N5923j62582l07007
1977H25736389q12149p45010n82886m82407J21537M55627M31061J99737L21656K59323
$$ y = [825560913, 826288834, 827158585, 827575836, 828039322, 828249817, 827912979, 827681351, 825648422, 825060806, 825679474, 825853195, 826075134, 825394363, 825861359, 827067184, 827638474, 827572021, 827577972, 827790451, 827275696, 826364288, 825615158, 825448456, 825525208, 825893555, 826410522, 826791306, 827290955, 827307281, 827237701, 827369156, 827420578, 826089554, 824001617, 824306259, 824744186, 824629211, 825196533, 826044693, 826335144, 826697769, 827141266, 826953888, 826454163, 825896759, 825393143, 824849396, 824654999, 824901733, 825001297, 825348587, 826077194, 826522903, 826576843, 826516342, 826002045, 825473785, 824898224, 823760910, 823648376, 824222107, 824373856, 824548340, 825061264, 825684586, 826150055, 826205978, 826043396, 825736389, 824924240, 824179230, 823596344, 823113937, 823235474, 823691101, 824122162, 824321899, 824643555, 824902878]
1986.6H24902878n29862o70013q8196n8288m75159o40793j05972J62582K72064P63703
1996.3H23532944O63452L42178J93711k44523K3346l30658j257858q14590P5073R8343
2005.9H22281418l7384L93677O10275M92325K57187j36872o54068o66580j02386r6589
2015.6H22341003n14068o18363L6774N31006N03311M01459L81317K93121j90887l39203
2025.2H22825470o42853q35800n52216l70178P7591K74582M59747N96161TK08969k64053
2035.8H22373581j21765k30179l20587o17752q82645q27560R2773P00607N0507N37796
2045.5H20754776Q54263M11454k0142m84848m59061o17370m87290p84073n29861J95618
2055.1H18833466M17785P67517K02942K17056M30527k89612n08194n45578q43887q82339
$$ y = [824902878, 824373016, 823703003, 823614807, 823556519, 823081360, 822440567, 822334595, 822497177, 822769241, 823532944, 824196396, 824538574, 824732285, 824487762, 824511108, 824180450, 822922592, 822108002, 822183075, 822281418, 822244034, 822637711, 823247986, 823740311, 823997498, 823860626, 823206558, 822539978, 822437592, 822341003, 821826935, 821208572, 821245346, 821776352, 822279663, 822681122, 823062439, 823355560, 823164673, 822825470, 822182617, 821346817, 820794601, 820424423, 820502014, 820776596, 821236343, 821832504, 822428665, 822637634, 822373581, 822251816, 822021637, 821701050, 821083298, 820200653, 819373093, 819465866, 820166473, 820216980, 820754776, 821609039, 822020493, 822000351, 821515503, 821056442, 820439072, 819951782, 819167709, 818637848, 818833466, 819251251, 820018768, 820221710, 820438766, 820869293, 820579681, 820071487, 819525909, 818682022, 817799683]
2064.7H17799683n05219k63595l2273L4485K16599J73492j72272q9264k94037p49816
2074.4H16117783j172257q71353n50995n97381l56827n9662O42776P61567L66745J63726
2084H14444122r079k95639m91409m82941o93588k94037j49078r7351M24728N76019
2093.7H12931747M44947L82232P83768K15759k30865j2360k35290l27530m13819K02485
2103.3H13741074M20227N48172P88726O26374Q92334M63867p019l80173m43039l50036
2113H16300507n32990j22833J72653L78113M90570N12009J47934l2654r7657o15005
2122.6H16600647m41818o20194q48999n56564p2174J91955K15836N29404L89633L83072
2132.3H15770798K03628k3117l86123o61698j84402n28946l40653M57993O28128M11835
$$ y = [817799683, 817294464, 817030869, 816998596, 817033081, 817249680, 817423172, 817250900, 817161636, 816867599, 816117783, 814945526, 814074173, 813523178, 812925797, 812568970, 812509308, 813152084, 813913651, 814280396, 814444122, 814435043, 814139404, 813647995, 813165054, 812471466, 812177429, 812028351, 811931000, 812355728, 812931747, 813376694, 813758926, 814542694, 814758453, 814527588, 814515228, 814279938, 813952408, 813538589, 813741074, 814161301, 814709473, 815498199, 816124573, 817016907, 817480774, 817473755, 817093582, 816650543, 816300507, 815767517, 815644684, 815817337, 816195450, 816686020, 817198029, 817345963, 817313309, 817215652, 816600647, 816158829, 815538635, 814689636, 814133072, 814060898, 814252853, 814468689, 814998093, 815387726, 815770798, 815974426, 815951309, 815565186, 814903488, 814719086, 814190140, 813849487, 814307480, 814935608, 815347443]
2141.9H15347443N18570Q15429M28849M11224k1286j96838k36817q92181n50614j66702
2151.5H15457077N13611P76977L02048O86646O98013K47269O7978l44925o55823n30396
2161.2H17218475n10330k19879q6212J0147O24466P40280M72717j31988n01633l23868
2170.8H17292175k35824n14527j006698o74897j34506R1248K72827L30353L75137K38190
2180.5H16033478j46485j63269J65024k24991o64825o66428k25525M44565M32663L51639
2190.1H15335846P45392J062927O89240L72924J31302j01700j22528n83954l85131
2198.8H17144318r461L19596O31027M30832N27267M99802L90701P4081j69220m63867
2208.4H19375076n51605r9258k18354J19858L64075K93350N08881M39682K09808Q2245
$$ y = [815347443, 815866013, 816681442, 817110291, 817521515, 817500229, 817303391, 817066574, 816174393, 815623779, 815457077, 815970688, 816747665, 817049713, 817736359, 818434372, 818681641, 818749619, 818404694, 817748871, 817218475, 816708145, 816488266, 816402054, 816412201, 817036667, 817776947, 818249664, 818117676, 817616043, 817292175, 817056351, 816541824, 815535126, 814860229, 814725723, 814816971, 815089798, 815420151, 815795288, 816033478, 815886993, 815723724, 815888748, 815663757, 814998932, 814332504, 814106979, 814551544, 814984207, 815335846, 816081238, 817144165, 817833405, 818206329, 818337631, 818235931, 818113403, 817529449, 817144318, 817134857, 817454453, 818085480, 818516312, 819043579, 819543381, 819934082, 820008163, 819838943, 819375076, 818823471, 818724213, 818505859, 818625717, 818989792, 819283142, 819792023, 820231705, 820441513, 820523758]
2218.1H20523758L72086q0872n91660n47866m67759k27432j58005J37024M34647P63245
2227.7H20157166M76455j3046J02539P629k21405p68966p41501k65961l3951j10550
2237.4H18588409m40673R4528Q50525P28836J67770J31989o0807n12390n29022o40945
2247H18378220m60511j67923O0044K67715N62058P46612N46494M21066J36032j24512
2256.7H20365295m74472o96487n76096k90832j7166N6076K92358K52075K98691K70157
2266.3H19479599K16446K17514k64282m16642l58963j59072r4986P8888R6359o8970
2275.9H18725891K82135M09546M88510K4033k78626j99585k09274k10419n24063j52435
2285.6H18355713r7962J89591J50528R231P53251J6784k05612J0071k17819k96936
$$ y = [820523758, 820895844, 820814972, 820223312, 819675446, 819207687, 818980255, 818822250, 818959274, 819393921, 820157166, 820633621, 820620575, 820723114, 820730743, 820509338, 819740372, 818998871, 818732910, 818698959, 818588409, 818147736, 818242264, 819092789, 819821625, 819989395, 820121384, 820060577, 819548187, 819019165, 818378220, 817917709, 817749786, 817809830, 818077545, 818639603, 819386215, 819932709, 820353775, 820489807, 820365295, 819890823, 819194336, 818618240, 818327408, 818310242, 818366318, 818658676, 818910751, 819209442, 819479599, 819696045, 819913559, 819649277, 819232635, 818873672, 818714600, 818619614, 818698502, 818794861, 818725891, 819008026, 819417572, 819906082, 819930115, 819651489, 819451904, 819242630, 819032211, 818508148, 818355713, 818257751, 818447342, 818597870, 818607101, 819360352, 819377136, 819171524, 819181595, 818963776, 818666840]
2295.2H18666840m66996j34735j06048J94320K7085J83563N22842J28098J41907k58027
2304.9H18898849l18374l61328j78452k94037l92227J0910q63800O7749O38962m501
2314.5H17203751P2631j30386L63846n53970q05054L76053k50321o97632p78274o54373
2324.2H14146271M13284R14230N31540m53415j267776l0441k75040m19006R71832n05295
2333.8H14026184Q3618J395798J92337o79932K6017P73086p23495q16346q8958J47018
2343.4H14335327O23856j17874K0752Q84246J388169J096954J66016o08979o07147
2352.1H17181320J0910J89438m92325o61621j212921j441345p95441n6839Q54721n61905
2361.8H13013992O10047K143631K8152j53656l97644J084519J660385j91651q35495
$$ y = [818666840, 818199844, 818065109, 817959061, 818153381, 818180466, 818364029, 818886871, 819014969, 819156876, 818898849, 818580475, 818219147, 818040695, 817746658, 817354431, 817365341, 816501541, 816569290, 817208252, 817203751, 817276382, 817145996, 817509842, 816955872, 816150818, 816526871, 816276550, 815578918, 814800644, 814146271, 814559555, 815473785, 816005325, 815551910, 814284134, 814253693, 813978653, 813559647, 814531479, 814026184, 814109802, 815505600, 815697937, 815018005, 815044022, 815817108, 815093613, 814277267, 814188309, 814335327, 814959183, 814841309, 814862061, 815746307, 817134476, 818231430, 818397446, 817788467, 817181320, 817192230, 817381668, 816889343, 816227722, 815014801, 813573456, 812778015, 812721176, 813575897, 813013992, 813624039, 815767670, 815795822, 815642166, 815244522, 816329041, 817989426, 817797775, 816962280]
2370.4H16962280r22470J188812J100769K72141J153717J55640m28162k64664k50549
2379.1H18967514K35291P85598P28760M0436j66779P3929K24762M82407L32794j49918
2388.8H21554794J755R4452K5482l77121o63376K99912M23050k9602K7313k08359k24151
2399.4H20924149J40914L19672l05j47324k38266k65426k96707l02582K62146M37927
2409H20834198M36935J39008l61481k96554n9128J86005J27029k4109r4757j28555
2418.7H20758591k81525j10474J33744J4877j984k40783N8975J33362J0757P0343n56564
2429.3H19989319k11105K12326J00479M22744K91596l98941n38864k6322P5379R3689
2438.9H20010300J5335q5755l11966m71038r7962J28708M89807L8300l97797J71433
$$ y = [816962280, 816039810, 817228622, 818329391, 818601532, 819755249, 819910889, 819482727, 819218063, 818967514, 819202805, 819988403, 820717163, 820757599, 820590820, 820664749, 820889511, 821371918, 821704712, 821554794, 821556549, 821651001, 821676483, 821299362, 820635986, 820935898, 821358948, 821329346, 821356659, 821148300, 820924149, 821065063, 821384735, 821384430, 821237106, 820998840, 820733414, 820436707, 820134125, 820396271, 820834198, 821271133, 821410141, 821048660, 820752106, 820692978, 820878983, 821006012, 820981903, 820887146, 820758591, 820477066, 820366592, 820500336, 820515213, 820513229, 820272446, 820331421, 820464783, 820475540, 820545883, 819989319, 819778214, 819990540, 820091019, 820513763, 820805359, 820406418, 819867554, 819841232, 819916611, 820010300, 820025635, 819939880, 819627914, 819156876, 819058914, 819187622, 819677429, 819715729, 819317932, 819489365]
2448.6H19489365K98080j80130n50766k38037k66571L9978K53448k53372K09809J16729
2458.2H18918533k41165J90582K64817p7591k92587l38974p08313m49601L31192K81372
2467.8H17878265J55335K55127k16065j82647L36074M4556k62451k69394j38168L4332
2477.5H17634964j7929j23749j1139P3929j15433j20697k60315j17721R1629k213J8921
2488.1H17050247k84118l46451k72446P6447K70385j00937J54877K35748j07116r2850
2497.7H16583786j75552m78897j90812k10189k93274K46734k4338N5390K13318q6212
2507.4H15639954r6512j15891M578k7695K49405r7046n64499l27682j49460O7596j66931
2518H14415817P6370L2425j64032J89896J75018J84861k28424j93024q7128k95105
$$ y = [819489365, 819787445, 819607315, 819056549, 818818512, 818551941, 818591919, 818845367, 818591995, 818801804, 818918533, 818677368, 818867950, 819132767, 819055176, 818762589, 818423615, 817715302, 817265701, 817596893, 817878265, 818033600, 818288727, 818072662, 817890015, 818226089, 818270645, 818008194, 817738800, 817600632, 817634964, 817617035, 817493286, 817482147, 817556076, 817440643, 817319946, 817059631, 816941910, 817033539, 817031326, 817050247, 816766129, 816419678, 816147232, 816223679, 816494064, 816393127, 816548004, 816783752, 816676636, 816583786, 816408234, 815929337, 815738525, 815528336, 815235062, 815481796, 815457458, 815512848, 815726166, 815639954, 815543442, 815427551, 815432129, 815404434, 815653839, 815556793, 814992294, 814664612, 814515152, 814582748, 814415817, 814492187, 814524612, 814360580, 814550476, 814725494, 814910355, 814681931, 814488907, 814401779, 814106674]
2527.6H14106674k13318k22015L2120o6300j82647r4147K44675N01937N0888l03344
2537.3H13854523j96839J42289j48392l78342k07519m6997J86691k0828l14560j15052
2546.9H12754974L50571O4316K823j4954n20706j54419j32141k41623J24664K78778
2556.6H12512283m7378k89994J51749K33154K2507m07257m07028k823L4714L5476k36053
2567.2H11599350o3629N035l69034k16217J02311K46810J67160k56271l20358K07214
2576.8H11102371l5934m51508l57055K83813O03561j97219l0899n7755m75693n7449
2586.5H10326233l9749j63117k31018j48010k70691n8365L23410j25808k00959L0823
2596.1H09442749j35727n57327k58637L89328K04316l65525m17785J80130J43509k91443
$$ y = [814106674, 813893356, 813671341, 813703461, 813637161, 813454514, 813360367, 813605042, 814106979, 814157867, 813854523, 813657684, 813799973, 813651581, 813273239, 813065720, 813018723, 813205414, 813184586, 812870026, 812754974, 813105545, 813169861, 813172684, 813157730, 812637024, 812482605, 812350464, 812108841, 812233505, 812512283, 812464905, 812174911, 812326660, 812559814, 812582321, 812175064, 811768036, 811765213, 811799927, 811835403, 811599350, 811535721, 811540756, 811171722, 810955505, 811057816, 811304626, 811471786, 811215515, 810895157, 811102371, 811066437, 810614929, 810257874, 810541687, 811145248, 810948029, 810917130, 810859375, 810383682, 810326233, 810286484, 810123367, 809892349, 809744339, 809473648, 809415283, 809738693, 809612885, 809411926, 809442749, 809307022, 808749695, 808491058, 808880386, 809084702, 808719177, 808301392, 808481522, 808625031, 808333588]
2605.7H08333588n21317k23923L63083Q0948j72119j7395P1640J35727K01111k34833
2615.4H08016510o48117j18866K6779k41928k14462k19956k91137q0338K62756K21100
2625H06712341k4643l54690j99890l6316l27912k65121j02158j94244k61612m1809
2634.7H04903946j47247j62201K36816p9269l64685m9668Q5449r5367j71204L4485
2644.3H04191055k594k66494n8213q3770m94309j44958L2348k23007n3253m0970l19672
2654.9H02536163j14364J30844r8114J89361J15662n40161n52063l57208j24894m272
2664.6H01180954P9346l968j37329j0147P2937J20697j88446k76489K5787P4158J33286
2675.2H01070786K07901l84980p26242o9580J44653j22604p60803n31616M79812Q7433
$$ y = [808333588, 807812271, 807588348, 807951431, 808032379, 807860260, 807842865, 807914505, 808050232, 808251343, 808016510, 807368393, 807249527, 807276306, 807034378, 806819916, 806599960, 806308823, 806228485, 806491241, 806712341, 806687698, 806333008, 806133118, 806096802, 805768890, 805503769, 805401611, 805207367, 804945755, 804903946, 804756699, 804594498, 804831314, 804752045, 804387360, 804337692, 804423141, 804327774, 804156570, 804191055, 804188461, 803921967, 803863754, 803779984, 803285675, 803140717, 803173065, 802950058, 802896805, 802855835, 802536163, 802421799, 802552643, 802454529, 802643890, 802759552, 802219391, 801667328, 801310120, 801185226, 801180954, 801260300, 801256332, 801119003, 801108856, 801181793, 801302490, 801114044, 800837555, 800863342, 800937500, 801070786, 801278687, 800893707, 800167465, 800097885, 800242538, 800119934, 799359131, 798827515, 799307327, 799394760]
2684.8G99394760l02048k28271p4997j38550m63028k16903J57775L90244j64948l03192
2694.5G98050842J38016R5825J37253j74179j41449J40076M043j85776m16641n61828
2704.1G97086182m55475o9580j52588k01340K22855K41775k26669m25339n6381N3253
2713.8G96016693q2474j78146n26428o00662J65329M08325k21176k21558K39563L14407
2723.4G95313873k67715l26233q4610m37164l67737k99149m13818l00064Q39J27411
2733G92945633L2806O4011O3782K33917J05057l68729o74515l47366j17874l11966
2742.7G91624756q3542k59399K3956O82678L65982n27725p97196J48926J90888m28543
2752.3G90940781m12445q6670Q3084j05973k71453l40348m2495p9728L4180l14712
$$ y = [799394760, 799092712, 798864441, 798789444, 798650894, 798187866, 797970963, 798128738, 798518982, 798354034, 798050842, 798188858, 798284683, 798421936, 798247757, 798106308, 798246384, 798250427, 798064651, 797648010, 797086182, 796630707, 796561127, 796408539, 796207199, 796430054, 796671829, 796445160, 796019821, 795963440, 796016693, 795934219, 795756073, 795229645, 794628983, 794794312, 795202637, 794981461, 794759903, 794999466, 795313873, 795046158, 794719925, 794635315, 794198151, 793830414, 793531265, 793117447, 792817383, 792818222, 792945633, 792978439, 793042450, 793106232, 793340149, 793445206, 793076477, 792401962, 792054596, 791936722, 791624756, 791541214, 791281815, 791305771, 791988449, 792354431, 791826706, 791029510, 791178436, 791369324, 790940781, 790528336, 790441666, 790524750, 790418777, 790147324, 789806976, 789764481, 789684753, 789718933, 789404221]
2762G89404221n44587L07999l62549m01611M0588k89917k17972m62341J70517Q3313
2771.6G87727661k08206M44870J96457j30386o47126q65020l99247m6539q7280o943
2781.3G85978241L02277j20469m03595l89785J11084L10058n85785n98526l20587m02679
2790.9G83880234m66080j77612M09088l8071m50363l48892l16391j46485n6457j11237
2800.5G82177734o16607p85981m11376j18790k08511l62702K63290J71509l52859l44925
2810.2G79410782m59595m96063n68009j51596k16522l29819N9433l52478m00772m38919
2819.8G76056442j73950K59094k04391n96314n64041N875j62964p44705r53980m14200
2829.5G72506866M53339j65634o08749m79584k07520k8305m06875q24433j176529p25860
$$ y = [789404221, 788859634, 789167633, 788805084, 788403473, 788444061, 788154144, 787936172, 787473831, 787644348, 787727661, 787519455, 787964325, 788160782, 788030396, 787383270, 786518250, 786119003, 786072464, 785985184, 785978241, 786280518, 786160049, 785756454, 785366669, 785477753, 785787811, 785202026, 784603500, 784282913, 783880234, 783414154, 783236542, 783645630, 783607559, 783157196, 782808304, 782491913, 782345428, 782288971, 782177734, 781561127, 780775146, 780363770, 780244980, 780036469, 779673767, 779937057, 780108566, 779755707, 779410782, 778951187, 778455124, 777887115, 777735519, 777518997, 777189178, 777248611, 776896133, 776495361, 776056442, 775882492, 776141586, 775937195, 775340881, 774776840, 774782715, 774619751, 773875046, 772921066, 772506866, 772960205, 772794571, 772185822, 771706238, 771498718, 771470413, 771063538, 770239105, 769062576, 768336716]
2839.1G68336716p70493q18786n27802q15353o03409p84912j141663r52835n55038
2847.8G61366425q75016j477127j160354r57871l96271k57721q47015k99835M10309
2856.5G55505524R9945p4768K62146r690l71856m22898k90146k39257k78931K9755
2866.1G54209824l3417q72193j461563j34811P11975l14178q42591o21109j99051p04651
2875.8G49738235q81805n03616o18134O1493L45993j00021m00162m57382k54364l45917
2885.4G46584320o49185m99649j26724k34909k77329o29044q94622o21415l47595L3341
2895.1G42337189k22016n31921o06918l61481k54364r05609o46057j44196m98886n82886
2904.7G37582855P019M0741n70144n53132l1814m58527j082458l46070n51757r52454
$$ y = [768336716, 767566223, 766747437, 766219635, 765404282, 764800873, 764015961, 762874298, 761921463, 761366425, 760491409, 759014282, 757853928, 756896057, 756499786, 756242065, 755395050, 755095215, 755505524, 755605469, 755530701, 755792847, 755783157, 755411301, 754988403, 754698257, 754459000, 754180069, 754209824, 754176407, 753304214, 751842651, 751707840, 752419815, 752105637, 751263046, 750641937, 750442886, 749738235, 748856430, 748352814, 747734680, 747796173, 748142166, 748042145, 747641983, 747184601, 746930237, 746584320, 745935135, 745435486, 745308762, 745073853, 744796524, 744167480, 743272858, 742651443, 742303848, 742337189, 742115173, 741583252, 740976334, 740614853, 740360489, 739454880, 738808823, 738664627, 738165741, 737582855, 737589874, 737630615, 737060471, 736507339, 736475525, 736016998, 734934540, 734588470, 734036713, 733084259]
2914.3G33084259n20248l90091k80838j122895j253433r47418l98941L95050m52194
2923G28113251p70493l24859J70593l20893o94427k289n7373N69382L94363l21274
2932.7G26755981O0044J13525M27399R47342N41687j09940J47476p2708k8610Q46100
2942.3G29628296P73773K67792j63345k5788j10168l90702o8206j45951l82080l31497
2952G29052124r1019J24894k73896p36694J49078L68576j98822K02561o4240J29166
2961.6G28661728K37808m99496k35291M24881P67288L56980K09274M28696M52041O08597
2971.2G31412506N94177M29306L60260M89579K28576J48163P3319Q8806N99136N40772
2980.9G34964600M81567M91333N50613L06397Q7128N63964N84412K12173k38723R6817
$$ y = [733084259, 732564011, 732173920, 731893082, 730770187, 729516754, 728569336, 728170395, 728565445, 728113251, 727342758, 727017899, 727188492, 726867599, 726173172, 726170883, 726113510, 726682892, 727077255, 726755981, 726816025, 726929550, 727356949, 728304291, 728845978, 728736038, 728883514, 728810806, 728782196, 729628296, 730402069, 730669861, 730506516, 730480728, 730370560, 729979858, 729911652, 729765701, 729383621, 729052124, 728961105, 729085999, 728812103, 728075409, 728224487, 728593063, 728394241, 728596802, 728532562, 728661728, 728899536, 728400040, 728164749, 728589630, 729356918, 729713898, 729923172, 730351868, 730803909, 731412506, 732006683, 732435989, 732796249, 733285828, 733514404, 733662567, 733735886, 733824692, 734423828, 734964600, 735446167, 735937500, 736488113, 736794510, 736881638, 737445602, 738030014, 738242187, 738003464, 738100281]
2990.5G38100281P84149M50592j6327K09351K20413j35651J31836n4169l15856P2097
3000.2G39446716K42768j52054n59387O1264K3346l53852J07270J58157k6703j58081
3009.8G38789444r2850L4714k82669o69479j86387q8577m99725j74256j26037J37634
3019.5G36841812K54669l11203q48159o68183K42615j0300n24750l64608k69318l66745
3029.1G33975830m89426m91485p7362P84912j8768j054001n39017l50952p13577o40336
3038.7G30385818N6916R0027m97208o15387J63422K09427p24793o37817o11267k13013
3048.4G27606125k73438p22351K11487J6174m18624o07071q80509l44620k28347j27869
3058G24230957m17328o75812j13754k4567j98516m71802o12412l78494l95279l01819
$$ y = [738100281, 738884430, 739335022, 739318695, 739528046, 739748459, 739612808, 739744644, 739690475, 739374619, 739446716, 739689484, 739537430, 738978043, 739039307, 739062653, 738708801, 738816071, 738974228, 738947525, 738789444, 738696594, 738731308, 738448639, 737779160, 737592773, 737504196, 737004471, 736830215, 736704178, 736841812, 737096481, 736785278, 735937119, 735268936, 735511551, 735501251, 734976501, 734611893, 734342575, 733975830, 733486404, 732994919, 732917557, 733702469, 733683701, 732629700, 732090683, 731739731, 731026154, 730385818, 730442734, 730532761, 730035553, 729420166, 729583588, 729793015, 729068222, 728430405, 727819138, 727606125, 727332687, 726610336, 726821823, 726837997, 726419373, 725812302, 724931793, 724587173, 724358826, 724230957, 723813629, 723137817, 723024063, 722999496, 722800980, 722329178, 721716766, 721338272, 720942993, 720641174]
3067.7G20641174j41754l31116n29251n45959l73840k07367k00425k24380l07770l43857
3077.3G17435455n6991j25428l26461J52359l52555q35342k37274o31409p68967j90048
3087G14063339j78909k72141q1863j11923m22516l00827k93198k85873l42407o94504
3096.6G11079178m32129k05383n38102n10482k55814o85348l31727J59379k82746m43115
3106.2G07553711m65927j82343m97284m78744j13449o27442m07257l05938k32087n56717
3115.9G03686523j088256k83204R4223k51693m65317l93906r76562j120606k60772
3124.6F98940430l71857p25632n10177J46484R6436n36805o41708o55823q56247q25348
3134.2F94059753k81753m06647o20346k04163j27258p03354q44421o7749k51389q86383
$$ y = [720641174, 720499420, 720168304, 719639053, 719093094, 718719254, 718511887, 718311462, 718087082, 717779312, 717435455, 717378464, 717253036, 716926575, 717078934, 716726379, 715891037, 715653763, 715022354, 714253387, 714063339, 713884430, 713612289, 713530426, 713418503, 712995987, 712695160, 712401962, 712116089, 711773682, 711079178, 710647049, 710441666, 709903564, 709393082, 709137268, 708451920, 708120193, 708279572, 707996826, 707553711, 707087784, 706905441, 706408157, 705929413, 705815964, 705188522, 704781265, 704475327, 704243240, 703686523, 702598267, 702315063, 702409286, 702157593, 701692276, 701298370, 700321808, 699201202, 698940430, 698568573, 697842941, 697332764, 697479248, 697575684, 697038879, 696397171, 695741348, 694885101, 694059753, 693778000, 693371353, 692751007, 692546844, 692419586, 691716232, 690871811, 690804062, 690552673, 689666290]
3143.9F89666290j055908p94449o17752p67364m52347m37241j62506k40478p11594
3152.5F84426651o92139p25326m76303o53687p63931o36292l20587l37295j020127
3161.2F78800964o00204j03989m95682r80606n15976j93634o42395p03735r84802p73697
3170.9F72806244o71387q03299l97186n56030p35474l41034l357o02188j297989q03528
3180.5F66594772l2119n38559r06449m34723r00955j070633p10525k15073j34201p74994
3190.1F60876541p68738l59192j67160j241378j345520l1891j87531j004944j112136
3198.8F54658051m5701J99357m82254n37186q18405j184464r01565n56412q23822n73044
3208.5F48934555p50961j056290k27585P4005p2097p94449j103440o49566n44892o51016
$$ y = [689666290, 688610382, 687815933, 687198181, 686430817, 685978470, 685541229, 685378723, 685138245, 684426651, 683734512, 683009186, 682532883, 681879196, 681115265, 680478973, 680158386, 679821091, 678800964, 678200760, 678096771, 677601089, 676620483, 676104507, 675910873, 675268478, 674564743, 673579941, 672806244, 672134857, 671331558, 670934372, 670378342, 669642868, 669301834, 669298477, 668696289, 667398300, 666594772, 666562653, 666024094, 665117645, 664682922, 663781967, 662711334, 662000809, 661785736, 661651535, 660876541, 660107803, 659748611, 659581451, 658340073, 656994553, 656962662, 656775131, 655770187, 654658051, 654612350, 654811707, 654329453, 653792267, 652973862, 651789398, 650887833, 650331421, 649507599, 648934555, 648183594, 647127304, 646899719, 646973724, 646901627, 646107178, 645003738, 644354172, 643809280, 643158264]
3218.1F43158264r49859p22199n06287n94329m29726l09601o83708p69005l73154n41343
3227.8F37279053m55513k19345n92041r01451o61393o31294o14929m93736o72455j79672
3237.4F31857224j31226n25169r41124r11980l05710m86793k15950m65317q47588k94189
3247F26732178r7657l91197r14077p25022r34410m78821j05133r15985o09627k86674
3256.7F21273575k60353p67365o10122l31650p76139j88484j91383o29730o33545K6893
3266.3F16911697l34701j262779m00124m2305k93083p60918q40645l91693j78413j83907
3276F12223129p65953m55742l97339n82656o76880r74655m9706J36871p20024r12361
3285.6F06824684l44734N8441O0082p5760q49953j060104l77198K3270k4605l96576
$$ y = [643158264, 642208405, 641486206, 640979919, 640385590, 639955864, 639646263, 638962555, 638193550, 637820396, 637279053, 636823540, 636604195, 636012154, 635110703, 634449310, 633818016, 633203087, 632709351, 632036896, 631857224, 631725998, 631200829, 630259705, 629347725, 629042015, 628555222, 628339272, 627873955, 627026367, 626732178, 626634521, 626243324, 625329247, 624604225, 623669815, 623190994, 623085861, 622169876, 621560249, 621273575, 621013222, 620245857, 619635735, 619304085, 618527946, 618339462, 618148079, 617518349, 616884804, 616911697, 616576996, 615314217, 614914093, 614871788, 614578705, 613817787, 612977142, 612585449, 612407036, 612223129, 611457176, 611001434, 610604095, 610021439, 609344559, 608369904, 608320198, 608457069, 607737045, 606824684, 606479950, 606538391, 606598473, 606522713, 605672760, 604612656, 604235458, 604258728, 604234123, 603837547]
3295.3F03837547r36088q56972m28009m37431n21660m22402k18086n20859n50842j41334
3304.9E98803864m31290j172524j325645l30772J48506j09139o49071j312179r49516
3313.6E92672234l62931l04222m82559l62282m70276r44938r25370o02455o86607o92749
3323.2E86837845J6250m43763r79996q52661r58138l54309l11508n17235j011162j399955
3332.9E80025368o16722l11737k82746m64172q76579p70874n26772o74591r56001q74291
3342.5E73670883n13534n26047j152840j034813n88531n69954o76766o25686m73061
3351.2E67509651q24890j023636r46350o09627q03947q38318n61028j019973o51627
3359.9E60230255o82716p38793o52923q55370m30069r62639j032104o33888l64190
$$ y = [603837547, 602901459, 602044487, 601616478, 601179047, 600657387, 600234985, 600016899, 599496040, 598945198, 598803864, 598372574, 597200050, 595874405, 595543633, 595692139, 595583000, 594933929, 593621750, 592672234, 592309303, 592005081, 591522522, 591160240, 590689964, 589745026, 588819656, 588217201, 587530594, 586837845, 586854095, 586410332, 585430336, 584577675, 583619537, 583265228, 582953720, 582436485, 581425323, 580025368, 579408646, 579096909, 578814163, 578349991, 577473412, 576702538, 576175766, 575501175, 574545174, 573670883, 573157349, 572631302, 571478462, 570443649, 569855118, 569285164, 568608398, 567982712, 567509651, 566684761, 565661125, 564714775, 564105148, 563301201, 562462883, 561901855, 560881882, 560230255, 559547539, 558808746, 558155823, 557300453, 556870384, 555907745, 554875641, 554241753, 553877563]
3368.6E53877563n02586j196556j079597j097527l79028J48430o10123j107178q28514
3377.2E47224884j80626m61388q13293o61354p00989p12700l83911l85895m47197m05044
3386.9E42072487q09021l76816j59531o14051q61473q85087n12580m64478m62418n39703
3396.5E36387329j44615K35901j30882m31328o52161o57883n16090k58102k71340k44942
3406.2E33315887n70907m94309M7150o49490q75702l35236L40042P0229k04048n646
3415.8E30637970j051216q84934j93405K10572M41627k06718m77486m96216L3531L44048
3425.5E28357773l05m89960M8943J93901k69165R6054o48842k95029N84374M24919
3435.1E28002663M78630J29127k73819k69394L04795Q8920j03378l61786L9787R75647
$$ y = [553877563, 553374977, 552178421, 551098824, 550001297, 549622269, 549770699, 549160576, 548053398, 547224884, 547044258, 546582870, 545769577, 545108223, 544407234, 543694534, 543310623, 542924728, 542477531, 542072487, 541263466, 540886650, 540727119, 540113068, 539251595, 538366508, 537853928, 537389450, 536927032, 536387329, 536242714, 536478615, 536347733, 535916405, 535264244, 534606361, 534090271, 533832169, 533560829, 533315887, 532744980, 532250671, 532297821, 531648331, 530772629, 530437393, 530777435, 530847664, 530643616, 530637970, 529586754, 528701820, 528508415, 528718987, 529160614, 528953896, 528476410, 527980194, 528013725, 528357773, 528357468, 527867508, 527916451, 528110352, 527841187, 527937241, 527288399, 526993370, 527577744, 528002663, 528481293, 528610420, 528336601, 528067207, 528372002, 528460922, 528357544, 527995758, 528035545, 529011192]
3444.7E29011192L35160N65757J84403k56729L90167O56242L69606o85234n1307N36727
3454.4E31055984O10238N79147M69360M85344n684P49665O28166k14195q7052O15730
3464E34886703M67072N12085J288948Q6212L17497L33481L08495J024399l41530M62608
3473.7E39345970J221085J77383J82953Q05512Q95538Q04367R59282J10092l92342
3482.3E44109840j10702J246071J148834M60167J483459K49482k74620R84268R41696
3491E50238495J52740P6027Q45413Q20733P12585O62270R47723R62753P51114M41971
3500.7E56611824K17514P16286L53012O32210Q77800J048278J247712M03976p4997
3509.4E62033615K73857P76215N97420J048622R91287P25441J034889M99230N83877
$$ y = [529011192, 529346352, 529912109, 530096512, 529839783, 530229950, 530886192, 531255798, 530570564, 530519257, 531055984, 531666222, 532245369, 532714729, 533200073, 533194389, 533944054, 534572220, 534358025, 534270973, 534886703, 535353775, 535865860, 537154808, 537241020, 537558517, 537891998, 538200493, 539224892, 538883362, 539345970, 540567055, 540744438, 540927391, 541732903, 542628441, 543432808, 544392090, 544502182, 544109840, 543999138, 545245209, 546394043, 546854210, 548337669, 548587151, 548312531, 549296799, 550238495, 550391235, 550467262, 551312675, 552133408, 552845993, 553508263, 554455986, 555418739, 556169853, 556611824, 556829338, 557545624, 557898636, 558530846, 559408646, 560456924, 561704636, 562108612, 562033615, 562307472, 563083687, 563681107, 564729729, 565721016, 566446457, 567481346, 567980576, 568564453]
3518E68564453N65720P35473J225739J402626O43654j75324P90634O61240N19905R40476
3527.7E75874596J371727K98881N44548J781578M21295O02799J002464J447640J174698
3536.4E84520226K212Q71658N69725P22084R34334J497536J448173N08080L5057j31912
3546E90977173J595344O02799J587105K015113J047707J459160m75769Q98399J429482
3554.7F01136513J282120J175537L06663J641274J211319J009254N35774J228752Q48008
3563.4F10375214L61251L319359L36037n69305O53801M60662K875138J518325J212426
3572F20542908J620598J290397O04859J219482J518135M89578J467324K64511N83610
3580.7F29601402K283745J821213Q07304Q19092L651657K291222n73578R20639n0430
$$ y = [568564453, 569130173, 569865646, 571091385, 572494011, 573137665, 572962341, 573752975, 574414215, 574934120, 575874596, 577246323, 577545204, 578089752, 579871330, 580292625, 580895424, 581897888, 583345528, 584520226, 584522438, 585394096, 585963821, 586685905, 587620239, 589117775, 590565948, 591074028, 591109085, 590977173, 592572517, 593175316, 594762421, 596777534, 597825241, 599284401, 598808632, 599707031, 601136513, 602418633, 603594170, 603900833, 605542107, 606753426, 607762680, 608298454, 609527206, 610375214, 610736465, 614055824, 614391861, 613822556, 614476357, 614937019, 617812157, 619330482, 620542908, 622163506, 623453903, 624058762, 625278244, 626796379, 627285957, 628753281, 629017792, 629601402, 631885147, 633706360, 634513664, 635332756, 638984413, 641275635, 640702057, 641622696, 641572266]
3589.4F41572266K360992K117310J746826P29599L07236K750701k56042J434479K842712
3598.1F55606079L00369K023087J438293R95560J764984R64356J041641J562424J494979
3606.8F67191772J56098K989120J12229k37351N242691R08890o82754L516464j39771
3615.4F79057388K626038L097534k84653p7362r61685J139755K893448K812119K520599
3624.1F92823181K218094J437912J849594M458542j074142p800141M070130M505615
3631.8G02488785M424972J687851j469116J421356K526779J686783O17066J695785
3639.5G15080261K239609J539383L39432J81274J967926K618027L799057p79114k965088
3648.2G24020767N013886J177063k254563o77032L441620L083420K075119K492828
$$ y = [641572266, 643933258, 646050568, 647797394, 648526993, 648834229, 651584930, 651328888, 652763367, 655606079, 655906448, 657929535, 659367828, 660363388, 662128372, 663092728, 664134369, 665696793, 667191772, 667347870, 670336990, 670449219, 670211868, 675454559, 676363449, 675680695, 679197159, 679057388, 681683426, 684780960, 684496307, 684418945, 683457260, 684597015, 687490463, 690302582, 692823181, 695041275, 696479187, 698328781, 702787323, 701713181, 693913040, 697983170, 702488785, 706913757, 708601608, 707132492, 708553848, 711080627, 712767410, 713384476, 715080261, 717319870, 718859253, 719198685, 719379959, 721347885, 723965912, 727764969, 726985855, 724020767, 729034653, 730211716, 727957153, 727280121, 730721741, 733805161, 735880280, 738373108]
3655.9G38373108m800263J655045M138260J770401J885528Q07572O77872M5852J097031
3664.6G45650406J041183j84250K776337J528702j921463m38843k503738K507019N276260
3673.3G53731613N319061n59616j1935501K845078N562439K577057k530976m34189
3681G54574966K391968J800690J200561N73426P171K125931K945862p335205q11691
3689.7G57473679O111984n589371n00412L927384k42844M44794P4157J56861J580124
3698.4G63436356R155J755218K084275m235001p59735L509827J007156O1645J47629
3707G67016525K129135M239808n261765O91071M143295p987595L205948L164215j61514
3715.7G71179123R1782Q37097N26733k016449Q58231M073868j867447l326569L348084
$$ y = [738373108, 733572845, 735227890, 739366150, 741136551, 743022079, 743829651, 744507523, 744553375, 745650406, 746691589, 746507339, 749283676, 750812378, 748890915, 748452072, 745948334, 748455353, 753731613, 759050674, 758491058, 746555557, 749400635, 754963074, 757540131, 755009155, 754574966, 756966934, 758767624, 759968185, 760541611, 760548782, 762674713, 765620575, 758285370, 757473679, 763585663, 757996292, 757495880, 761423264, 761180420, 761625214, 761699371, 761856232, 763436356, 763445511, 765200729, 767285004, 763050003, 762290268, 765800095, 766807251, 766868896, 767016525, 769145660, 773385468, 768123703, 768814774, 772958069, 764970474, 768176422, 771340637, 771179123, 771270905, 772108002, 772634735, 770618286, 771476517, 775550385, 773682938, 770356369, 773704453]
3724.4G73704453J017913j004104k133484Q51059L092041l3188K620315j290283n498886
3733.1G71325836M008331K89536m247742M57383K559432N5237J019898K356949j983338
3741.8G75841522K323151O515579q392258r092331O624985L655396K800674k715454
3749.5G77561264o440430N817185m740067k614670M607621L397064K625427l283768
3757.2G76929626J583558K905731o411514J6326L415375P37305k6016K132415k383957
3765.9G78898849l246154K210388K465591k17590n185394J977615K658691j83105j7166
3774.5G79361725j14670L68958l73688J695556K09122n050278J670151J834641R01794
3783.2G80503311J002121k040634r39102L42026P30819L58887j036530j98974P95517
$$ y = [773704453, 774722366, 773718262, 771584778, 772435837, 775527878, 775494690, 778115005, 776824722, 771325836, 775334167, 775623703, 771375961, 771833344, 774392776, 774448013, 775467911, 777824860, 775841522, 778164673, 784680252, 776287994, 767195663, 773820648, 777476044, 780276718, 777561264, 771120834, 776938019, 772197952, 769583282, 774190903, 777587967, 780213394, 776929626, 778513184, 781418915, 775007401, 775023727, 778439102, 779176407, 779150391, 781282806, 778898849, 775652695, 777863083, 780328674, 780111084, 774925690, 776903305, 779561996, 779378891, 779361725, 779247055, 779616013, 779242325, 780937881, 781147003, 776096725, 777766876, 779601517, 780503311, 781505432, 779464798, 778525696, 778867722, 779598541, 779957428, 778920898, 778721924, 779517441]
3791.9G79517441R94186J55716N85098J559067k668686k388229J134949J960678L605499
3800.6G84455719m459000p565231L112259L087921L554993L240738o934738l337250
3808.3G75155411L252640J379394K03934O31485m03671J52969K800293p91474o525802
3817G75855179K868500K844085K021332l57132j0450745K776871L641815R26590J156464
3825.7G81282959k80228k669143o485J502533K662048M62570o648559K012939N361862
3834.3G83680496l000793r04160M029846o315155k648162N123901l149643K01721M604263
3843G81622314j345367k400589J129608L59421M80804J765442l67508M81568K597656
3851.7G84323349m567261K052231q747482k99301P451400j07574j498032J569748Q81348
$$ y = [779517441, 780511627, 780667343, 781252441, 782811508, 780142822, 777754593, 778889542, 780850220, 784455719, 779996719, 772431488, 775543747, 778631668, 782186661, 785427399, 778492661, 775155411, 778408051, 779787445, 779991379, 780622864, 780219193, 780372162, 783172455, 782380981, 775855179, 778723679, 781567764, 783589096, 783231964, 772781219, 775558090, 779199905, 780126495, 781282959, 781002731, 778333588, 778327103, 779829636, 782491684, 782954254, 776305695, 778318634, 783680496, 780679703, 779775543, 783805389, 777490234, 774842072, 779965973, 776816330, 777018051, 781622314, 780276947, 777876358, 779005966, 779365387, 779846191, 781611633, 781244125, 781725693, 784323349, 779756088, 781808319, 773060837, 772761536, 780212936, 780105362, 778607330, 780177078, 781058426]
3860.4G81058426R75265l600311K5482M130173m251022k398835K763443K684174K756577
3869.1G84143372o244431l901749L505326M136200J703567p625580J436310L595352
3876.8G80748367m66766P95135L044281m251251m905700M482879M91333j44653K252884
3885.4G82046509p776337J910477L382110N60303K472916r52530n849838J204071K094268
3894.1G79091949o49566J574020J191406Q04215m17481p338027L849487K907638k874984
3902.8G78138657L200683k478561j964874K99377L88794J793365L01438N7373j78299
3911.5G79557953o5918K69623m35791K23312J067047k004623k163391K601242K97394
3920.2G79346848j941452J333999P13196K25601j396713j353989J472931J258850O82602
$$ y = [781058426, 782033691, 778433380, 778458862, 782589035, 778338013, 775939178, 778702621, 781386795, 784143372, 777898941, 773997192, 777502518, 781638718, 783342285, 775716705, 777153015, 780748367, 780281601, 781076736, 784121017, 779869766, 774964066, 779446945, 779938278, 779793625, 782046509, 774270172, 776180649, 779562759, 780123062, 782595978, 781643448, 775793610, 776997681, 779091949, 778442383, 780016403, 781207809, 782012024, 781594543, 774256516, 778106003, 781013641, 778138657, 781339340, 778860779, 776895905, 777195282, 777584076, 779377441, 779678879, 779736252, 779557953, 779492035, 779761658, 779325867, 779549179, 780616226, 778611603, 776448212, 779049454, 779346848, 777405396, 778739395, 779452591, 779678192, 778281479, 776927490, 778400421, 779659271, 780341873]
3928.8G80341873r61609l18145J182861j873016j028748R15527L86429P58057R537
3937.5G79412766r31321O8589M92401J099014N09186l039322p40128R47495L98788
3946.2G78217468O34995j373291J44882J096115o53610N47714m31824o83059O81305
3954.9G78180695L86123M196q8729L99093j77231m2267L19291j110459l92914N95551
3964.5G78073349j16501j52893O95648K39792j519546o56662J100616K4414m47082
3973.2G77241135K15149K24227M49677j3275j0986J54418j91879J29090N35583M10004
3982.8G79143143j07270k73056m90722k67792k5635K39716O65741p63703j096801k87247
3992.5G76736374j69830L51409L66822L26538P02667M77600o31943j14212
$$ y = [780341873, 779380264, 779062119, 780244980, 778371964, 777343216, 778258743, 778645172, 779403229, 779412766, 778481445, 778550034, 779042435, 780141449, 780650635, 777611313, 776871185, 777818680, 778217468, 778852463, 777479172, 777624054, 778720169, 778066559, 778614273, 778182449, 777499390, 778180695, 778566818, 778571014, 778482285, 778881378, 778704147, 778661880, 778981171, 777870712, 777477798, 778073349, 777956848, 777803955, 778499603, 778739395, 777219849, 776563187, 777663803, 777688217, 777241135, 777456284, 777680511, 778130188, 778116913, 778105927, 778260345, 778068466, 778197556, 778733139, 779143143, 779035873, 778762817, 778272095, 778004303, 777978668, 778218384, 778884125, 778120422, 777023621, 776736374, 776566544, 776917953, 777284775, 777611313, 778313980, 778791580, 778159637, 778045425]
4000.2G78045425
$$ y = [778045425]
##END=$$ End of the data block
