##TITLE=$$ Begin of the data block
##JCAMP-DX=5.00 $$ ACD/SpecManager v 10.08
##SPECTROMETER/DATA SYSTEM=Varian
##DATE=18 Dec 2012 14:13:26
##DATA TYPE=INFRARED SPECTRUM
##DATA CLASS=XYDATA
##ORIGIN=
##OWNER=
##NPOINTS=3735
##FIRSTX=399.26403809
##LASTX=4000.35498047
##MAXX=4000.35498047
##MINX=399.26403809
##MAXY=83.30590820
##MINY=16.19282341
##XFACTOR=1.0000000000
##YFACTOR=0.000000100000000
##FIRSTY=69.99419403
##DELTAX=0.96440572
##XUNITS=1/CM
##YUNITS=TRANSMITTANCE
##XYDATA=(X++(Y..Y))
399.3F99941940K895127j93634J824493L638611j147385M050369l94668j1328201j081391
$$ 699941940 702837067 702643433 704467926 708106537 706959152 711009521 710614853 699286652 698205261
407.9F98205261L304901r70764m224167M389878R312133O715317K237931q125382j843872
$$ 698205261 701510162 700539398 696315231 700705109 710017242 716732559 718970490 710845108 709001236
416.6G09001236N262604n584183j5313263k529907P40280m270020j023712L386307
$$ 709001236 714263840 708679657 693366394 690836487 691576767 687306747 686283035 689669342
424.3F89669342O726608P237473K277603J203842k237015j595687k034607m800110
$$ 689669342 696395950 703633423 705911026 707114868 704877853 703282166 701247559 696447449
432.1F96447449l839493L62320K532120K587127R366227N696029p04269k716370k328873
$$ 696447449 692607956 692970276 695502396 698089523 707455750 713151779 712447510 709731140 707402267
440.7G07402267m632263n515976K991791m629745n891343K904206L869705K949600
$$ 707402267 702770004 697254028 700245819 695616074 689724731 692628937 696498642 699448242
448.4F99448242r17358k092743L889847L791351m787445m989472j753616l985977j513290
$$ 699448242 698530884 696438141 700327988 704119339 699331894 694342422 692588806 688602829 687089539
457.1F87089539O870651L397064l611755k926178M886398M248734j487809m214401
$$ 687089539 693960190 697357254 693745499 690819321 695705719 699954453 698466644 694252243
464.8F94252243k161941l325120q173828m388046P223969R925537j250000p277985
$$ 694252243 692090302 688765182 680591354 676203308 683427277 693352814 692102814 684824829
472.6F84824829J017532L319550K439117l48129n24139m316254n219726K047729P069855
$$ 684824829 685842361 689161911 691601028 691252899 690728760 686412506 681192780 683240509 690310364
481.2F90310364N170898j676025K444610O492081m80118j984405j500397j695862l535614
$$ 690310364 695481262 693805237 696249847 702741928 702261810 700277405 698777008 697081146 693545532
489.9F93545532j581802J290130M93775K147064J095734J170807K591934M661178K043076
$$ 693545532 691963730 693253860 693747635 695894699 696990433 698161240 700753174 705414352 707457428
498.6G07457428l655243n29709l392944o955414o30188j604614P64923K814178R62296
$$ 707457428 703802185 703272476 699879532 692924118 692293930 690689316 691454239 694268417 695230713
507.3F95230713J406937J543655j084824j095047j477661n189590k693177k114868
$$ 695230713 696637650 698181305 697096481 696001434 694523773 689334183 686641006 684526138
515F84526138m329071L45230N363160K859039j852646k14310J453934p07016j938705
$$ 684526138 680197067 680542297 685905457 688764496 686911850 686697540 688151474 687444458 685505753
523.7F85505753j228562j731033l900604j413804P96433L298721K171173J281662L032914
$$ 685505753 684277191 682546158 678645554 677231750 678028183 681326904 683498077 684779739 687812653
532.4F87812653J168289M52118j386490k610550k513580l513184j222153K18964J048813
$$ 687812653 688980942 689433060 688046570 685436020 682922440 679409256 678187103 678406067 679454880
541F79454880K745056M473343K699432J050720J129227o82907j248932k452927k630386
$$ 679454880 682199936 686673279 689372711 690423431 691552658 690869751 689620819 687167892 684537506
549.7F84537506k119675m88891J720428J894455K987976R22699Q74100K707214M80729
$$ 684537506 682417831 681928940 683649368 685543823 688531799 689454498 690328598 693035812 693516541
558.4F93516541j352463k202988k118072j822968q11233M59518K401886J928482J534576
$$ 693516541 692164078 689961090 687843018 686020050 685208817 685668335 688070221 689998703 691533279
567.1F91533279L475495K55050m69589j47857l234864k168350j072998j213913j034622
$$ 691533279 695008774 695263824 694794235 694646378 691411514 689243164 688170166 686956253 685921631
575.8F85921631J98517J42288J341324L166122J392517L25241j021652k522735k588959
$$ 685921631 686120148 686262436 687603760 690769882 692162399 692487640 691465988 688943253 686354294
584.4F86354294k040177q98056J92871J070939O84509J398086J155625K67410k29950
$$ 686354294 684314117 683416061 683608932 684679871 685364380 686762466 687918091 688185501 687955551
593.1F87955551m75845m4174k676087l876037j974030r16290k067795k541962J81351
$$ 687955551 687479706 687435532 684759445 680883408 678909378 677993088 675925293 673383331 673564682
601.8F73564682L45078k132645m962311o621857q094482j0355225j2016143j5228272
$$ 673564682 673909760 671777115 666814804 660192947 652098465 641743240 629727097 614498825
609.5F14498825j8291778j9247933j6619453j6130028j2804642o802292j563453R08317
$$ 614498825 596207047 576959114 560339661 544209633 531404991 524602699 523039246 523947563
617.2E23947563k447014l188095p786941j3232231j7024231j6204453j0415497l569069
$$ 523947563 521500549 518312454 510525513 497293282 480269051 464064598 453649101 450080032
624.9D50080032R455109J7285538K4098968K3718987K1101570J7150993Q324623J091538
$$ 450080032 459535141 476820679 500919647 524638634 545740204 562891197 571215820 572307358
632.7E72307358n817604p909470j1704750j1112938q655701n696716J901665O086388
$$ 572307358 566489754 558580284 546875534 535762596 527106895 521410179 523311844 529398232
640.4E29398232J4679679K1459198K4458008K1966553K0214386J7131729J1281815
$$ 529398232 544077911 565537109 589995117 611961670 632176056 649307785 660589600
647.1F60589600R791336R518051Q122864O220550N412369L909225K872773J635360
$$ 660589600 670380936 679898987 688021851 694242401 699654770 703563995 706436768 708072128
654.8G08072128j145782r69315L67203P62711J34430j29700K963333L817444L218765
$$ 708072128 706926346 705957031 706324234 707086945 707221375 707091675 710055008 713872452 717091217
663.5G17091217K719574Q97903R78318j344986j0875016L379365K200622K44904J419525
$$ 717091217 719810791 720708694 721687012 720342026 709467010 712846375 715046997 715291901 716711426
672.2G16711426J512069K036744L638305L243180J071777r41391j163483j058807j912918
$$ 716711426 718223495 720260239 723898544 727141724 728213501 727272110 726108627 725049820 723136902
680.9G23136902r38721n32760r57261R06067K268219K007981J502304N95398R4146
$$ 723136902 722198181 721665421 720708160 721614227 723882446 725890427 727392731 727988129 728082275
689.6G28082275l97186k310409l108902k049103j715164j843872p8278K614975J946716
$$ 728082275 727685089 725374680 722265778 720216675 718501511 716657639 716579361 719194336 721141052
698.2G21141052Q12149J024781M26483O80465j13906j887818j982956j248016p04956
$$ 721141052 721953201 722977982 723404465 724084930 723971024 722083206 720100250 718852234 718147278
706.9G18147278K37350J976013L158188L236618K387696K236938J998902p9728j156921
$$ 718147278 718384628 720360641 723518829 726755447 729143143 731380081 733378983 733299255 732142334
715.6G32142334j130371p96433m09927K04697Q11386J426163L303375L772049J808700
$$ 732142334 731011963 730215530 729805603 730010300 730821686 732247849 735551224 739323273 741131973
724.3G41131973K34986J26190r66950k550811k103424k158204j555099l00675K87705
$$ 741131973 741366959 741493149 740526199 737975388 735871964 733713760 732158661 731857986 732145691
733G32145691J217270J108475J333999J932678R16138n27191j511841j541290j362000
$$ 732145691 733362961 734471436 735805435 737738113 738654251 738127060 736615219 735073929 733711929
741.6G33711929j337280J93863R86786J312179K517243K407837K923889K933884J281662
$$ 733711929 732374649 732568512 733555298 734867477 737384720 739792557 742716446 745650330 746931992
750.3G46931992J9989p63474N4932j89133m90036Q44650K224503L753586L394546J557236
$$ 746931992 746951981 746188507 746243439 746054306 745564270 746408920 748633423 752387009 755781555 757338791
760G57338791L61099P46689O29883k10800j045380k282486j414337o74896K62603K009659
$$ 757338791 757699890 758446579 759076462 758865662 757820282 755537796 754123459 753448563 753711166 755720825
769.6G55720825J835785R50317J436234J235886l76511p4081n23377q44955l63159
$$ 755720825 757556610 758506927 759943161 761179047 760802536 760728455 760205078 759360123 758996964
778.3G58996964p782J662292J968002K416535K085266K228088K657852J124726L28750
$$ 758996964 758989182 760651474 762619476 765036011 767121277 769349365 772007217 773131943 773460693
787G73460693j359176j219559o30417l56827J27259P6904J410599J761474K241440
$$ 773460693 772101517 770881958 770251541 769894714 770021973 770098877 771509476 773270950 775512390
795.6G75512390J339493J40228m25873j090011l71704j524811j901550o28281J137619
$$ 775512390 776851883 776992111 776566238 775476227 775104523 773579712 771678162 771049881 772187500
804.3G72187500K001724J906052J425247R8953O60248K34909j16882n75485j786499
$$ 772187500 774189224 776095276 777520523 777619476 778279724 778514633 778397751 777822266 776035767
813G76035767q86078K37884R19113N73655O86340J018066J335907P84836q21457o02035
$$ 776035767 775149689 775387573 776306686 776880341 777566681 778584747 779920654 780705490 779884033 779281998
822.6G79281998j121979j849060j030884K05765R9029k61459k06680o44532m02221
$$ 779281998 778160019 776310959 775280075 775485840 775584869 775323410 775116730 774472198 774069977
831.3G74069977p30438q30994n99899j302185l060685l068847j989518k327499j299820
$$ 774069977 773339539 772508545 771908646 770606461 767545776 764476929 762487411 760159912 758860092
840G58860092o03638j8920m75617j000900o2256j304398j117935m28085n18417J15356
$$ 758860092 758256454 758237534 757761917 756761017 756698761 755394363 754276428 753848343 753329926 753445282
849.6G53445282N78461J577911K128601K460251J785202J425629K056656J501541M14276
$$ 753445282 754023743 755601654 757730255 760190506 761975708 763401337 765457993 766959534 767373810
858.3G67373810J178131J656876m00162K70996R21860J029663J474762J131286K102509
$$ 767373810 768551941 770208817 769808655 770079651 771001511 772031174 773505936 774637222 776739731
867G76739731N42145N3711J46255q84552o33469k52075J243057J305237Q41065l21579
$$ 776739731 777281876 777335587 777481842 776597290 775963821 775711746 776954803 778260040 779101105 778779526
876.7G78779526l8071K120590N77927j430817k209778k063903j581345j405716r35059
$$ 778779526 778741455 780862045 781439972 780009155 777799377 775735474 774154129 772748413 771813354
885.3G71813354j392288j616974m654Q81958N38712L65372o34003m56696o33010j532364
$$ 771813354 770421066 768804092 768799438 769681396 770220108 770585480 769951477 769494781 768861771 767329407
895G67329407m38919L96957P45316j1521K23999J665879Q86611j88064n61752j241837
$$ 767329407 766890488 767287445 768032761 768021240 768245239 769911118 770797729 770609665 770047913 768806076
904.6G68806076k002640j706314k019195k171936j695328j227188k45285p10602q72727
$$ 768806076 766803436 765097122 763077927 760905991 759210663 757983475 757738190 757027588 756154861
913.3G56154861q93402r55658r53064k260284k050018k051468k287140j646729j622543
$$ 756154861 755261459 754305801 753352737 751092453 749042435 746990967 744703827 743057098 741434555
922G41434555k50168j55639j092148l34015j034928j310882o70700j033020j041413
$$ 741434555 741184387 741028748 739936600 739602585 738567657 737256775 736586075 735553055 734511642
930.7G34511642p48748L26843L6621l68271J796341K550202J986999J939240J531524
$$ 734511642 733762894 734089737 734126358 733758087 735554428 738104630 740091629 742030869 743562393
939.3G43562393J286774R60312P11441N73501M69208J329041K608261K463836J471253
$$ 743562393 744849167 745809479 746520920 747094421 747563629 748892670 751500931 753964767 755436020
948G55436020J309357J854019J244201j122818j358337o23093q48388m97513o16303
$$ 755436020 756745377 758599396 759843597 758720779 757362442 756739349 755890961 755393448 754777145
956.7G54777145m22592o90994q82950n69076j044465j506042j745529k020874k687988
$$ 754777145 754354553 753663559 752780609 752211533 751167068 749661026 747915497 745894623 743206635
965.4G43206635k451249k383575k155762r87625k81448M3945l82233p26852j424255
$$ 743206635 740755386 738371811 736216049 735228424 734946976 734990921 734608688 733881836 732457581
974.1G32457581j528016j174621k392655k505035j699753j119842n29709q35037j145249
$$ 732457581 730929565 729754944 727362289 724857254 723157501 722037659 721507950 720672913 719527664
982.7G19527664p54394l40424j131363l336487m551010m431000m806594n706482p006836
$$ 719527664 718773270 718432846 717301483 713964996 709413986 704982986 700176392 694469910 687463074
991.4F87463074q039627j0925141j7142791k3467560j8691788L055153K1710586K2672463
$$ 687463074 679423447 668498306 651355515 627887955 609196167 612251320 633961906 656634369
999.1F56634369J3045120O421585K931748N69000L49045K2125J26114P83691J214752
$$ 656634369 669679489 676101074 679032822 679601822 679950867 679972992 680099106 680882797 682097549
1007.8F82097549N32074l39431l45688j542740k365265k404556k335205j995316j713714
$$ 682097549 682629623 682290192 681944504 680401764 678036499 675631943 673296738 671301422 669587708
1016.5F69587708j039277o99844m32358l06930r17664j484375j671600k812882k756576
$$ 669587708 668548431 667848587 667416229 667109299 666191635 664707260 663035660 660222778 657466202
1025.2F57466202k212372k913513j823273j403046j537475j191483o96640l28521q01087
$$ 657466202 655253830 652340317 650517044 649113998 647576523 646385040 645688400 645359879 644558792
1033.8F44558792o69479j566544k370605k509423k221260j470184o21490p7782p40280
$$ 644558792 643889313 642322769 639952164 637442741 635221481 633751297 633129807 633052025 632311745
1042.5F32311745k37465O06384J130295N47752J59607m85573o33621O85768l57742
$$ 632311745 632074280 632680664 633810959 634358711 634518318 634032745 633399124 634084892 633727150
1051.2F33727150n46112o49757N49430J552086N99442J524200O56357K58102l96270
$$ 633727150 633181038 632531281 633080711 634632797 635232239 636756439 637412796 637670898 637274628
1059.9F37274628j455612j649628j776848j315727j669922n68695p63283l94745j26839
$$ 637274628 635819016 634169388 632392540 631076813 629406891 628838196 628074913 627680168 627553329
1068.6F27553329p08274q91648l108253l122788l235664k774162k559777k908516k856292
$$ 627553329 626845055 625953407 622845154 619722366 616486702 613712540 611152763 608244247 605387955
1077.2F05387955l353272r48715j216621j909180k754784l437347l580475m834442
$$ 605387955 602034683 601085968 599869347 597960167 595205383 591768036 588187561 583353119
1085E83353119m601555o368752n777244n573120o353874p738953r148941r268074j2387581
$$ 583353119 578751564 572382812 566605568 561032448 554678574 546939621 537790680 528522606 516135025
1093.6E16135025j2113342j4577484j6012726j6687279j6634407j4021988j6632881
$$ 516135025 504021683 489444199 473431473 456744194 440109787 426087799 409454918
1100.4D09454918j4307518j4943543j3199119j3264389j4472351j2809410j4638672
$$ 409454918 395147400 380203857 367004738 353740349 339267998 326458588 311819916
1107.1C11819916j1150112j3753205j1322803j0676842r617901o863575q433971l665486
$$ 311819916 300669804 286916599 275593796 264916954 255299053 248435478 240001507 236336021
1114.9B36336021m432525q84228k301693j146355O46172J11732L477307k4014L510742
$$ 236336021 231903496 231019268 228717575 227571220 228217392 228329124 231806431 231782417 235293159
1123.5B35293159J301404K406768K655926Q75359K678032r39846J577262k338275j988545
$$ 235293159 236594563 239001331 241657257 242532616 245210648 244270802 245848064 243509789 241521244
1132.2B41521244l293838m685650l454075o367874k055588m981003l346786l197041
$$ 241521244 238227406 233541756 230087681 223719807 221664219 216683216 213336430 210139389
1139.9B10139389k279530k002124n368119l164596o532974l232651n352650m310093
$$ 210139389 207859859 205857735 200489616 197325020 190792046 187559395 182206745 177896652
1147.6A77896652l367882m897918j106015l477668J36413k377681l0823j18294p28550
$$ 177896652 174528770 169630852 168524837 165047169 165183582 162805901 162775078 162656784 161928234
1156.3A61928234K457333n00641L738346Q28609L343239L433495L311329M909897K976398
$$ 161928234 164385567 163884926 167623272 168451881 171795120 175228615 178539944 183449841 186426239
1165A86426239P357788N253430Q382968O715069P748890R608555Q105793J0971184
$$ 186426239 193784027 199037457 207420425 214135494 221884384 231492939 239598732 250569916
1172.7B50569916Q657150J2009831J0670986J1998310J2082176J1209278J2678528
$$ 250569916 259227066 271236897 281907883 293906193 305988369 317197647 329876175
1179.5C29876175J0545921J3552208J0736771J1666298J1057625R820442J0783424
$$ 329876175 340422096 353974304 364711075 376377373 387434998 397255440 408038864
1186.2D08038864R369431J0737228P514954Q582802P933692P678910Q398399P063255
$$ 408038864 417408295 428145523 435660477 444243279 452176971 459855881 468254280 475317535
1193.9D75317535Q195229O940956Q755035Q043099Q400688Q690033P930641Q242951
$$ 475317535 483512764 490453720 499208755 507251854 515652542 524342575 532273216 540516167
1201.6E40516167P375221R116020P355461P268143O877556O146850N888977M371491
$$ 540516167 547891388 557007408 564362869 571631012 578508568 584655418 590544395 594915886
1209.4E94915886N945396N067864N121803N312233N671616N509834L992042M379807
$$ 594915886 600861282 605929146 611050949 616363182 622034798 627544632 631536674 635916481
1217.1F35916481L257027L126678K067566J566773J702957R30023J574478J262589
$$ 635916481 639173508 642300186 644367752 645934525 647637482 648567505 650141983 651404572
1224.8F51404572K137146K078018J669540J748734J430053J264954M07944O36596M43116
$$ 651404572 653541718 655619736 657289276 659038010 660468063 661733017 662140961 662777557 663220673
1233.5F63220673N37185N92499J245499J697006R50317J691895J508789J087646R02787
$$ 663220673 663757858 664350357 665595856 667292862 668243179 669935074 671443863 672531509 673434296
1242.2F73434296J171112O19430k70309K38876J33133O93131K54974K78320R91669
$$ 673434296 674605408 675224838 674954529 675193405 675326538 676019669 676274643 676552963 677544632
1250.8F77544632J293411J516342P52259J027679L51486r8571k30027m05426K30561
$$ 677544632 678838043 680354385 681106644 682134323 682485809 682387238 682157211 681751785 681982346
1259.5F81982346K60772J226425J288834J338348J362076J004029J054992R31778O68488
$$ 681982346 682243118 683469543 684758377 686096725 687458801 688462830 689517822 690449600 691118088
1268.2F91118088J80053Q60138R41239R57260J356201J383209J504364J710663K233353
$$ 691118088 691298141 692158279 693099518 694056778 695412979 696796188 698300552 700011215 702244568
1276.9G02244568J609802J237030Q62503J022644J064224N90745J380462J353684J507263
$$ 702244568 703854370 705091400 705953903 706976547 708040771 708631516 710011978 711365662 712872925
1285.5G12872925J366501J550827J919937J279449J536331J214829J013565R63593
$$ 712872925 714239426 715790253 717710190 718989639 720525970 721740799 722754364 723717957
1293.3G23717957Q47473Q41980P26089J166916J080170J333542J276016O53610R30862
$$ 723717957 724565430 725407410 726133499 727300415 728380585 729714127 730990143 731643753 732574615
1301.9G32574615J150742O60782K12250K69622J46409O4163O88782R98306O78634M80957
$$ 732574615 733725357 734386139 734598389 734868011 735014420 735078583 735767365 736765671 737444305 737925262
1311.6G37925262K4949J5106P87735P65915M63104K16751O42395K80533p70188R04770
$$ 737925262 737950211 737965317 738753052 739518967 739982071 740198822 740841217 741121750 740351562 741256332
1321.2G41256332J590729O58646O60019M27093J82495M22898O64901J08185k18658
$$ 741256332 742847061 743505707 744165726 744592819 744775314 745198212 745863113 745971298 745752640
1329.9G45752640L39966L59420M15879J84555N5542J67236j59149j03150q40225j252975
$$ 745752640 746092606 746452026 746867905 747052460 747108002 747275238 747116089 747012939 746172714 744919739
1339.6G44919739J20926J234054R51843J65253M6234L4485K82440J54953l99704m36096
$$ 744919739 745040665 746274719 747226562 747391815 747438049 747472534 747754974 747909927 747510223 747074127
1349.2G47074127n07583r1782k64206k84882Q0109l34549j03989M36249L22647J64643
$$ 747074127 746566544 746474762 746210556 745925674 746005783 745671234 745567245 746003494 746326141 746490784
1358.8G46490784r7351j034928p00073m48608j042633P55538K66343q01468n18036
$$ 746490784 746393433 745358505 744658432 744209824 743167191 743922729 744189072 743387604 742869568
1367.5G42869568m28391J87760K89993k84271k01492p44858k120514j088562K53906
$$ 742869568 742441177 742628937 742918930 742634659 742433167 741688309 739567795 738479233 738733139
1376.2G38733139J28708p87430n20019L59344J77841j92947p72324l04947M12598O42471
$$ 738733139 738861847 738074417 737554398 737913742 738091583 737898636 737126312 736821365 737233963 737876434
1385.8G37876434l84140j902923J060333J243591J30692J52130Q12836Q49075j826172
$$ 737876434 737492294 735589371 736649704 737893295 738023987 738176117 738988953 739838028 738011856
1394.5G38011856j747284R64584N0660j296006k281112O8283M57229j16424O26449
$$ 738011856 736264572 737229156 737279816 735983810 733702698 733770981 734228210 734111786 734738235
1403.2G34738235O9046j872177j87759Q24585M9972k66037p14645r61609r51996l66897
$$ 734738235 734807281 732935104 732747345 733571930 733621902 733355865 732641220 731679611 730727615 730360718
1412.8G30360718J21841j39999r1934l23029K98538L54843k698516P22808J728974
$$ 730360718 730482559 730342560 730250626 729927597 730226135 730580978 727882462 728605270 730334244
1421.5G30334244J78680j603927j328431J829377J698455O76728J043167L88870n60303
$$ 730334244 730512924 728908997 727580566 729409943 731108398 731785126 732828293 733217163 732656860
1430.2G32656860J358414J370697j32446k09427P96585K23846k982254J026230K677078
$$ 732656860 734015274 735385971 735253525 735044098 735840683 736064529 733082275 734108505 736785583
1438.9G36785583J711884Q31528Q78448R92813P40586J04751q7127O0806o66046j448517
$$ 736785583 738497467 739328995 740207443 741200256 741940842 742045593 741958466 742019272 741353226 739904709
1448.5G39904709R66797J639633N58853O24390J351623J098862K94113l07312m379883
$$ 739904709 740871506 742511139 743069992 743694382 745046005 746144867 746438980 746131668 741751785
1457.2G41751785j981048L721771K451324J934815P22885J046143J665573j164246
$$ 741751785 739770737 743492508 745943832 747878647 748601532 749647675 751313248 750149002
1464.9G50149002J448288K320557J181488P45849L96118L03193k178116l050156K879105
$$ 750149002 751597290 753917847 755099335 755845184 756241302 756544495 754366379 751316223 754195328
1473.6G54195328M344787K404938L50266K446518K639083J691742R49707p11364m60511
$$ 754195328 758540115 760945053 761295319 763741837 766380920 768072662 769022369 768311005 767850494
1482.3G67850494R8801l72314K05917L16086j021118L13415J548538k275848L43170
$$ 767850494 767949295 767576981 767782898 768098984 767077866 767391281 768939819 766663971 767007141
1491G67007141K915573Q13294o04935o30569j468888m878387J332092n75104r60235
$$ 767007141 769922714 770736008 770131073 769500504 768031616 763153229 764485321 763910217 762949982
1499.6G62949982K007675R43298M86374l9673K92816p59124p459565q374786J22681
$$ 762949982 764957657 765900955 766387329 766347656 766640472 765881348 758421783 750046997 750169678
1508.3G50169678K679519J240235K068863n65644k16598J687775P095n93643m555893
$$ 750169678 752849197 754089432 756158295 755592651 755376053 757063828 757070923 756477280 751921387
1517G51921387k280274K507401J87225o194992n580368L632507L558045K006073r84040
$$ 751921387 749641113 752148514 752335739 746140747 740560379 744192886 747750931 749757004 748772964
1525.7G48772964J339875L90167j540070O17066j91422j725616j849365k378617k655410
$$ 748772964 750112839 750503006 748962936 749580002 749388580 747662964 745813599 743434982 740779572
1534.3G40779572J885376J142730L69034N23529o113357l499680L749619J173248j898880
$$ 740779572 742664948 743807678 744176712 744700241 738586884 735087204 738836823 740010071 738111191
1543G38111191Q72650N6686j759338J929321J042786P15027j379776L15780L707047
$$ 738111191 738983841 739040527 737281189 739210510 740253296 740968323 739588547 739904327 743611374
1551.7G43611374J153107j93711l916931q2626K085953J82037j614761r339600N751648
$$ 743611374 744764481 744570770 740653839 740571213 742657166 742839203 741224442 731884842 737636490
1560.4G37636490M732666L563843K128601L70941q18100K15683L37677j081162j529159
$$ 737636490 742369156 745932999 748061600 748432541 747614441 747830124 748167801 747086639 745557480
1569.1G45557480n484924K110595K463608L96652N31922L01132n59235o205368K019119
$$ 745557480 740072556 742183151 744646759 745043411 745575333 745876465 745317230 739111862 741130981
1577.7G41130981J101456j311951j468124k149277j100082j432724n96619o34155m39911
$$ 741130981 742232437 740920486 739452362 737303085 736203003 734770279 734173660 733539505 733099594
1586.4G33099594j08261j402206j001893k196807k236939k956924k466049k948304
$$ 733099594 732991333 731589127 730587234 728390427 726153488 723196564 720730515 717782211
1594.1G17782211l134918p19757j129608k34833j218414j001587j934433k541580k365799
$$ 717782211 714647293 713927536 712797928 712563095 711344681 710343094 708408661 705867081 703501282
1602.8G03501282m031525k131042k551346j939850k887802j747437j132660j412811
$$ 703501282 699469757 697338715 694787369 692847519 689959717 688212280 687079620 685666809
1610.5F85666809M61731j721420j170807l078079k322998k921601r397201J668014
$$ 685666809 686128540 684407120 683236313 680158234 677835236 674913635 665516434 667184448
1618.2F67184448n13000m1504j505432Q2626j112976l650818J328812m57459j39389
$$ 667184448 666671448 666629944 665124512 665207138 664094162 660443344 661772156 661314697 661175308
1626.9F61175308m555893k614135o59638j241455n32074j239624J195602m15420k126694
$$ 661175308 656619415 654005280 653345642 652104187 651572113 650332489 651528091 651112671 648985977
1635.6F48985977r88998J816330R62753p4844K59246j663894N13534l11355J435013
$$ 648985977 647996979 649813309 650776062 650701218 650960464 649296570 649810104 649498749 650933762
1644.3F50933762J393432j737060K809524L81470L482056J513366J898270L45306j1217651
$$ 650933762 652327194 650590134 653399658 653781128 657263184 658776550 660674820 661020126 649802475
1653F49802475K415619N695419M972458J786270K672196K497940K564316K501678J556015
$$ 649802475 652218094 657913513 662885971 664672241 667344437 669842377 672406693 674908371 676464386
1661.6F76464386O30417q6060K939377J206131J248856J448288R01870J050339J853485
$$ 676464386 677094803 677008743 679948120 681154251 682403107 683851395 684753265 685803604 687657089
1670.3F87657089L727951K590256M108505L002472m19388q59756K685776K526321P72705
$$ 687657089 691385040 693975296 698083801 701086273 700666885 699807129 702492905 705019226 705791931
1679G05791931J801911J251907L190689L882065j570587r93500O127777M935913K010498
$$ 705791931 707593842 708845749 712036438 715918503 714347916 713354416 719482193 724418106 726428604
1687.7G26428604R11179J407013J116485K410126K279129K502441K311249J939087
$$ 726428604 727339783 728746796 729863281 732273407 734552536 737054977 739366226 741305313
1695.4G41305313l93677M205704M799347L660278o6986l246307N106506L533325J752320
$$ 741305313 740911636 745117340 749916687 753576965 753509979 750263672 755370178 758903503 760655823
1704.1G60655823K59857J730728K807312L789673L777084J328354Q73184J665802J116181
$$ 760655823 760915680 762646408 765453720 769243393 773020477 774348831 775222015 776887817 778003998
1712.8G78003998P32727j626129j214066K081680O34842l300705M570237L620224J544647
$$ 778003998 778736725 777110596 775896530 777978210 778613052 775312347 779882584 783502808 785047455
1721.4G85047455Q24509k10038n36957K39258O0349q7815M38233P11212j059112N94711
$$ 785047455 785871964 785661926 785124969 785364227 785424576 785336761 785774994 786486206 785427094 786021805
1731.1G86021805L136978K751465k939453l990174M613190K686386M4785j53k058182
$$ 786021805 789158783 791910248 788970795 784980621 789593811 792280197 792324982 792324829 790266647
1739.8G90266647m28238L734971K030792o23932J186218K552567J263733J02691J19705
$$ 790266647 789838409 793573380 795604172 794980240 796166458 798719025 799982758 800085449 800205154
1748.4H00205154M21296J802749j157837R0790L396759K045365J480407J016388K33460
$$ 800205154 800626450 802429199 801271362 801362152 804758911 806804276 808284683 809301071 809534531
1757.1H09534531J931381J694565J039428L00293l683776k30942K372284J069336R03396
$$ 809534531 811465912 813160477 814199905 814500198 810816422 810585480 812957764 814027100 814930496
1765.8H14930496J003494J47171p11822K061081J526871k146378l011627M29306L010940
$$ 814930496 815933990 816081161 815369339 817430420 818957291 816810913 813799286 814228592 817239532
1774.5H17239532N01175j148223J159515Q42895J152039K76947j94702J421585J146469
$$ 817239532 817740707 816592484 817751999 818594894 819746933 820023880 819829178 821250763 822397232
1783.2H22397232J77078j568145p40357Q72498N02166J00098K98157j65482l88641
$$ 822397232 822574310 821006165 820265808 821138306 821640472 821740570 822038727 821873245 821484604
1791.8H21484604j319504J481094K551041l23181q25653J013489O91986j318894j266937
$$ 821484604 820165100 821646194 824197235 823874054 823048401 824061890 824753876 823434982 822168045
1800.5H22168045J073151j14518J038743J539611M78974M12216l79562l55225K78854
$$ 822168045 823241196 823126678 824165421 825705032 826184006 826596222 826216660 825861435 826140289
1809.2H26140289m58450j462784N42298P90481L92532R33686L40957L62397k22855
$$ 826140289 825681839 824219055 824761353 825551834 825944366 826878052 827219009 827581406 827358551
1817.9H27358551M79736N90439q54568l38440l49579M29077m51355k184830J603089
$$ 827358551 827838287 828428726 827574158 827235718 826886139 827315216 826863861 824679031 826282120
1826.5H26282120K034530Q96531j260605j931687J944809J121216o72226m90265l56979
$$ 826282120 828316650 829213181 827952576 826020889 827965698 829086914 828414688 827924423 827567444
1835.2H27567444N493k0676M53110J409531N88455J041946M64402k87171r92584l767090
$$ 827567444 827572937 827552261 828005371 829414902 830003357 831045303 831509705 831222534 830229950 826462860
1844.9H26462860J264267R65805m75082J25961P05185P13730M31824J073608M07333
$$ 826462860 827727127 828692932 828217850 828343811 829048996 829762726 830194550 831268158 831675491
1853.6H31675491r3994j39847k89383m49142j034470j02539R8572P4387L45535N32761
$$ 831675491 831581497 831441650 831152267 830703125 829668655 829566116 829664688 829739075 830084610 830617371
1863.2H30617371O52618N39780L94287p88422j140289j446839O6681Q76770N1575J92795
$$ 830617371 831269989 831809769 832204056 831415634 830275345 828828506 828895187 829771957 829823532 830016327
1872.8H30016327K57950N59082P31277Q77915L53546r8191K0981l49350n20858j026459
$$ 830016327 830274277 830833359 831564636 832442551 832796097 832697906 832718887 832369537 831848679 830822220
1882.5H30822220m26560l11889l62320N68619R42916J216813l17231r16595R40323
$$ 830822220 830395660 830083771 829721451 830290070 831232986 832449799 832132568 831215973 832156296
1891.2H32156296N53436m03824o62842j101837q01925M60586O47125P84455N24444
$$ 832156296 832709732 832305908 831643066 830541229 829739304 830199890 830847015 831631470 832155914
1899.8H32155914M69818M33350k65655j29395n49164m73709k34222m97818k65961l24478
$$ 832155914 832625732 833059082 832793427 832664032 832114868 831641159 831406937 830909119 830643158 830318680
1909.5H30318680p6676N33448Q85772M67148N41229J43128m93851l59649j982575n83496
$$ 830318680 830242004 830775452 831661224 832128372 832669601 832812729 832318878 831959229 829976654 829393158
1919.1H29393158O55670K23923J89056k33230O05240J117630L66058m36783k5177k8229
$$ 829393158 830048828 830272751 830461807 830228577 830833817 831951447 832317505 831880722 831855545 831827316
1928.8H31827316n50537n73730m10996N8747Q5067J41449P0572O53763O64673j88370
$$ 831827316 831276779 830703049 830292053 830350800 830435867 830577316 830647888 831301651 831966324 831777954
1938.4H31777954j16196l18451r3154j423340j658554R75799N94483L8757L00980O47659
$$ 831777954 831661758 831343307 831250153 829826813 828168259 829144058 829738541 829777298 830078278 830725937
1948.1H30725937M48456M34112J72196l32947k22015p49360m28314p4615l33100q2245
$$ 830725937 831174393 831608505 831780701 831447754 831225739 830476379 830048065 829973450 829640350 829558105
1957.7H29558105K10953N08042M41818N04074K50320k34756p63702n30472j29013j119538
$$ 829558105 829769058 830277100 830718918 831222992 831473312 831238556 830474854 829944382 829815369 828695831
1967.3H28695831o65512L13874N08346P15485M51507K70157N69000K86637n95932n78461
$$ 828695831 828030319 828344193 828852539 829568024 830019531 830289688 830858688 831145325 830549393 829970932
1977H29970932m51050n99365p79114n62820J85394L34168M47311M04510L64762J45950
$$ 829970932 829519882 828920517 828141403 827578583 827763977 828098145 828545456 828949966 829314728 829460678
1986.6H29460678n74722r03931n03998K29950k93350q27713K30637L67584N52673J067658
$$ 829460678 828885956 827982025 827478027 827707977 827414627 826586914 826817551 827185135 827737808 828805466
1996.3H28805466M87137p3548N3101q7891k02713o52771q61740k23083P858j75705
$$ 828805466 829292603 829219055 829272156 829184265 828981552 828328781 827467041 827243958 827251816 827076111
2005.9H27076111J2970N82504N44205K99606K61612m18472q52967n51376l07541k55356
$$ 827076111 827089081 827671585 828215790 828515396 828777008 828358536 827505569 826954193 826646652 826391296
2015.6H26391296n47180n10330L58734N73349O87027P77893J56098m4785m9820k04544
$$ 826391296 825844116 825333786 825692520 826265869 826952896 827730789 827886887 827842102 827792282 827587738
2025.2H27587738p06482n45273j54342o56968k00424J59302L18527P21665N85937K23999
$$ 827587738 826881256 826335983 826181641 825524673 825324249 825483551 825802078 826523743 827109680 827333679
2034.9H27333679j94549L357l66822p50503n69077p44858o47277J47705Q48694N56488
$$ 827333679 827139130 827142487 826775665 826025162 825456085 824711227 824063950 824211655 825060349 825616837
2044.5H25616837L84216L19824J91193J34735m63257m84543m51431p03888r37576n12238
$$ 825616837 826001053 826320877 826512070 826646805 826183548 825699005 825247574 824543686 823606110 823093872
2054.1H23093872L40881O95877Q32825L80402K61993L37982j41372p08618q55713o50788
$$ 823093872 823434753 824130630 824963455 825343857 825605850 825943832 825802460 825093842 824238129 823587341
2063.8H23587341j133041r07822K5254K53295K04545J05972M00696N34057k11639p73087
$$ 823587341 822454300 821546478 821571732 821825027 822029572 822135544 822536240 823070297 822858658 822085571
2073.4H22085571p83996j108551j096268p27539l16391q4457k7161N08118M16030K39640
$$ 822085571 821301575 820193024 819096756 818369217 818052826 817968369 817941208 818449326 818865356 819104996
2083.1H19104996L65295K3804k59628n95398o35910n02396l84293l4790K76108L89481
$$ 819104996 819470291 819494095 819234467 818639069 818003159 817500763 817116470 817081680 817357788 817747269
2092.7H17747269O58950O62461K97928M77447J04370k53982m5548j64032k25906k23084
$$ 817747269 818406219 819068680 819366608 819844055 819948425 819694443 819648895 819484863 819258957 819035873
2102.4H19035873P5455J70059O79703R90601M70581O08520M14734j92642l97492j23519
$$ 819035873 819111328 819281387 819961090 820951691 821422272 822030792 822445526 822252884 821855392 821731873
2112H21731873k19651n69839k01035K22931L46756M62570Q48847L50876j98746k11716
$$ 821731873 821512222 820942383 820741348 820964279 821311035 821773605 822622452 822973328 822774582 822562866
2121.6H22562866m62799k68402n71976p34329n66559k90603J68762K29034M65393L43170
$$ 822562866 822100067 821831665 821259689 820525360 819958801 819668198 819836960 820065994 820531387 820874557
2131.3H20874557J93482K35825J12152l86811n73806k87476m31824k8686R7198J85623
$$ 820874557 821068039 821303864 821416016 821029205 820455399 820167923 819736099 819707413 819804611 819990234
2140.9H19990234L91465L55148Q73032O85119L11966J69220J08414n08194j158753
$$ 819990234 820381699 820736847 821609879 822294998 822606964 822776184 822884598 822376404 821217651
2149.6H21217651k79159L66058M56085L40042M61121J006546N75028k20490j99661
$$ 821217651 820938492 821304550 821760635 822100677 822561798 823568344 824143372 823922882 823723221
2158.3H23723221N2032m75006q62732m98199r2545Q8806L52707M44031N49164O13479
$$ 823723221 823775253 823300247 822437515 821939316 821846771 821935577 822288284 822732315 823281479 823894958
2167.9H23894958j91116n26962k94342j05438n40238j173630m70962j32980J7013K09503
$$ 823894958 823703842 823176880 822882538 822777100 822236862 821063232 820592270 820459290 820476303 820685806
2177.6H20685806J86920P23954O34308o7444m29459j62811j07651l29208p92694o40717
$$ 820685806 820872726 821596680 822230988 822163544 821734085 821571274 821463623 821134415 820341721 819701004
2187.2H19701004M99191N62592O22711P06329N07355O51627J32141Q4228L97950j79291
$$ 819701004 820200195 820762787 821385498 822091827 822599182 823250809 823382950 823467178 823865128 823685837
2196.9H23685837o24619J43738L73764m5700L76205N82123O63681O26831J16883j56632
$$ 823685837 823061218 823204956 823578720 823533020 823909225 824491348 825155029 825781860 825898743 825742111
2206.5H25742111K4643l61481p78732M5624K83508J5106L7613J07422M77524N64423
$$ 825742111 825766754 825405273 824626541 824672165 824955673 824970779 825008392 825115814 825593338 826157761
2216.1H26157761J58081L814M01307p8888p26853p42340l81012K98386O6223l8147
$$ 826157761 826315842 826319656 826720963 826642075 825915222 825172882 824791870 825090256 825156479 825118332
2225.8H25118332K99988N60913M22516o638J94092l12424o19659l15323m41895J984
$$ 825118332 825418320 825979233 826401749 826395111 826589203 826276779 825657120 825341797 824899902 824901886
2235.4H24901886J79901k25448k45057J84174P60422N02395K8916J0299n15060o91452
$$ 824901886 825081787 824856339 824611282 824795456 825555878 826058273 826087189 826097488 825582428 824890976
2245.1H24890976l81775m24423j75018J5563J67008O59561O70319L05175M24119K66723
$$ 824890976 824509201 824084778 823909760 823925323 824092331 824751892 825422211 825727386 826151505 826418228
2254.7H26418228j95694J22147N6686o53305p39746l50723k14691P1945M24042K61611
$$ 826418228 826222534 826344681 826401367 825748062 825008316 824657593 824442902 824514847 824938889 825200500
2264.4H25200500K34910K41851L21274N9815m29230m24194k35520J14365j72119j47553
$$ 825200500 825435410 825677261 825998535 826058350 825629120 825204926 824969406 825083771 824911652 824764099
2274H24764099J60828J64413L19977K44141L73306K8686k3727j06430n54657l71857
$$ 824764099 824924927 825089340 825409317 825653458 826026764 826055450 826031723 825925293 825370636 824998779
2283.7H24998779n23376K1667L07999O7062J47324P7286K95410R2010k14080l02582
$$ 824998779 824475403 824497070 824805069 824872131 825019455 825096741 825392151 825484161 825270081 824967499
2293.3H24967499m7760M6844k01645l32260j04370O14395K28653j526j02691n2033
$$ 824967499 824919739 824966583 824764938 824432678 824328308 824942703 825171356 825169830 825067139 825015106
2302.9H25015106L45612m26026j22070l9444p37762n54047O7902L95279m55094m43039
$$ 825015106 825360718 824934692 824812622 824773178 824035416 823481369 823549271 823944550 823489456 823046417
2312.6H23046417j8997L30582L13492k94571K5405K5025m31519p01141k13318P9270
$$ 823046417 823027420 823358002 823671494 823376923 823402328 823427353 822995834 822294693 822081375 822160645
2322.2H22160645m83704l10974K12555L16696k90756o40793k50168K56042o70318o77872
$$ 822160645 821676941 821365967 821578522 821895218 821604462 820963669 820713501 820969543 820299225 819621353
2331.9H19621353R14078Q3160o10962K08359R70612O80389P59277M21982j548614j432343
$$ 819621353 820535431 820618591 820007629 820215988 821186600 821866989 822626266 823048248 821499634 820067291
2341.5H20067291m17251J254577J299362p30896p9193N52521J143570J478272p4463
$$ 820067291 819650040 820904617 822203979 821473083 821393890 821946411 823089981 824568253 824493790
2350.2H24493790j318589l87344L10364M6844j62201j8768p36694p91474n10711j181565
$$ 824493790 823175201 822787857 823098221 823145065 822982864 822964096 822227402 821435928 820925217 819743652
2359.8H19743652K26670J62811p7591Q53729J72043L43628L99551J240921J001740
$$ 819743652 819970322 820133133 820055542 820909271 821081314 821424942 821824493 823065414 824067154
2368.5H24067154k17056j90430M1580J039734M42200M5242O50864L41339O1188p5531
$$ 824067154 823850098 823659668 823701248 824740982 825183182 825228424 825879288 826220627 826281815 826206284
2378.2H26206284J00097J64185M07181N32836N5390J03607L56827J49078N6687J8997
$$ 826206284 826306381 826470566 826877747 827410583 827465973 827569580 827926407 828075485 828132172 828151169
2387.8H28151169M4555J09864m21372j73416J97220L3875L24249l8986K4871J12610
$$ 828151169 828195724 828305588 827884216 827710800 827908020 827941895 828266144 828227158 828252029 828364639
2397.4H28364639k49328K060L7078o2484j80664q8578l67126j78452M53339K5101n7221
$$ 828364639 828115311 828117371 828154449 828091965 827911301 827822723 827455597 827277145 827730484 827755585 827698364
2408.1H27698364P9575J69220K52228Q8501k84043k83127L58048j91498o75583p324
$$ 827698364 827777939 827947159 828199387 828287888 828003845 827720718 828078766 827887268 827211685 827204361
2417.7H27204361K46658j76315o2256N34516K25143k81067l83377j43890p2327j00937
$$ 827204361 827451019 827274704 827212448 827746964 827972107 827691040 827307663 827163773 827091446 826990509
2427.3H26990509p7972l99094j39389J64947K91520M48761j5564n38254j49536J36413
$$ 826990509 826912537 826513443 826374054 826539001 826830521 827279282 827263718 826725464 826575928 826712341
2437H26712341k76642p324L37296M58832r0943o61468j72119q7510J14365J37558n7297
$$ 826712341 826435699 826428375 826765671 827224503 827133560 826472092 826299973 826212463 826326828 826464386 826407089
2447.6H26407089j18942j60294j90963o50864o2561K61383K49558L33023l67279N3405
$$ 826407089 826288147 826127853 825936890 825286026 825223465 825484848 825734406 826067429 825700150 825753555
2457.2H25753555K49863p5150L22342J75782l95966n73578m28924l10440M4631K66343
$$ 825753555 826003418 825928268 826250610 826426392 826030426 825456848 825027924 824717484 824762115 825028458
2466.9H25028458n1880J9531L07007k93427m59594K61459L51181K6550m12674j42517
$$ 825028458 824976578 824996109 825303116 825009689 824550095 824811554 825162735 825189285 824776611 824634094
2476.5H24634094K12708l17078j65558Q3084j9378J90201k93732p47681O8207P12662
$$ 824634094 824846802 824529724 824364166 824447250 824427872 824618073 824324341 823576660 823644867 824357529
2486.2H24357529M45862l36152q45565n77927l39203Q7128M63257N29708P0191n18112
$$ 824357529 824803391 824467239 823621674 823043747 822704544 822791672 823254929 823784637 823854828 823336716
2495.8H23336716k26746j39770r4147Q468j4495j77384j77307L65906L967p1869L38745
$$ 823336716 823109970 822970200 822876053 822884521 822870026 822692642 822515335 822881241 822885208 822813339 823152084
2506.4H23152084J2818m48151m55856n3940P7362K16675k30408m69971r4604p8049
$$ 823152084 823164902 822716751 822260895 822206955 822284317 822500992 822270584 821800613 821706009 821627960
2516.1H21627960R5062J75171J32141k53829j78071O9962n646J93405k5177j7318j03073
$$ 821627960 821723022 821898193 822030334 821776505 821598434 821668396 821662750 821856155 821830978 821813660 821710587
2526.7H21710587j19706j66855k68630J38397r2545k85034k75650J99814L98941j90582
$$ 821710587 821590881 821424026 821155396 821293793 821201248 820916214 820640564 820840378 821239319 821048737
2536.3H21048737j97525k9755L13644J450m25797r6969k1057j34507r4604j05820l96271
$$ 821048737 820851212 820821457 821135101 821136551 820710754 820613785 820592728 820458221 820363617 820257797 819861526
2546.9H19861526P5837L25164j10244j57013l55072j94321J4877r7046K8611J08185
$$ 819861526 819937363 820262527 820152283 819995270 819640198 819445877 819460754 819363708 819392319 819500504
2556.6H19500504q3695q7738J36948J25580j4802j76467k80228j97678K62909L1891
$$ 819500504 819416809 819329071 819466019 819591599 819576797 819400330 819120102 818922424 819185333 819217224
2566.2H19217224k65350O5918k37198j36261j05667j83258J65863K54287N2109m31595
$$ 819217224 818951874 819017792 818780594 818644333 818538666 818355408 818521271 818775558 818827667 818396072
2575.9H18396072n9433M5472j87149l4714M3411R9106k72522j49765l68576j71738
$$ 818396072 818336639 818382111 818194962 818160248 818203659 818302765 818030243 817880478 817511902 817340164
2585.5H17340164N11704j65482m29153k06147j30539j67999O256K11716p7591n6381
$$ 817340164 817851868 817686386 817257233 817051086 816920547 816752548 816758804 816970520 816892929 816836548
2595.1H16836548P1564J32293j61285m46701k51084K14158L45764k976R156l33939
$$ 816836548 816908112 817040405 816879120 816432419 816181335 816395493 816741257 816738281 816747437 816413498
2604.8H16413498o79474n37567j42746K63824J18103N875j7166k5559k27127K4567
$$ 816413498 815734024 815196457 815053711 815317535 815435638 815441513 815424347 815398788 815171661 815196228
2614.4H15196228L26157m73328n19562J54877M4098k83432k54135k75879p8812K44904
$$ 815196228 815522385 815049057 814529495 814684372 814728470 814445038 814190903 813915024 813836212 814081116
2624.1H14081116k2049l17078k74811J50299J69754l59268l61175n1270m7073j95084
$$ 814081116 814059067 813741989 813467178 813617477 813787231 813427963 813066788 813015518 812968445 812773361
2633.7H12773361O7597J11999j17187l9063l09296n00946N5161J04065l06702j79443
$$ 812773361 812840958 812952957 812835770 812796707 812487411 811986465 812041626 812145691 811838989 811659546
2643.4H11659546q5449J97754j4344l38897j15891l86963K1134m3030m53797M197l51868
$$ 811659546 811574097 811771851 811757507 811418610 811302719 810915756 810936890 810893860 810440063 810444260 810092392
2654H10092392m55856K43683J83334n43518J19324P93304j79062n15137m6157K28576
$$ 810092392 809636536 809880219 810063553 809520035 809639359 810432663 810253601 809738464 809692307 809920883
2663.6H09920883m04892n41305M7683j04293K9449n1346j42441q6822j00861K16828
$$ 809920883 809515991 808974686 809022369 808918076 808947525 808896179 808753738 808666916 808566055 808782883
2673.3H08782883R7885J06277q6288o77643p15027j67389M30069N3787o99462l88794
$$ 808782883 808880768 808987045 808900757 808223114 807508087 807340698 807770767 807824554 807125092 806736298
2682.9H06736298J22146r231K7160O4087j6174j46256l51867j72425J48316L9062m16717
$$ 806736298 806858444 806849213 806876373 806940460 806924286 806778030 806426163 806253738 806402054 806441116 806024399
2693.5H06024399p7362l9292k82058N22003J04980n53207K5711O3934k23236k69089
$$ 806024399 805947037 805907745 805625687 806147690 806252670 805699463 805725174 805789108 805565872 805296783
2703.1H05296783m50058o13098r2621K69471J6403J51749N5847n72510o39801J48239
$$ 805296783 804846725 804233627 804141006 804410477 804426880 804578629 804634476 804061966 803422165 803570404
2712.8H03570404L98026j64032k11258n33524o01654L33862L42789p3853j99127K40631
$$ 803570404 803968430 803804398 803593140 803059616 802457962 802791824 803134613 803060760 802861633 803102264
2722.4H03102264O02570l39203m12521j77994o15845n89676l31497L7079o2180j75476
$$ 803102264 803704834 803365631 802953110 802775116 802159271 801569595 801238098 801275177 801212997 801037521
2732.1H01037521k98767j93023J63269M6386L16391K07596p3318k66190p03735n11475
$$ 801037521 800738754 800545731 800709000 800755386 801071777 801279373 801206055 800939865 800236130 799724655
2741.7G99724655j85318j87683k29111K69852N33524M36172Q3695p15714n13611j68609
$$ 799724655 799539337 799351654 799122543 799392395 799925919 800362091 800445786 799730072 799216461 799047852
2751.4G99047852l16010k05078P3700J45874j12076j25351r6130k36969p3776m1886
$$ 799047852 798731842 798526764 798600464 798746338 798634262 798508911 798412781 798175812 798102036 798060150
2761G98060150o14624j79062J17417n18418j89743k27737Q3618J13602p71866j17188
$$ 798060150 797445526 797266464 797383881 796865463 796675720 796447983 796531601 796645203 795873337 795756149
2770.7G95756149L59040J31912M8141R995l70178r01032n57098k90528j76696j14670
$$ 795756149 796115189 796247101 796295242 796305237 795935059 795034027 794476929 794186401 794009705 793895035
2780.3G93895035j08109J86920K93656j05515m16183n1956L0594k58637o01883n60455
$$ 793895035 793786926 793973846 794267502 794161987 793745804 793693848 793724442 793465805 792863922 792303467
2789.9G92303467m40140m53262M62036N58853l72467m21829k1973j40839n60989n11703
$$ 792303467 791863327 791410065 791872101 792430954 792058487 791636658 791614685 791473846 790912857 790401154
2799.6G90401154l40195k62299k13241l32794n22690n40390j53962J42746L8147q1481
$$ 790401154 790060959 789798660 789585419 789252625 788729935 788189545 788035583 788178329 788216476 788134995
2809.2G88134995j93635o56127q35724k52381L7003l39661k85949j35117l47138k75192
$$ 788134995 787941360 787285233 786449509 786197128 786234131 785894470 785608521 785473404 785126266 784851074
2818.9G84851074m66995m26636O0730O9275n53131p32880J05820j86691p40509o70014
$$ 784851074 784384079 783957443 784018173 784087448 783534317 782801437 782907257 782720566 781980057 781310043
2828.5G81310043o98394L7536L22037j18713k76490o8283m98504p88498m50821r90525
$$ 781310043 780611649 780649185 780971222 780852509 780576019 780507736 780009232 779220734 778769913 777779388
2838.2G77779388r44671q37250q02231l80707o36215o62842j133880j368180p33642
$$ 777779388 776834717 775997467 775195236 774814529 774178314 773515472 772381592 771013412 770279770
2846.8G70279770p48367j382065j348572o21109n50461n68390m04052l77427k32849
$$ 770279770 769531403 768149338 766800766 766179657 765629196 765060806 764656754 764279327 764046478
2855.5G64046478R766r3842N0202N32684p5607n83725o71997l80249k95334o09741
$$ 764046478 764056244 763962402 764012604 764545288 764469681 763885956 763213959 762833710 762538376 761928635
2865.2G61928635K32391K05917q23059j265640k57797M65088n94330m97666r3002j73874
$$ 761928635 762161026 762366943 761543884 760278244 760020447 760485535 759891205 759393539 759300537 759126663
2874.8G59126663n85251j142425o99768j67771K69089o6452l73230k45666l11890j39389
$$ 759126663 758541412 757398987 756699219 756531448 756800537 756734085 756360855 756115189 755803299 755663910
2884.4G55663910m73099p22351m27704j77917j69220l69492q17413m87671k3575n36499
$$ 755663910 755190811 754468460 754040756 753862839 753693619 753324127 752506714 752019043 751995468 751458969
2894.1G51458969l56064p92694r79996J1826j755l84063r28727o32171j31150j39618
$$ 751458969 751102905 750310211 749330215 749342041 749340286 748956223 748027496 747395325 747264175 747124557
2903.7G47124557j9760k03857j63956r99450j112061j12228k67105p6523J1902r30710
$$ 747124557 747104797 746900940 746736984 745737534 744625473 744513245 744246140 744169617 744181519 743250809
2913.4G43250809j386414q64792l28521m95606q52127q08182q67462q22067j49613
$$ 743250809 741864395 740999603 740671082 740175476 739323349 738515167 737647705 736825638 736676025
2922.1G36676025k61764n82733j52283J54495J00937j34659p7591j1901K00653P8506
$$ 736676025 736414261 735831528 735679245 735833740 735934677 735800018 735722427 735710526 735911179 735989685
2931.7G35989685m31900J8311O28738O16150K85721Q2397k0904O7749P13653P28455
$$ 735989685 735557785 735576096 736204834 736820984 737106705 737189102 737168198 737235947 737949600 738678055
2941.3G38678055l3035k25831L25013N52139O4621l1128K71606J49994j3656l44010
$$ 738678055 738645020 738419189 738744202 739296341 739360962 739329834 739601440 739751434 739737778 739393768
2951G39393768q29620l09677K13318n11093n03235K10495r3766M5777M24270M1962
$$ 739393768 738564148 738254471 738467789 737956696 737453461 737663956 737570190 737615967 738040237 738082199
2960.6G38082199p1716m37241m49524K45743M52118N25360O41022Q32825P35931M04968
$$ 738082199 738010483 737573242 737123718 737369461 737821579 738346939 738987961 739820786 740556717 740961685
2970.3G40961685M56772K15912J80969O47736M68750J83792K88315K83737L30810M46854
$$ 740961685 741418457 741634369 741815338 742463074 742931824 743115616 743403931 743687668 744018478 744465332
2979.9G44465332M88205M24347M80194L69110N7526L23333P32193O53611k0371k21481
$$ 744465332 744953537 745377884 745858078 746227188 746284714 746608047 747340240 747993851 747973480 747751999
2989.6G47751999K14157N03311P50122L64990J73111P3853J17798N91736j62735o38886
$$ 747751999 747966156 748469467 749219589 749584579 749757690 749831543 749949341 750541077 750378342 749739456
2999.2G49739456k53448j36414k84500l15552k8915q621K53830K12936M7531L02353
$$ 749739456 749486008 749349594 749065094 748749542 748720627 748712006 748965836 749178772 749226303 749528656
3008.8G49528656j18866m04663Q3313j57547q37174l40118R9030o1264m58374n31922
$$ 749528656 749409790 749005127 749088440 748930893 748093719 747753601 747852631 747791367 747332993 746801071
3018.5G46801071L56751M21600l26996m49905p4463k01340j32446j20163r65729q15887
$$ 746801071 747157822 747579422 747252426 746802521 746728058 746526718 746394272 746274109 745308380 744492493
3028.1G44492493m12903J26114J12915m22287M12445R0332r95102r57565k82669k88697
$$ 744492493 744079590 744205704 744318619 743896332 744308777 744399109 743404007 742446442 742163773 741875076
3037.8G41875076l98941j12838p49817n03846q163O9809J00632l33634n04837o74362
$$ 741875076 741476135 741363297 740613480 740109634 740101471 740171280 740271912 739938278 739433441 738759079
3047.4G38759079j53122j73798n16433m13971k44446J29089n22766o41784q16498p17850
$$ 738759079 738605957 738432159 737915726 737501755 737257309 737386398 736863632 736221848 735405350 734687500
3057.1G34687500L84903P3013m91791o37359j04447J68229o25153o68488j220j91117
$$ 734687500 735072403 735145416 734653625 734016266 733911819 734080048 733454895 732786407 732785187 732594070
3066.7G32594070r83429n16586J36948K4338m80423p79953l94440l65296k91976k79389
$$ 732594070 731610641 731094055 731231003 731255341 730774918 729994965 729600525 729235229 728943253 728663864
3076.4G28663864j77307J02234k92816k32010J13907j71433n56869o08063n91507n26733
$$ 728663864 728486557 728588791 728295975 728063965 728177872 728006439 727449570 726841507 726250000 725723267
3086G25723267m24271l98788k30561k5940q2016l67813j77307p4005m21906n23223
$$ 725723267 725298996 724900208 724669647 724643707 724561691 724193878 724016571 723942566 723520660 722997437
3095.6G22997437o66352n05447M7836r7504r93881q77456r0714K9831k34604n55496
$$ 722997437 722331085 721825638 721873474 721775970 720782089 719904633 719813919 719843750 719609146 719053650
3105.3G19053650k00195q1330l52707k72140n19562n63888m74701r25522p85675J53351
$$ 719053650 718853455 718772125 718419418 718147278 717627716 717063828 716589127 715663605 714877930 715031281
3114.9G15031281j24512m79813j6784p25403q74939l662k21787q71582p05948o22177
$$ 715031281 714906769 714426956 714410172 713684769 712809830 712806168 712584381 711712799 711006851 710384674
3124.6G10384674n89294k38266o41251m43954k5254l39737l39508m83932q44116q07801
$$ 710384674 709795380 709557114 708915863 708471909 708446655 708106918 707767410 707283478 706439362 705631561
3134.2G05631561q316p1182r76944q41522j86005J38245n51529q00858n72433q52204
$$ 705631561 705623245 705552063 704575119 703733597 703547592 703685837 703134308 702333450 701761017 700908813
3143.9G00908813l10516l48358j043549o94427m03595n56107n44738p04422n77546
$$ 700908813 700598297 700249939 699206390 698511963 698108368 697552261 697007523 696303101 695725555
3152.5F95725555r7808m61045p00607n20706j097031q76236m9820m83551q95309n30167
$$ 695725555 695627747 695166702 694466095 693945389 692848358 691972122 691922302 691438751 690543442 690013275
3162.2F90013275j46942m00696p31430l43094p77206j235886l73688m5623o25534q49915
$$ 690013275 689866333 689465637 688734207 688391113 687613907 686378021 686004333 685958710 685333176 684483261
3171.8F84483261q22296q93478o40793o36597l58810j41297p68051p06863p61490p85294
$$ 684483261 683660965 682767487 682126694 681490097 681131287 680989990 680221939 679515076 678753586 677968292
3181.5F77968292m86831n01709m64478j034775j049347l15399n08194r51080k87018
$$ 677968292 677481461 676979752 676515274 675480499 674431152 674115753 673607559 672656479 672369461
3190.1F72369461l11050j126175q18177o04858l75290l72772n10101o51780j228942
$$ 672369461 672058411 670932236 670114059 669509201 669133911 668761139 668251038 667599258 666370316
3198.8F66370316p30515l63770l42636n41381p41959n53970o67649q18329j220092
$$ 666370316 665639801 665276031 664933395 664392014 663650055 663096085 662428436 661610107 660390015
3207.5F60390015o31256n71900r20410j03073k6245j65940n81436n13687o25381j146698
$$ 660390015 659758759 659186859 658266449 658163376 658137131 657971191 657389755 656876068 656250687 655103989
3217.2F55103989p19529p61184n33448n84106p29752n2032j67923r97772j074753m54025
$$ 655103989 654384460 653623276 653089828 652505722 651775970 651723938 651556015 650558243 649483490 649029465
3226.8F49029465o51093n39627k43225p42035r38644n76554k89230n95703o37665j014557
$$ 649029465 648378372 647838745 647595520 646853485 645914841 645338287 645049057 644453354 643815689 642801132
3236.4F42801132j009521J19400N9356r61227j058159l61938n47028r33571o13746
$$ 642801132 641791611 641911011 641970367 641009140 639950981 639589043 639042015 638108444 637494698
3245.1F37494698j95656l31650o78597k96020l76358q05702q48770l60642j0528n07546
$$ 637494698 637299042 636967392 636288795 635992775 635616417 634810715 633961945 633601303 633590775 633083229
3254.8F33083229l42941m55857q65135p03201p23419m77257l70216m76303j01777k51083
$$ 633083229 632740288 632284431 631419296 630716095 629992676 629515419 629145203 628668900 628567123 628316040
3264.4F28316040r10644m42315j97715o32859n62286n07317n64842p05604l79296l09067
$$ 628316040 627405396 626963081 626765366 626132507 625570221 625062904 624498062 623792458 623413162 623104095
3274F23104095j61705q8081j031494n31426k4528l70255n19065q94165n39399l0708
$$ 623104095 622942390 622854309 621822815 621291389 621266861 620896606 620377541 619483376 618943977 618913269
3283.7F18913269k48871r94987o60591P5531l52745m13895m66805p82013q53805m38805
$$ 618913269 618664398 617669411 617008820 617084351 616731606 616317711 615850906 615068893 614215088 613776283
3293.3F13776283J1139o53114r77745l76625p0687n23147p77321k79999m68445n77621
$$ 613776283 613787422 613134308 612156563 611779938 611709251 611186104 610408783 610128784 609660339 609082718
3303F09082718j00517n21126o74629p50199q79173l87039r15489o93283L2501q71353
$$ 609082718 608982201 608461075 607786446 607036247 606157074 605770035 604854546 604161263 604193764 603322411
3312.6F03322411j056900m98543o11878o68449k34985j62278q35876j283112q43010
$$ 603322411 602265511 601766968 601155090 600486641 600251656 600089378 599253502 597970390 597127380
3321.3E97127380q9950m52881j044769p18117n40772j019134j122933o11076n81283
$$ 597127380 597037430 596584549 595539780 594821663 594280891 593261757 592138824 591527748 590946465
3330E90946465p08733j168251j225548l53355m37737m62608n83229j323815p98530
$$ 590946465 590237732 589069481 587843933 587490578 587052841 586590233 586007004 584683189 583884659
3338.7E83884659o55327j018791o82144q78525r06449p20405j001320p50465n06859
$$ 583884659 583229332 582210541 581528397 580649872 579743423 579023018 578021698 577271233 576764374
3347.3E76764374j012879j275482o85463p44552j217385r00039o35147n24254j032791
$$ 576764374 575751495 574476013 573790550 573045998 571828613 570928574 570293427 569769173 568736382
3356E68736382j121979p46575j116676o51054k47040p28150j092338j109161j179123
$$ 568736382 567614403 566867828 565751152 565100098 564853058 564124908 563032570 561923409 560744286
3364.7E60744286j220284q83560p04270o48956j125564q62236m19732r65385r92012
$$ 560744286 559524002 558640442 557936172 557287216 556161652 555299416 554879684 553914299 552922287
3373.4E52922287p99446m66309j097679j246414l45192o56967n51262n05905q28285
$$ 552922287 552122841 551656532 550558853 549312439 548967247 548310280 547759018 547253113 546424828
3382.1E46424828p50084m21639m33235j114082j024857q43544o30760k39601r5635
$$ 546424828 545674744 545253105 544819870 543705788 542680931 541837387 541206627 540967026 540871391
3390.7E40871391n65757j318512o68145r15l83339o44684m83475k75268J70212n78843
$$ 540871391 540305634 538987122 538318977 538318062 537934723 537290039 536806564 536531296 536701508 536122665
3400.4E36122665j481971n90706l52860m5967J25237o17256r42955o43158J15852l91693
$$ 536122665 534640694 534049988 533697128 533651161 533776398 533159142 532216187 531573029 531688881 531297188
3410E31297188o55136j82495l21999k63443j20010k42234n30014k36587j95656n52177
$$ 531297188 530642052 530459557 530137558 529874115 529754105 529511871 528981857 528745270 528549614 527997437
3419.7E27997437n84145j15471J59073l35617J05324L65715j80321k06909j10321j55602
$$ 527997437 527413292 527297821 527456894 527121277 527226601 527592316 527411995 527205086 527094765 526939163
3429.3E26939163j73645j57585k3346L3760j96953O5461K48413O54106L37372p25899
$$ 526939163 526765518 526607933 526584587 526618347 526421394 526486855 526735268 527389374 527726746 527000847
3439E27000847l09105r9373M00124L91121L39012N06744l74870L77121J07040K89993
$$ 527000847 526691742 526592369 526992493 527383614 527722626 528229370 527854500 528231621 528338661 528628654
3448.6E28628654J033249J53351J96915L72314Q25234M18854Q6746L16696R5673O05964
$$ 528628654 529661903 529815254 530012169 530384483 531209717 531628571 531715317 532032013 532127686 532733650
3458.2E32733650O89202P27233L76854Q2055K05192P79228J246796P16515J72348n01557
$$ 532733650 533422852 534150085 534526939 534608994 534814186 535593414 536840210 537556725 537729073 537227516
3467.9E37227516N32189R87777K96631N52788N34325J047058Q18786j22413M0588Q60138
$$ 537227516 537759705 538747482 539044113 539596901 540131226 541178284 541997070 541874657 541915245 542775383
3477.5E42775383Q67004O06385R27467O26526J3924J42021J654587Q64295K57035J536217
$$ 542775383 543642387 544248772 545176239 545802765 545816689 545958710 547613297 548477592 548734627 550270844
3487.2E50270844j4344J24779J423378Q62923K13241M14849J156425P83653N17464
$$ 550270844 550256500 550381279 551804657 552667580 552880821 553295670 554452095 555235748 555753212
3495.8E55753212N79109Q86269M75807J49116O53229R00231J238136K46696O54717
$$ 555753212 556332321 557218590 557694397 557843513 558496742 559396973 560635109 560881805 561536522
3504.5E61536522J510391Q94089J128158J415787L63846l21884P83577N91011N42526
$$ 561536522 563046913 563941002 565069160 566484947 566848793 566526909 567310486 567901497 568444023
3513.2E68444023J074219J095505J053238Q70132Q77686J24664N06897J304664J343575
$$ 568444023 569518242 570613747 571666985 572537117 573414803 573539467 574046364 575351028 576694603
3521.9E76694603N51414j06697J751671J716728Q14820M86374Q02917J106987N10368
$$ 576694603 577246017 577139320 578890991 580607719 581422539 581908913 582711830 583818817 584329185
3530.6E84329185M37508Q90846J569367Q23059J063309Q80050j23596J149292J265946
$$ 584329185 584766693 585657539 587226906 588049965 589113274 589993324 589869728 591019020 592284966
3539.2E92284966J222152J025009J075859O25306R51347J200485L548J929932R17129
$$ 592284966 593507118 594532127 595607986 596233292 597184639 598385124 598388672 600318604 601235733
3547.9F01235733J046333J312218Q09898K052346K64969J142997R69773N40008J218834
$$ 601235733 602282066 603594284 604404182 606456528 606721497 607864494 608834267 609374275 610593109
3556.6F10593109P75719K039947J634064J077080M34608J735459J060371o7711L802529
$$ 610593109 611368828 613408775 615042839 616119919 616554527 618289986 619350357 619282646 623085175
3565.3F23085175Q73718j000633K59246N23224L511963J801224J263161J441650J266975
$$ 623085175 623958893 622958260 623217506 623740730 627252693 629053917 630317078 631758728 633025703
3574F33025703J358109J338692J024322L02925K095146J221009M78668K052765K274704
$$ 633025703 634383812 635722504 636746826 637049751 639144897 640365906 640844574 642897339 645172043
3582.6F45172043J097259N35813L288727K041168j037750Q58383O95724L073044L002701
$$ 645172043 646269302 646805115 650093842 652135010 651097260 651955643 652651367 655724411 658727112
3591.3F58727112J494980l23029J086655L246994n5847J788177K436218J80817J777344
$$ 658727112 660222092 659899063 660985718 664232712 664176865 665965042 668401260 668582077 670359421
3600F70359421J917724K109299J616592J123658J758957J780624J904221P24716K037887
$$ 670359421 672277145 674386444 676003036 677126694 678885651 680666275 682570496 683295212 685333099
3608.7F85333099j541519j40457N812607J061249q25577L388901J11770L391571L266602
$$ 685333099 683791580 683651123 689463730 690524979 689699402 693088303 693200073 696591644 699858246
3617.4F99858246k07215R55124n39093J420823K607574K343140K213974J281967J307220
$$ 699858246 699651031 700606155 700067062 701487885 704095459 706438599 708652573 709934540 711241760
3626G11241760K171402L974915q04215p021179M479752M620742L981095K217026l57590
$$ 711241760 713413162 717388077 716583862 709562683 714042435 718663177 722644272 724861298 724503708
3634.7G24503708J129837J906967J700821J455917K094117J565094Q37020N37491P41196
$$ 724503708 725633545 727540512 729241333 730697250 732791367 734356461 735193481 735730972 736472168
3643.4G36472168J993637K386093L264923r11941k200852M299851K65045k765045P10220
$$ 736472168 738465805 740851898 744116821 743204880 741004028 745303879 745568924 742803879 743514099
3652.1G43514099M528656K913284K163086L293534n122147N82886L975220K090683
$$ 743514099 748042755 750956039 753119125 756412659 751290512 751873398 755848618 757939301
3659.8G57939301J600036O90842J204376M66995O09665M21829J13907K359314O15311
$$ 757939301 759539337 760230179 761434555 761901550 762511215 762933044 763046951 765406265 766021576
3668.5G66021576j138687m32358j985779L456116N325394N861587M69132j3819886
$$ 766021576 764882889 764450531 762464752 765920868 771246262 777107849 777576981 763757095
3676.2G63757095J577683N101166K981033j778259m96216J923446J777878J432190
$$ 763757095 765334778 770435944 773416977 771638718 771142502 773065948 774843826 776276016
3683.9G76276016M40521M3793K528458L685455p718735k026367N825653m349975r1477
$$ 776276016 776716537 776760330 779288788 782974243 775255508 773229141 779054794 774704819 774613342
3692.6G74613342K660828j43967J482544M20075N0506O94733p5836K056427K040100
$$ 774613342 777274170 777130203 778612747 779032822 779083328 779778061 779702225 781758652 783798752
3701.3G83798752m292526j520691L672027J219712j09711P38830K402115L621826n354156
$$ 783798752 779506226 777985535 781657562 782877274 782767563 783506393 785908508 789530334 784176178
3709.9G84176178J010742L361893p810364L784180L029403L5096O26373R48029K86026
$$ 784176178 785186920 788548813 780738449 784522629 787552032 787587128 788213501 789161530 789447556
3718.6G89447556j819077J192551L676147k799377l192673L677368J303482o55594
$$ 789447556 787628479 788821030 792497177 789697800 786505127 790182495 791485977 790830383
3726.3G90830383k107391M79126K601547L25318L238143k063903n126343N207138R20715
$$ 790830383 788722992 789202118 791803665 792128983 795367126 793303223 788176880 793384018 794304733
3735G94304733m239120r15375J672821P29370J539231J858673l548966J167679N831146
$$ 794304733 790065613 789150238 790823059 791552429 793091660 794950333 791401367 792569046 798400192
3743.7G98400192p099457p570495O004333L686448L156967l588028p094345O896591
$$ 798400192 791300735 783730240 789734573 793421021 796577988 792989960 785895615 792792206
3751.4G92792206m084702l221893N468597M273072K304611m379959J485290K817688
$$ 792792206 788707504 785485611 790954208 795227280 797531891 793151932 794637222 797454910
3759.1G97454910p231521O19812L995819R31778L357J992645k213593l474121K433091
$$ 797454910 790223389 790843201 794839020 795770798 795774155 797766800 795553207 792079086 794512177
3767.8G94512177L151092P4692n447540J466903K418213j02310J80969p4539O09131
$$ 794512177 797663269 797737961 792290421 793757324 796175537 796073227 796254196 796179657 796788788
3776.5G96788788k63977Q55102m88205m521026K366256J951676O35605J083908j957703
$$ 796788788 796524811 797379913 796891708 792370682 794736938 796688614 797324219 798408127 796450424
3785.2G96450424p96280K97623K55356J71890j56860L93295k17514K54059L05862R92203
$$ 796450424 795654144 795951767 796207123 796379013 796222153 796615448 796397934 796651993 796957855 797950058
3794.8G97950058K198639k439728k389068J454772K316666L786926m704513q176651
$$ 797950058 800148697 797708969 795319901 796774673 799091339 802878265 798173752 789997101
3802.5G89997101K190628K645950L632813K846679o053085j858139K728272Q40911
$$ 789997101 792187729 794833679 798466492 801313171 795260086 793401947 796130219 796971130
3810.2G96971130L83225P32803m35715K79313K872161k713775q075638M256973L391037
$$ 796971130 797354355 798087158 797651443 797930756 800802917 798089142 790013504 794270477 797661514
3818.9G97661514J152802j492005j0345153M264526M832916R15833J521682O3859l070527
$$ 797661514 798814316 797322311 786977158 791241684 796074600 796990433 798512115 798575974 795505447
3827.6G95505447K61002J123276K207947M40673n979461K188339M693527l686981j379242
$$ 795505447 795766449 796889725 799097672 799538345 793558884 795747223 800440750 796753769 795374527
3836.3G95374527M549255o114120l358460O087037k266922K38952L432236k533112
$$ 795374527 799923782 793809662 790451202 796538239 794271317 794510269 797942505 795409393
3844G95409393q76693K272262N33829J31454J088868j162262O36901K582550o896362
$$ 795409393 794532700 796804962 797338791 797470245 798559113 797396851 798033752 800616302 793719940
3852.7G93719940K86942o875153J977921P586288P9956o53381J402588K84424P05795
$$ 793719940 794006882 787131729 789109650 796695938 796775894 796122513 797525101 797809525 798515320
3861.3G98515320l656922l06472K425232m744187M66614L742905K947540K399292o707306
$$ 798515320 794858398 794551926 796977158 792232971 792699585 796442490 799390030 801789322 795082016
3870G95082016l764725K675476M023285J563568o533508J979981K636032l90625R33914
$$ 795082016 791317291 793992767 798016052 799579620 793046112 795026093 797662125 797271500 798205414
3878.7G98205414L080368k471924n377808L234559N83190J074753K228699r036942
$$ 798205414 801285782 798813858 793436050 796670609 797253799 798328552 800557251 791520309
3886.4G91520309J758805L501282R28497K004700j997071o235199K225571L861160
$$ 791520309 793279114 796780396 797708893 799713593 797716522 791481323 793706894 797568054
3894.1G97568054l63693K09961J50833J602402O77261p565689L612213J625519l371964
$$ 797568054 797204361 797414322 797565155 799167557 799844818 792279129 795891342 797516861 794144897
3902.8G94144897L362809j725312m91561l30201j24664K289734J79825o37894l10364
$$ 794144897 797507706 795782394 795290833 794960632 794835968 797125702 797305527 796667633 796357269
3911.5G96357269P6218K71606j32370P77893J173172k934265k162475K840194k03628
$$ 796357269 796433487 796705093 796572723 797350616 798523788 795589523 793427048 796267242 796063614
3920.2G96063614j388703K192688J099625m44031k565002j013031J534958J183243
$$ 796063614 794674911 796867599 797967224 797523193 794958191 793945160 795480118 796663361
3927.9G96663361N50918j555557L13873K085724j398468p26318R71145M3030k64282
$$ 796663361 797214279 795658722 795972595 798058319 796659851 795933533 796904678 796947708 796683426
3936.6G96683426m56848n53589M07257N04456N97152j18713l061142j57623J560516
$$ 796683426 796226578 795672989 796080246 796584702 797181854 797063141 794001999 793844376 795404892
3945.2G95404892J028061P90939j734543q5754M76227r41925Q91723J23444o59103
$$ 795404892 796432953 797223892 795489349 795403595 795879822 794937897 795829620 795953064 795293961
3953.9G95293961J50680P38297J49078l05023P80487o409M2343O32248p75070j220474
$$ 795293961 795444641 796182938 796332016 796026993 796807480 796801071 796843414 797475662 796700592 795480118
3963.6G95480118n33524N99442J171951J044083j93024k017593r20487O02951l12423
$$ 795480118 794946594 795546036 796717987 797762070 797569046 795551453 794630966 795233917 794921494
3972.2G94921494J15890P86667M66461Q29163k25754o32782o17828l56598P42187M3945
$$ 794921494 795037384 795824051 796290512 797119675 796893921 796261139 795643311 795286713 796028900 796072845
3981.9G96072845j65939J95236M32511J6327p73240r994M26636O49185j12915r65347
$$ 796072845 795906906 796102142 796534653 796550980 795777740 795767746 796194382 796843567 796730652 795765305
3991.5G95765305l61023R1552N04990m3106m09088K48947K97394P248M19464
$$ 795765305 795404282 795495834 796000824 795957718 795548630 795797577 796094971 796102219 796521683
4000.2G96521683
$$ 796521683
##END=$$ End of the data block
