##TITLE=$$ Begin of the data block
##JCAMP-DX=5.00 $$ ACD/SpecManager v 10.08
##SPECTROMETER/DATA SYSTEM=Varian
##DATE=18 Dec 2012 14:35:48
##DATA TYPE=INFRARED SPECTRUM
##DATA CLASS=XYDATA
##ORIGIN=
##OWNER=
##NPOINTS=3735
##FIRSTX=399.26403809
##LASTX=4000.35498047
##MAXX=4000.35498047
##MINX=399.26403809
##MAXY=80.40543365
##MINY=21.08908272
##XFACTOR=1.0000000000
##YFACTOR=0.000000100000000
##FIRSTY=60.87056732
##DELTAX=0.96440572
##XUNITS=1/CM
##YUNITS=TRANSMITTANCE
##XYDATA=(X++(Y..Y))
399.3 608705673 604851570 605075302 602995262 601765327 595968285 595603981 606990013 607063293 605163651
407.9 605163651 610330200 612510033 609219513 601752701 602575760 599910469 590474052 588871574 590453758
416.6 590453758 593143692 605669479 599468727 593137741 598322639 595327187 587605362 588350487
424.3 588350487 588294907 587980957 589482498 595090675 600581741 601005707 601159096 600047989 594772873
433 594772873 588474655 587176018 593167076 597841988 595829887 594201546 589915657 585976181 589128418
441.7 589128418 592270050 593768387 594252663 590580101 587272568 589554176 590773773 588859177 588542519
450.4 588542519 588685455 586031189 580466270 580535965 583907509 584897461 583567619 584621315 586561241
459.1 586561241 581183510 577367363 580362968 581069794 578425331 577823219 581080017 580607834 581571999
467.7 581571999 584810143 585437622 585619621 581297874 573621597 571986275 577080193 582294312 581319008
476.4 581319008 576765099 574493370 576685410 579441109 582233086 585584564 589326363 589415054 586217232
485.1 586217232 585880356 585943451 586982346 582755280 578395729 581872597 583651619 583041000 581974678
493.8 581974678 580580788 580969086 583419609 586167336 586599350 586920204 586075974 582448769 580314980
502.5 580314980 582392197 581717682 578840446 576242256 574188080 576613655 578894043 579617729 578854141
511.1 578854141 576134644 574396400 572854347 569650345 565214577 562728539 562226334 561517029 562031250
519.8 562031250 564604950 566175613 564003868 562674789 564729691 566541100 564707413 561021461
527.5 561021461 560958748 563963547 563639526 561773071 560950775 560300026 561214294 561646156 562108765 562076988
537.2 562076988 561051369 561583138 561600685 561440773 561850357 563006248 563969421 563513222 563505096 564052658
546.8 564052658 564761772 564845695 566413460 569718475 570725594 569322090 567642212 566880493 565565109
555.5 565565109 564448433 563885231 563877106 564898911 565455704 566617813 567676315 567847786 568310966
564.2 568310966 568313560 567880249 568371086 568126640 567107086 568103714 567924232 566382370 565900230 566004524
573.8 566004524 566248093 565334969 563791428 562347946 562849503 563911247 562863693 561808739 562141953
582.5 562141953 563232956 562717209 563466339 565011139 564883728 565573349 566638756 567582703 567563248
591.2 567563248 567823715 567067184 564158974 562653770 562173767 562149506 562333908 561668701 558994980
599.9 558994980 556290855 555280342 553463554 551618080 548454247 543117142 536538086 529723053
607.6 529723053 522230186 512644577 502711220 490245094 477094193 465668106 458321495 455165825
615.3 455165825 455440025 458508873 459687080 458975334 453762627 445026855 434683952 425536652 419934425
624 419934425 417539101 424598846 437485924 453147202 467987213 480677071 490743370 496444435
631.7 496444435 498445549 496421394 492187729 485248489 479658623 475259666 471541901 471084328 473079224
640.4 473079224 481320076 493074493 507980919 523588791 538015938 551363411 562751961 571811600
648.1 571811600 576621513 579389114 582337990 584601135 586744881 589284325 591584244 594000130
655.8 594000130 596282158 596899719 596873550 597127609 597482109 598331528 598602524 599364166 600522614 601648216
665.4 601648216 604372139 604767418 598483887 602259445 604745216 605999641 606742249 607743187 608447075
674.1 608447075 608281250 608079796 607553596 608795128 610547066 611173439 612493896 613780022 614073563
682.8 614073563 614107094 613827934 611843491 609891891 608882751 607660751 606955414 605756645 603946915
691.5 603946915 602513199 600739288 599571686 599310036 598210678 596944427 596429443 595717888 594787979
700.2 594787979 593827896 592902451 592192764 591749153 592330627 593893318 595464516 596987190 599502411
708.8 599502411 602265320 603748627 605137558 606786613 607780075 607981796 609151611 611503372 613023872
717.5 613023872 614807243 617996788 621045265 622269554 622796249 623541336 624041634 623848190 623292885
726.2 623292885 622928085 621379852 619682503 620095215 620453835 618647957 617028694 616771812 616760979
734.9 616760979 617429504 618238907 618012009 616614990 615699577 616222572 615839119 615000191 615407715 616988220
744.5 616988220 619004974 620861931 624120712 627347260 629517860 632527390 635410156 637455521
752.2 637455521 639515915 641949615 644806900 647911682 651273956 653792038 655648880 658350449
760 658350449 660365601 662066193 662851868 662433167 662610245 661711349 661179886 659954529 657104187
768.6 657104187 655501709 655508575 656904373 657731400 658935013 661011124 662418213 664005814 665768127
777.3 665768127 668254852 669987030 670369720 671553955 673909073 676536331 678981628 681371307 683431931
786 683431931 685025253 685706558 685769577 685803452 686665039 687612152 687700348 687001343 685622177 685151825
795.6 685151825 685094299 685175781 685295410 685847015 687027969 687809143 688355484 688111649 687723083 686333923
805.3 686333923 685516281 686549149 686601181 685983047 685830307 686844101 687507706 688196106 688995514 688905792
814.9 688905792 688963928 688869324 689696655 689944229 690231857 690324936 688798218 688219986 687741776 687455215
824.6 687455215 686818848 685825348 684640350 682620621 680694427 677521591 673240356 669560852 666852112
833.3 666852112 662606430 657352448 653506012 650364761 647243271 643416672 639376717 636300049
841 636300049 633514290 630452843 628765526 627553101 625513191 623781738 622896118 623644714 625284081
849.6 625284081 627071457 629328690 632095032 635401115 638872414 642608795 646099701 650051956
857.4 650051956 653535080 655514297 657922134 659610062 661573181 663863220 665732803 668117905
865.1 668117905 670204926 671942368 672877426 673938980 674665527 675199356 675587769 675866776 677159195
873.8 677159195 678472824 679561310 678699875 677889023 677656174 677106781 676498566 673791504 671672134
882.4 671672134 669824371 667360382 664384689 661078033 658941650 657145920 656164551 654720535 653369370
891.1 653369370 652988663 652996979 654219894 655083084 655956421 657049637 657438660 656795883 656341095 656740952
900.8 656740952 656012955 655063248 654049835 653065414 652667542 651421585 648935165 645771790 643018494
909.4 643018494 640768738 638389473 634948311 630524521 627018127 624088326 620832176 617728767
917.2 617728767 615405846 613528290 610592194 607755737 604966698 602002754 599589119 597046890
924.9 597046890 595275154 593231201 591391335 590222054 589011269 588708992 588629875 589723167 591797142
933.6 591797142 593938332 596329002 598742790 601599808 604528694 607653198 611328011 614977837
941.3 614977837 618779030 622838821 626355858 629439888 633216515 637354050 640928802 643656387
949 643656387 645326233 646887283 647787857 648219833 648229599 647018814 646378708 645522385 644067917 642432556
958.6 642432556 639957390 637580566 635378571 632125854 628589172 625723839 622057381 618373680
966.3 618373680 615670776 613374596 611341209 609519920 608405647 607746735 606912231 605897980 604869308
975 604869308 603845634 602891006 602213974 601252785 599500465 597877045 596732521 594697723 592086487
983.7 592086487 590195312 588398857 585970573 582933884 579670753 576868973 573310051 567863350
991.4 567863350 561256638 552291756 539533501 523575363 511877060 513455048 525041924 537611313
999.1 537611313 544746246 547571945 548670044 548993492 548165741 547070389 547006073 545852280 544738693
1007.8 544738693 543589554 541964302 540489616 538629951 537424545 535752258 534378281 532746162
1015.5 532746162 530027504 527667885 525519485 523253021 520171471 517578926 515061302 512295914
1023.2 512295914 509470940 506918297 504956703 502799950 501323967 499220886 496860733 494013977
1031 494013977 491449890 489331589 486861725 485523338 483301315 481640625 480003662 478908577 479063683
1039.6 479063683 478739548 478577080 477314377 477049408 476565285 475614319 475446472 476065216 476973572
1048.3 476973572 476643677 477428093 478383522 479560318 479560089 479863510 481234589 481347809 482702255 482700920
1058 482700920 481637802 480412216 479766579 479256859 478109169 477824135 476208115 475847549 474935760
1066.6 474935760 473775902 473895645 473293686 472736168 471499023 470712700 469234009 468565788 467146378
1075.3 467146378 465637360 464948845 462716064 462828331 462183685 461427727 460362854 458728600 457593384
1084 457593384 455390167 454250145 451202736 448068848 443991623 439428482 435387306 429663277 423402405
1092.7 423402405 414239769 405365448 395040131 385008049 375435333 364539986 355389137 344762039
1100.4 344762039 335929070 326367455 318064365 309842720 301340485 294795895 286523972 280635681
1108.1 280635681 272740116 266270752 260225925 255170803 252157440 248406124 248087959 246359062
1115.8 246359062 247120533 246532116 246710434 248447571 249629230 253482780 253813610 256191368 258058548
1124.5 258058548 260051823 260754871 260062199 260741119 258341331 258825397 256978207 254058990 250531120
1133.2 250531120 247077751 244789200 240138702 238159313 234881763 234240894 232939301 231120224
1140.9 231120224 230090427 227410831 226551781 222845669 221411324 218570423 216470776 215653286 213525810
1149.6 213525810 213110905 210890827 211949844 211324921 212300377 213944283 214905205 217310810 217318153
1158.3 217318153 220221996 221304111 223916245 226385746 229198589 233413944 235819702 240488358
1166 240488358 243142624 248727570 253899040 258639164 263972530 268778515 275940437 281090145 288106594
1174.6 288106594 294071312 300895634 307651081 313420658 320645905 326239586 333309135 338685646
1182.4 338685646 344777374 350621796 355907745 361439629 366013451 372273712 376317253 381384735
1190.1 381384735 385892029 389895172 394293823 398098564 403561172 407959557 413701096 418692818
1197.8 418692818 423882065 429713249 435016708 440623131 444940414 450272675 455084038 460538902
1205.5 460538902 465441055 469695015 474275818 478045158 482681465 485756073 489042397 492420197
1213.2 492420197 495414925 498295174 500417786 502571373 503536072 505747528 507659912 508969269
1220.9 508969269 510512695 511516685 512542648 512807655 513613663 513677979 514279327 515246620 515530777
1229.6 515530777 516166611 516356163 517453651 518298416 518994484 519673042 520877495 521943092 522210732
1238.3 522210732 523167458 523340569 524295120 524860420 525174599 525963326 526298981 527198830 527605820 528758430
1247.9 528758430 529317513 529630127 529999352 530191498 531214485 531240311 531313744 530947113 531299210 532045364
1257.6 532045364 532643394 533973732 534534683 535460167 536126289 537290344 538120995 538454285 539082985
1266.3 539082985 539552650 540466461 540509987 542010689 543898125 545271721 547041435 548722458 550905342
1274.9 550905342 552584229 554825134 556568451 558041496 559700089 561205215 563089828 564668465
1282.7 564668465 566768150 568465347 570876465 573803368 576249809 578827744 580890770 582975159
1290.4 582975159 584719353 586411667 587812309 589194679 590800362 592360573 594585686 596694260
1298.1 596694260 598645821 600487404 602668495 604510612 605498505 606644020 607682533 608483772 609072533
1306.8 609072533 609915886 610693550 611164284 612281227 613697929 614480476 614875526 615810623 616620750
1315.4 616620750 617545662 618967743 619793816 619939423 620235672 621010017 621806183 622957382 624423790
1324.1 624423790 625654793 626642685 627349663 628047333 628784943 629536705 629884338 629511528 629096642
1332.8 629096642 628727722 629082489 629790573 629692764 629905891 630238419 630169907 630084152 630472412 631613998
1342.4 631613998 632047386 631599731 631100311 630524826 630138779 630076141 629792633 629519920 630117836 630163383
1352.1 630163383 629601555 629299545 628789749 628243484 627892036 627350731 626324425 626454735 626613464
1360.8 626613464 625741005 625290413 623973503 624186745 624650154 623848724 623055649 621769066 620477562
1369.4 620477562 619396896 618294182 617760849 616840553 615011826 613853531 614258537 614954109 614751434
1378.1 614751434 614108315 613909874 613899803 613476295 612734947 612057762 612029305 612882576 613337059 613308334
1387.8 613308334 614403801 615884094 616416130 616327286 616937561 617743645 616689758 614011650 613968887
1396.4 613968887 614587936 614376373 611942101 611026688 611933746 611540947 611076012 611130562 609644165
1405.1 609644165 608851585 608858109 608173447 607359772 606444206 605787468 605805664 605713158 605636330 605619392 605603104
1415.7 605603104 605510330 605667648 606741562 603082390 602944298 605265274 605875359 606136475 605099678
1424.4 605099678 606213722 608073158 608319168 609406624 610429497 610628319 611012650 612306366 613154564
1433.1 613154564 613247910 615095749 616663017 614170647 614990387 617782135 619330978 620181389 620947304
1441.8 620947304 621549759 622887039 623559837 624348907 625391350 625616913 624940758 625741768 627355995
1450.5 627355995 627996674 628702850 629678841 631473389 633144989 633637505 632685318 630943794 633698769
1459.1 633698769 635437012 637477798 638320312 639124832 641534119 641193542 642015381 643755417 645661697
1467.8 645661697 647384872 648772659 651055374 651371765 650559387 652266083 656577301 660516510 661357880
1476.5 661357880 662829437 665426407 667556610 669279327 670197525 671022720 672464218 673666992 674324112
1485.2 674324112 675553207 675304947 674011154 675700073 673850937 671627426 673771439 675131226
1492.9 675131226 675463028 675863266 675594788 670004807 671462479 671297531 668156967 668749847 667803497
1501.6 667803497 666358414 665526352 666299896 666131744 657937241 653669739 653654175 654627151 653617783
1510.2 653617783 654609909 651991425 648216248 648369598 646821747 646230392 643955688 640537872 642802963
1518.9 642802963 645736542 642859650 636006355 636516953 638439827 640771713 636958084 635266571
1526.6 635266571 635256157 633271065 633090935 633236465 633242264 632686653 631476326 627352295 628161926 628853531
1536.3 628853531 629463005 632352409 629359245 619870834 621762466 623239059 621819534 622853432
1544 622853432 624367371 623008156 624503860 625128250 626314964 626242561 624163818 625836716 626812859
1552.7 626812859 627907181 626024170 627103844 631793633 636876106 635983620 625740356 630200081
1560.4 630200081 634090195 637113075 638680038 639309654 638094826 638117256 639915009 641119766 642356949
1569.1 642356949 638048592 639516335 642044830 642223587 642485657 642751846 642407227 635607414 636687317
1577.7 636687317 637091103 635942841 635247612 633887367 633239708 631270638 630227852 629137764 627622185
1586.4 627622185 626011353 623394165 621932564 619113007 616795044 613895226 611701889 609484901
1594.1 609484901 606608467 605025406 602312241 601233406 599123154 597309151 594822159 592046280
1601.9 592046280 590110168 586572838 584589767 581477280 579340553 576367874 574564667 573114853
1609.6 573114853 570204811 569597206 567174721 566037979 563722572 563284645 562829781 552121964 552996521
1618.2 552996521 552138977 551529770 549145737 548893318 547344017 541511765 542457008 541745071 542221451
1626.9 542221451 538765030 536690979 536262474 534712753 533877678 531903992 531922112 531051521 527642517
1635.6 527642517 524558182 525615540 526070595 526409912 527400627 525573502 526230354 525640411 526485596
1644.3 526485596 527653275 525526047 526675186 523577766 525467110 526340179 529217377 532611771
1652 532611771 533440971 527906609 527197571 531174469 532427826 534157219 534683723 535828934 537352486
1660.7 537352486 538632889 540731621 540350952 543747826 545710983 548424797 551518898 553835869
1668.4 553835869 553857193 553252716 557738075 558200188 560949135 564652290 565792084 565471191 568424187
1677.1 568424187 572818108 575161552 578345337 579453659 583089218 588682289 587491417 582619820
1684.8 582619820 586535873 593516502 597411804 599854393 602850151 605229645 609457932 613165970
1692.5 613165970 616944504 620919113 625062256 623236275 628209343 634874458 640533142 644060974
1700.2 644060974 638778343 646458664 651885757 655554581 658947983 662670212 665492935 668714905
1707.9 668714905 673274460 675691147 677428589 679935989 682650909 685647202 685843887 686731262 690805283
1716.6 690805283 694461441 690964279 694559479 698832321 700829697 702108688 702473068 703057480 704282684
1725.3 704282684 704991531 705999451 707543640 709548721 708896942 709353333 713898239 717426376 713639984
1734 713639984 708374557 713471298 717355499 718656998 720528946 719072800 716660767 720881577 723923340
1742.7 723923340 724145966 726082687 729768372 732472305 734479218 736352692 736764069 739995346 740294647
1751.3 740294647 739830322 744040146 746562500 748937683 751761627 751395035 752744446 755647812 758375549
1760 758375549 761162491 758834915 758381348 761261063 762176208 762566376 763646317 764420929 761773605
1768.7 761773605 764291306 768953476 769962616 767552490 765747757 769824600 771492462 769750137
1776.4 769750137 771124878 771549988 772204666 772156830 771250381 772469025 774414825 776174240 775827026
1785.1 775827026 776003647 777800522 778809052 778887100 779753799 779725113 779634628 776849976 775497055
1793.8 775497055 779280853 780489349 780034637 781693726 783767242 784022980 782550583 784067688 783634186
1802.4 783634186 783453522 784431305 784093933 784341965 784553909 784607315 785747681 787378387 786231384
1811.1 786231384 786427841 788048019 788596115 789261627 788997345 789219208 788311768 787701645 788296585
1819.8 788296585 788395691 789149704 789124298 790733871 792368622 790013199 790415726 792924347 794606857
1828.5 794606857 793410645 789093857 789714508 791669540 791786499 792086029 793121796 794117355 794368896
1837.2 794368896 794152222 795275116 795385208 795547256 795648651 796820145 797446899 791041870 792575760
1845.8 792575760 795217972 795456619 795131302 795779495 797164459 797605286 798110123 797886810 797719345
1854.5 797719345 797730179 797627792 797549820 797197189 797379761 797028351 797426529 797757187 798276367 798993454
1864.2 798993454 799255219 800190811 799876404 799758224 798132401 796342773 797366257 798447800 799277267
1872.8 799277267 799322281 799827042 800044785 800456390 801083221 801322098 801635742 801353836 801609879 801385345
1882.5 801385345 800982666 800303955 799811935 800192490 800255814 801541748 801559296 799979477 801127319
1891.2 801127319 802280045 802199631 802364044 801831665 800424500 800616379 800606461 800844269 801263657 801057434
1900.8 801057434 801324997 801876602 802700272 802633133 802690887 802978745 802378464 801802216 801533585 801102676
1910.4 801102676 801001129 801740952 801655655 801906815 802114182 802476501 804054337 802320557 801093521
1919.1 801093521 801970596 802390747 802615891 801267319 800711899 801407776 801540604 801211853 801467438
1927.8 801467438 801828918 802157364 802363815 802433548 802885056 802483139 802415009 802221146 801594391 801423798
1937.5 801423798 801143341 801289368 801427994 802547989 802792053 800794220 801190109 802082672 802081528 801913223
1947.1 801913223 801750336 801350403 800927963 800806656 801055832 801149368 801283264 801647339 801483841 801734848
1956.7 801734848 801677628 801350098 801455917 801374283 801296158 800938110 800885696 800880127 801059875 801101532 800152283
1967.3 800152283 800034866 800654678 801071701 801190872 801509552 801324997 800575943 800241318 800115433 800094528
1977 800094528 799831772 799840546 800187073 800540237 800542831 800279007 800263977 800090408 799833984 799250488 798888702
1987.6 798888702 798441467 798011017 798442841 798286362 797288437 797339249 798556671 798832321 798544769 798846130
1997.2 798846130 798900299 799005814 798851929 798518066 797849121 797371216 797139893 796945572 797523727 797731934
2006.9 797731934 797793198 797954483 798017578 797854004 797430267 797346344 797106018 796616898 796048965 795738525
2016.5 795738525 795577011 795840073 795977020 795525436 795690536 796055374 796177673 795954819 795888443 795602951
2026.2 795602951 794935455 794467392 793950043 794032745 793980789 794144440 794533539 794524384 794364319 794068527
2035.8 794068527 794249191 794065552 793768921 793285217 792959061 792635956 791956863 792126389 791905746 792331772
2045.5 792331772 793021317 792833328 792675781 792742615 793178711 792647095 792203140 791984711 791617737 791280365
2055.1 791280365 790635147 790619049 790562973 790703506 790830307 791194611 791590347 791258240 791103210 790405273
2064.7 790405273 789531631 788939438 788689270 788295288 787743530 787553177 787276840 787574921 787600403 787392578
2074.4 787392578 787029037 786192245 785701141 785421448 785198593 784631424 783941727 783270645 783287735 783532791
2084 783532791 783531342 783944550 783962860 784154968 784485779 784543457 784133911 783512726 783266373 783081741 783174133
2094.6 783174133 782802277 782615891 783195724 784065704 784691696 784827042 785102081 785108490 785316162 785211182
2104.3 785211182 784848938 784671173 784436569 784791336 785060730 785134659 785081482 785662231 786280746 786368484
2113.9 786368484 786943741 787221298 787173157 786755142 786482010 786012192 785297852 785168457 785204163 785629425
2123.6 785629425 785605316 785633621 785795441 785699081 785760040 785639648 785676880 785457687 784958878 784137573
2133.2 784137573 783873138 784194489 784302826 784700165 785068054 785536575 785665817 785786819 785788422 785955048
2142.9 785955048 786451645 785925293 785763245 785805359 785749054 785775299 785751038 786275177 786765289 787179642
2152.5 787179642 787453003 788106461 788443451 788151779 787821274 787411499 787486801 787267609 786944427 786940079
2162.1 786940079 787213974 787049713 786919327 787774506 787986832 787986298 788029938 787960815 787877579 787521973 787148743
2172.8 787148743 786886292 787046432 786596069 786231384 786410294 786602097 786844864 786970825 787475204 787471542
2182.4 787471542 787296066 787261734 787034073 786966782 786974945 787118301 787091599 787335129 787878342 788558121
2192 788558121 788922806 789103851 789525909 789849625 790342026 790014038 789750595 790281448 790387192 790169678
2201.7 790169678 790051346 790188522 790512848 791181564 791365356 791508484 791757889 791692505 791874237 791524277
2211.3 791524277 791408081 791508408 791389236 791482849 791515961 791490707 791602478 792059784 792215042 792284317
2221 792284317 792039261 791855164 792023163 792039185 792320862 791891632 791409988 791148834 791133575 791707611
2230.6 791707611 791916428 792006912 791988831 792106628 792066116 792176666 792150040 791540680 791440201 791299973
2240.3 791299973 791151962 791061020 791243210 791498947 791506653 791772079 791996307 791965027 791674042 791843872
2249.9 791843872 791569977 791061859 791134109 791149673 791365891 791451797 791743240 791684113 791483002 791664963
2259.5 791664963 791828842 791929092 791740341 792028961 791933441 791842117 792038116 792064590 791872177 791176224
2269.2 791176224 791562729 792120590 792173080 791772614 791735077 792428818 792448959 792475433 792165680 791953278
2278.8 791953278 791529999 791136551 791317139 791224289 791529465 791614227 791945419 792113800 792234650 792371902
2288.5 792371902 791842651 791847763 791630478 791874847 791876755 791477356 791339722 790959244 791294937 791327057
2298.1 791327057 791583328 791906204 792159500 792501907 792480545 792616806 791767578 791005859 790967560 791354675
2307.8 791354675 791120529 790526962 790885544 790728683 790737076 790451736 790313416 790544205 790440521 790652618
2317.4 790652618 790313110 789867706 789510651 790081482 790140228 788888245 788198471 788401184 789110336 788855133
2327.1 788855133 788929596 789299240 790132675 790322876 789705734 789763794 788661346 788489761 788304062 788109055
2336.7 788109055 789284210 790061188 789835510 789436798 790400238 790235062 790074310 790194931 789716339
2345.4 789716339 790043793 790713654 791717606 792753830 793413010 792536392 792159653 792780151 793211060
2354.1 793211060 792908096 790237350 789348755 789010849 788836288 788794327 788847656 790864410 791472473 791818771
2363.7 791818771 790690002 789842606 790447388 790241241 790832825 792551346 793458481 793082504 793964539
2372.4 793964539 794695587 794634552 794291306 793891678 794268188 794757767 795232391 795100861 795071793 795539169
2382 795539169 796464767 797165527 797075806 797229233 796876068 796521072 796496887 796253967 795997925 796100159
2391.7 796100159 796507263 796444931 796778336 796868744 797007523 797258148 796724777 796659698 796432190 796146545
2401.3 796146545 796033096 795946808 795645752 795179672 795525055 795849838 795771179 795616760 796112976 796122360
2410.9 796122360 795650635 795859909 795542831 795233459 794860077 794585876 794522476 794401169 794751892 794882431
2420.6 794882431 794808350 794709244 794982910 795265961 795381012 795143127 794397354 794037170 793659668 793376160
2430.2 793376160 793007507 792947083 793089371 792932053 793187485 793371201 793631516 793725510 793923874 794031219
2439.9 794031219 793496933 792968903 792309418 791983871 791666260 791538773 791779327 791941833 792167130 792280045
2449.5 792280045 792550507 792803802 792966537 792484207 791647949 791012421 790370178 790059280 789811249 789781494
2459.2 789781494 789957504 790407181 790656891 790911331 791486053 791288147 790716782 789874802 789356232 788831863
2468.8 788831863 788193054 788269653 788125534 788196945 788221207 788402023 788928070 788935852 789166336 789406052
2478.5 789406052 789030151 788092880 787430344 786974258 786463470 786420822 786324997 786444168 786953964 787192001
2488.1 787192001 787209778 787230911 787091980 786950226 786706619 786348419 786048508 785468903 785010757 784557953
2497.7 784557953 784323120 784548264 784891129 785567474 785786209 785476837 785276566 785116348 784655304 784173355
2507.4 784173355 783955002 783382339 782678833 782453918 782596130 782614212 782956467 783491898 783473053 783266907
2517 783266907 783311768 783695374 783505783 782597046 781462708 781035995 781401367 781378250 781383362 781508255
2526.7 781508255 782043457 782345047 782125244 782327042 782408295 782472305 781911926 780869522 780231628 780023804
2536.3 780023804 779973373 779754639 780043869 780605698 781027451 781018295 780996780 780842285 780336761 780274277
2546 780274277 779661636 778978653 778761063 778748779 779029465 778928223 778796844 779025955 779198761 779046860
2555.6 779046860 779273376 779122925 778580093 778357773 777679825 777208633 776767044 776625366 776802597 776884384
2565.2 776884384 777333679 777512207 777680359 777490234 777167664 777233505 776969681 776434860 776159973 776138535
2574.9 776138535 775668030 775198975 774933701 775047226 775439835 775534744 775624008 775553360 775445251 775335922
2584.5 775335922 775580673 775450668 774377365 773621216 773505096 773459778 772902908 772800522 772978134 773064957
2594.2 773064957 773332367 773092270 772945175 772727966 772301941 771916580 771781998 771515274 770867310 770860901
2603.8 770860901 770789413 770683899 770601349 770267029 770293045 770326080 770058060 769645615 769491882 769205704
2613.5 769205704 768862152 768665619 768505554 768338699 767972794 767860413 767699890 767521515 767379074 767396317
2623.1 767396317 767162628 766411667 766192017 765900803 765704346 765722504 765495071 765039749 764525604 764494400
2632.8 764494400 764249344 764049072 763855438 763696136 764040680 764191284 763778763 762979889 762664413 762125473
2642.4 762125473 761587372 761725769 761631622 761822815 761988983 761522675 760847855 760514984 760434570 760181961
2652 760181961 759818573 759288177 759076538 759128876 758892059 758643417 758871460 758949585 758456955 757924118
2661.7 757924118 757333832 757063217 757050934 756823273 756621857 756545334 756376190 755920868 755328217 755300598
2671.3 755300598 755633087 755244980 754821091 754609756 754703979 755065308 754462738 753915939 753864899 753578033
2681 753578033 753174286 752887421 752570572 752276688 752356796 752111282 751856537 751685791 751447678 750971375
2690.6 750971375 750376968 750606461 750488434 750327988 750327454 750226822 750365677 749649582 749167786 749109573
2700.3 749109573 748849335 748824539 748688049 748574295 748475494 748054962 747591248 747361908 746971054 746798782
2709.9 746798782 746764603 746697311 746629105 746046066 745505524 744858551 744639893 744791870 744659195 744977036
2719.5 744977036 744704819 743801422 743439560 743150253 742689056 742646408 742510834 742189789 742079544 741718369
2729.2 741718369 741513824 741173325 740820160 740606918 740413589 740339355 739905090 740141068 740124664 739380569
2738.8 739380569 739062805 738735809 738291397 737848663 738234787 738665543 738175888 737620239 737392426 737300568
2748.5 737300568 736881714 736511612 736243057 736047287 735785522 735401993 735181961 735044632 735075455 734610977
2758.1 734610977 734183578 734125748 733773270 733320084 732938690 732903290 732517471 731938095 731953278 731774826
2767.8 731774826 731255188 730930176 730642624 730456543 730370026 729850693 729300385 728803558 728206558 727975540
2777.4 727975540 727818680 727207489 726601715 726398010 726067352 725906143 725597534 725012589 724867859 724679413
2787 724679413 724608917 724242706 723351517 722924194 722736816 722053604 721304398 720946198 720473175 720140228
2796.7 720140228 719722214 718987427 718252792 717799530 717962723 717727737 717095413 716707077 716403961 715795059
2806.3 715795059 714986649 714375534 713633499 713230896 712942963 712275238 711714249 711537247 711330719 710546799
2816 710546799 709749222 709214554 708798218 708180771 707593384 707175598 706374817 705409927 704724503 704500122
2825.6 704500122 704022293 703675842 703280792 702013474 700912857 700161743 699757309 699145737 698289795
2834.3 698289795 697593689 696747055 696041565 695178375 694305878 693113785 691603928 690201416 688637390
2843 688637390 687166138 685504837 683434372 681160660 679190140 677235107 675353699 673958664 672835007
2851.7 672835007 672476730 672000656 671302109 671140900 671134262 670869980 670381317 670193787 669818344 669490585
2861.3 669490585 669244003 668477936 667661285 666883087 665940933 665181122 664961929 664456024 663422165
2870 663422165 662139206 660899048 660085297 659471741 658802643 657779388 657257462 656826324 656118851
2878.7 656118851 655858231 655635300 655815735 655828323 655291061 654362717 653296127 652560425 651535339
2887.3 651535339 650687408 649922562 649183807 648720245 648034897 647138977 646079941 645384445 644867783
2896 644867783 644057846 643037796 642380295 641979218 641240005 640698166 640272980 639836121 638919029 638155975
2905.7 638155975 638175049 637558327 637085991 636925278 636158028 635145111 634302826 634049187 633300552 632005424
2915.3 632005424 630984230 629667969 628523750 627651329 626912155 626678009 626036606 625212936 624855042
2924 624855042 624690399 624795151 624880219 624994087 624967194 624940109 625008163 624747772 625285568 626103706 626088982
2934.6 626088982 626166000 626333046 626432037 626719627 627186317 628001060 628431931 628513718 629225273 629633026
2944.2 629633026 629415398 629314537 629611206 630082550 629556122 628963051 629255524 629063301 628051682
2952.9 628051682 627111626 626731148 626567650 626222496 625808067 625537415 625396881 625854263 626477280 626495438
2962.6 626495438 626617928 626956215 627286110 627542648 628174133 628957291 629402504 630338287 631561356
2971.2 631561356 632790260 633631516 634342728 635359154 636041412 636784935 637527390 638310165 639168320
2979.9 639168320 640112152 641041565 641337357 641860809 643083954 644051437 644427032 645267715 646033554
2988.6 646033554 646676025 647660141 647793121 648021469 648535614 649109192 649349289 649075165 649603806 649952545
2998.2 649952545 650018234 650118866 650141678 650355148 650537643 650554962 650398560 650797882 651097870 651019287
3007.9 651019287 650704575 650391235 650505829 650169144 649716873 649652100 649958725 649846573 649371185 649029617
3017.5 649029617 648429947 647995834 647222061 646457672 646057816 646203003 646559601 646019745 645652161 645487137
3027.2 645487137 645114059 644606400 644136658 643722153 643149490 643048172 642851028 642183533 641196518 640390244
3036.8 640390244 640088348 640056534 639887466 639372406 639092255 638598557 638187218 637596474 636578026 635959778
3046.5 635959778 635327492 635024452 634653320 634015656 633281326 632324524 631876259 631907578 632166061 631569214
3056.1 631569214 630291481 629799576 629405060 628481636 627879753 627518997 627004623 626790314 626231194
3064.8 626231194 625635986 625377312 624753189 624140701 623814583 623571625 623067551 622607765 622145958 621748123
3074.4 621748123 621478081 620866737 620680122 620859451 620494308 619636345 619250679 618853416 617887573 617523956
3084.1 617523956 617280502 616589432 616116982 616110268 615760803 614929161 614209404 613893661 613863525 613189659
3093.7 613189659 612753181 612431259 611558189 611037025 610804482 610697289 609747963 608628197 608067741
3102.4 608067741 607606926 607289581 606632614 606378288 606149940 605481415 604915962 604173050 603490639 603030243
3112 603030243 602333908 601442413 601077957 600580711 599750061 599137383 598417740 597852631 597756805 597809639
3121.7 597809639 597025375 595557785 594278221 593793221 593490028 592541199 591969490 591312485 590523567
3130.4 590523567 589915428 589272308 588894234 588420143 587996635 587422295 586535416 585411835 584762573
3139 584762573 584248695 582964935 582100639 581565514 581121483 580418854 579358826 578794250 578688240 578583870
3148.7 578583870 577468605 576095314 575187645 574567909 573952599 573003998 572467003 571783371 570772476
3157.4 570772476 570026245 569490929 568571320 567223930 566516609 566085892 565258789 564174309 563605881
3166 563605881 563404083 562597427 561514320 560695229 560074463 559346275 558832207 558147316 557210503 556636696
3175.7 556636696 556167984 555741310 554940338 554006996 553257256 552571831 551904755 551191597 550780296 549813881
3185.3 549813881 548384514 547598763 546968155 546325455 546084251 545513725 544484749 543704681 542909203
3194 542909203 542310753 541728058 540835304 540022278 539546127 539403038 538662071 537520180 536587906 535774345
3203.6 535774345 535092545 534680519 534642830 534248772 533573341 532748032 531685143 531087379 530719643 529893265
3213.3 529893265 528955765 528518639 528038521 527344666 527023163 526885185 525948143 524849243 524416542
3222 524416542 523964119 523650398 523072357 522273712 521912994 521774712 521298599 519997139 519201431 519029198
3231.6 519029198 518647232 518117142 517684326 517388496 516547813 515892944 515387115 514620399 514062958 513640938
3241.3 513640938 513151588 512359543 511787186 511248665 510986519 510816460 509877853 509027061 508416824 508002319
3250.9 508002319 507776260 507496758 506883011 506047745 505701714 505078545 504094734 503640022 503415909 502762947
3260.5 502762947 502024078 501503525 500862160 500321770 500059776 499896927 499428864 498875923 498603477 498391800
3270.2 498391800 497983017 497453346 497223053 496931953 496438828 495599709 494637642 494254150 493802071 493354568
3279.8 493354568 493272171 493238525 493068390 492562943 491877174 491331978 490740433 490393219 490455132 489974480
3289.5 489974480 489371986 488959312 488550606 488350830 487941666 487562447 487150612 486778259 486655693 486571503
3299.1 486571503 486368675 486023064 485537033 484662285 484553642 484711227 483921814 483283691 482930298 482480812
3308.8 482480812 482031174 481601944 481221008 481034508 480499916 479730072 479440880 478902588 478322296 477960510
3318.4 477960510 477385368 476805801 476739655 476850471 476482277 476187019 475730667 475078163 474493065 474110870
3328.1 474110870 473908768 473310471 472690659 471683311 470644302 470303841 470336189 470604820 470414352
3336.7 470414352 469590569 468710670 468126984 467696190 467827568 467833176 466706429 465656815 465047264 464713211
3346.4 464713211 464202652 463576050 463277397 463259048 463452950 462537384 461431160 460994873 460216789 459558716
3356 459558716 459127083 458722801 458500099 458237152 457597275 456920815 456342278 456045532 455864487 455117722
3365.7 455117722 454864998 454499855 453255653 452658157 452706718 452333488 451452751 450980568 450911903 450676155
3375.3 450676155 450181160 449776459 449756165 449473114 448806152 448133049 447809868 447422714 446653671 446554642
3384.9 446554642 446757965 446304436 445578423 445115547 445129852 445432777 445598297 445051117 444087753 443637733
3394.6 443637733 443512077 443595963 443424911 442821274 442634430 442397652 442142601 442270241 442251930 441951065
3404.2 441951065 441525040 441232224 440761681 440431671 440539017 440503807 440404625 440581856 440709381 440207825
3413.9 440207825 439787636 439702911 439684639 439483223 439225922 439581413 439523354 439324417 439441757 439544945
3423.5 439544945 439554901 438929367 439197235 439949608 439748611 439921608 440359535 440026817 439914780 440200310
3433.2 440200310 440109978 440178833 440338478 440761871 440992851 440815125 440687752 440516052 441166878 441539459
3442.8 441539459 441826439 442203674 442061577 442457771 442136726 442420006 443476982 444067535 444676018
3451.5 444676018 444513092 444124489 444467392 445241394 445736351 446205940 446486969 446716499 447597580 448024101
3461.1 448024101 448094101 448110466 448622780 449296913 449638252 450281372 450303192 450332375 450746078 451386642
3470.8 451386642 452006912 452151642 452794991 453513031 453813248 454194756 454770279 455177345 455581169 456122742
3480.4 456122742 456995277 457897911 457831841 458382607 459017296 459334106 460328293 460536079 460498772 461458015
3490.1 461458015 462568779 462924461 463323860 464075241 464342003 464706268 465430794 466081505 466501045
3498.7 466501045 467028275 467531586 468147507 468994827 469153481 469269371 470256729 471295357 471881676
3507.4 471881676 473241463 473877068 473351593 474029503 474647980 475584908 476637764 477447586 477906380
3516.1 477906380 478103447 479080353 479611702 480230865 481232834 482877960 484157982 483079948 483157463
3524.8 483157463 484373512 485401421 486182022 486633911 487170105 487956924 488284531 488384590 489326630
3533.5 489326630 490514793 492662811 493280334 492574959 494033966 494801216 495134888 495928040 497249146
3542.1 497249146 498184662 498484650 499403419 500641289 502254868 501699181 502301254 503995743 505459595
3550.8 505459595 507069473 505926704 506551285 507513847 508577690 510613213 511238899 512596436 513765259
3559.5 513765259 514420547 514297981 515700645 517299767 517252235 520636787 522172127 522138939 521205406
3568.2 521205406 519324455 522787323 524729652 524991226 526334877 528342857 529135666 530016975 532007332
3576.9 532007332 532339554 534195175 535914192 536617088 537996292 539481850 541173210 542128677 545748825
3585.5 545748825 547130356 544766159 546386604 545954132 548173981 550581894 553136597 554510803
3593.2 554510803 554716911 557211113 555901947 558309746 561304703 561271439 564121094 564956322 566258659
3601.9 566258659 568534508 569681282 571365356 574088745 576759338 575480995 577947235 577496643
3609.6 577496643 576871185 584362640 586255341 583568230 586379471 585576096 589289894 594058571 594988213
3618.3 594988213 596913528 596319542 596980858 599826813 602210922 604615669 607213669 609259644 611613846
3627 611613846 618039627 619828491 610440903 613717003 617692451 622955818 625888100 625628281 628317719
3635.7 628317719 631568222 634167633 634669075 635974121 638432999 640996323 643112106 644173584
3643.4 644173584 646935425 650800323 655660095 654028931 651768951 658623657 658714676 655833435 655530167
3652.1 655530167 661017685 665749283 669822159 674826508 667600632 669409943 674732971 676492615
3659.8 676492615 678103561 678789902 680820847 681808929 684085846 686620789 687263107 691523666 694176254
3668.5 694176254 693741302 694683838 688712845 690837173 699223099 709301529 710541611 691082840
3676.2 691082840 693223572 700892487 706049576 704095306 703782272 706388855 708231506 709601288
3683.9 709601288 709696579 710089951 714472046 721268845 712057343 706457901 713828506 708102722 708180542
3692.6 708180542 713701859 714483643 716087723 716632690 716266403 717219315 717540970 720015259 723043289
3701.3 723043289 718204575 715821152 720894547 723131180 723241348 723954086 726304169 729868851 724286423
3709.9 724286423 729607697 734742203 719594803 723537521 728107147 728838959 729666748 732212601
3717.7 732212601 733690186 729822083 731450272 737511597 733497314 729012527 734841156 736286163
3725.4 736286163 735453262 733253021 732288055 734910965 736473007 742767792 740152740 732292404 740795822
3734 740795822 739919586 730186005 731708832 734017105 734502182 737539291 740601425 736629105 739827576
3742.7 739827576 750568848 738725052 722933197 734003601 740464554 745813141 743392792 733669815
3750.4 733669815 743331604 738651886 733037109 737922287 741729965 744680099 738913345 741369858
3758.2 741369858 747915344 740011826 737536316 741501389 742488022 742805710 746531448 743029251 737580261
3766.8 737580261 741175842 746820526 747723923 738779678 740469284 743292694 743155823 743543091 743496780
3775.5 743496780 744683609 745031586 747767029 747624207 740202408 742641296 744938889 746170654 748122177
3784.2 748122177 744935684 743592377 744590988 745024719 745787506 745749969 745827408 746145172 746362762 745943680
3793.8 745943680 747146759 750275726 746456070 742216949 744450989 748119507 753633118 747836380
3801.5 747836380 737232132 741312637 744333191 748496246 753729935 744280930 739755936 744062653
3809.3 744062653 745775375 746353226 746829529 746838608 748002014 753282242 752561264 738597107 743434753
3817.9 743434753 749220047 753858643 754701233 735404587 738972015 744463577 746177444 748903732
3825.7 748903732 749254150 744733810 745054703 747663345 750054474 750829239 742680435 744943848 751798477
3834.3 751798477 745863647 745755005 754120941 745876770 741438217 748686752 742530594 742436905 749556122
3843 749556122 747319107 743730087 746330109 747451324 746888885 748214645 748085175 750197220 755984192
3851.7 755984192 750219650 749723740 735544205 737763748 747643127 745334702 743313065 746028366
3859.4 746028366 748532181 750940857 745455322 744731064 749884262 743564224 739742126 744732361
3867.1 744732361 750286636 755817337 746445999 737855835 742623444 748928909 752084198 741271210
3874.8 741271210 742621841 747041397 746483917 748182831 752429962 747077789 739830170 746273041
3882.6 746273041 748163376 749370575 754172745 740485382 741140518 745694275 747463455 752845459
3890.3 752845459 752000732 742036972 743225403 746479416 744922867 745849762 746951523 749130173 750461197
3898.9 750461197 741672974 747450562 749385910 743443146 747482834 743726578 742335129 743557205
3906.7 743557205 744842682 746801682 746249695 746299133 746790390 747654037 746710968 745000305 746380997
3915.3 746380997 748799591 745634079 742363434 746708603 746599960 742821121 745072632 746744766
3923.1 746744766 747493286 744714661 741912842 744235992 746086807 746889648 746238861 746613007 747732620
3931.7 747732620 744217453 742939682 744552917 745023117 745525436 745933456 745419235 744755630 744980316
3940.4 744980316 746992111 748022537 743285370 742094574 744181900 745345688 746418381 744120636
3948.1 744120636 744454117 745021591 742386475 744113083 744720993 744294128 745353622 745250702 744625626
3956.8 744625626 743937531 744443283 744454651 745049896 745819778 744365463 743945389 744084473 744051208 743863907
3966.5 743863907 743470383 743911285 743856659 743251114 744067688 744492645 743801193 744324799 744732437 744680786
3976.1 744680786 744411316 743918228 743833008 743791428 744329681 744187851 743411942 743518753 744289856 744822922
3985.7 744822922 744244537 743805771 744329224 744938965 744238129 743389511 743784180 744277344 744907913 744999466
3995.4 744999466 744237061 744164352 744524612 744251175 743849945
4000.2 743849945
##END=$$ End of the data block
