##TITLE=$$ Begin of the data block
##JCAMP-DX=5.00 $$ ACD/SpecManager v 10.08
##SPECTROMETER/DATA SYSTEM=Varian
##DATE=18 Dec 2012 14:35:38
##DATA TYPE=INFRARED SPECTRUM
##DATA CLASS=XYDATA
##ORIGIN=
##OWNER=
##NPOINTS=3735
##FIRSTX=399.26403809
##LASTX=4000.35498047
##MAXX=4000.35498047
##MINX=399.26403809
##MAXY=80.73953247
##MINY=21.11409569
##XFACTOR=1.0000000000
##YFACTOR=0.000000100000000
##FIRSTY=62.77685547
##DELTAX=0.96440572
##XUNITS=1/CM
##YUNITS=TRANSMITTANCE
##XYDATA=(X++(Y..Y))
$$ plain form
399.3 627768555 623826065 610780830 598300133 592576828 602210770 607538300 604485245 598571053
407 598571053 595532341 598840256 601197624 595402870 594406471 602806320 596849442 589482536 595746346
415.7 595746346 598308487 588952560 567462234 562591782 582440453 597260284 599676323 595502205
423.4 595502205 595461006 594148178 590918617 590957603 594421082 594855423 597205353 596124268 592675629
432.1 592675629 596535110 595390587 594042015 596318092 592824287 589294891 589291382 589635162 588581047
440.7 588581047 586609306 585876198 588082428 588792152 586357765 583972626 586471519 589500771 589390945
449.4 589390945 587282104 583149529 578373299 577029648 583751831 585315857 581605644 583084068
457.1 583084068 583560829 583475075 581284103 581806984 581274376 571470757 568516884 570699043 574502487
$$ packed form
399.3F27768555l942490j3045235j2480697n723305R633942N327530l053055n914192
407E98571053l038712L307915K357368n794754r96399Q399849n956878p366906O263810
415.7E95746346K562141r355927k1490326m870452J9848671J4819831K416039m174118
423.4E95502205m1199j312828l229561L8986L463479M34341K349930j081085l448639
432.1E92675629L859481j144523j348572K276077l493805l529396l509L43780j054115
440.7E88581047j971741p33108K206230P09724k434387k385139K498893L029252j09826
449.4E89390945k108841m132575m776230j343651O722183J564026l710213J478424
457.1E83084068M76761q5754k190972N22881n32608r803619k953873K182159L803444
$$ plain form
465.8 574502487 578803444 581328201 582066841 580144272 579032669 578579178 578391190 578295135 580354576
474.5 580354576 578257751 574291840 577239342 574671593 571045685 575169754 580121765 583516960
482.2 583516960 584051933 583099022 585849152 587316551 585324440 585951042 584456940 579350624 579522591
490.9 579522591 581601486 579872475 578567162 577991524 578073273 580256500 582115936 585286446 586771851
499.6 586771851 584357567 582637291 582705917 584235573 582089615 578769379 576031799 573589516 577439117
508.2 577439117 581303329 582946434 581424675 576541672 572520638 570998535 570256767 566885033 563108482
516.9 563108482 562230301 564460945 565719452 565215797 565343552 564874458 565467567 565497322 563439369
525.6 563439369 562487411 563004417 562229309 562077103 561352768 559340820 560138626 559869576 560988235
$$ packed form
465.8E74502487M300957K524757P38640j922569j111603m53491j87988r6055K059441
474.5E80354576k096825l965911K947502k567749l625908M124069M952011L395195
482.2E83516960N34973r52911K750130J467399j992111O26602j494102n106316J71967
490.9E79522591K078895j729011j305313n75638Q1749K183227J859436L170510J485405
499.6E86771851k414284j720276O8626J529656k145958l320236k737580k442283L849601
508.2E77439117L864212J643105j521759m883003m021034j522103p41768l371734l776551
516.9E63108482q78181K230644J258507n03655J27755m69094N93109K9755k057953
525.6E63439369r51958N17006p75108j52206p24335k011948P97806k69050J118659
$$ plain form
534.3 560988235 563382874 563558846 564253960 562845650 561286888 560547905 559864311 560525703 561579285
543 561579285 562063560 561578598 563628387 565561600 565116425 565420074 565731010 567351303 569809914
551.6 569809914 570612068 570113411 567512970 565200539 565984268 565532722 564783325 565624466 566159019
560.3 566159019 568233147 569891968 570179825 569361115 568302727 568687210 568352585 567550621 566690369
569 566690369 566624527 567364502 568070297 567331161 566018295 566576805 565610657 564268074 564052010 564651413
578.6 564651413 565747910 564507065 562748795 561719055 561761093 561200256 561367416 563331757 564347305
587.3 564347305 566094208 567469063 567532158 567432404 567295265 565845146 564234505 564552841 564379196
596 564379196 563983269 563893738 563384056 561487541 559502563 558207359 555029144 552465897 549256210
$$ packed form
534.3E60988235K394639J75972O95114j408310j558762p38983o83594O61392J053582
543E61579285M84275m84962K049789J933213m45175L03649L10936J620293K458611
551.6E69809914Q02154m98657k600441k312431P83729m51546p49397Q41141N34553
560.3E66159019K074128J658821K87857q18710j058388L84483l34625q01964q60252
569E66690369o5842P39975P05795p39136j312866N58510r66148j342583k16064N99403
578.6E64651413J096497j240845j758270j029740M2038n60837J67160J964341J015548
587.3E64347305J746903J374855O3095r9754j37139j450119j610641L18336j73645
596E64379196l95927q9531n09682j896515j984978j295204l178215k563247l209687
$$ plain form
604.7 549256210 544041901 537366867 529457893 522028122 513554344 503888817 491243820 478510170
612.4 478510170 467221794 459097099 456260605 456716194 458743019 459087029 457861061 453129539 445451660
621.1 445451660 435023689 424906120 420339737 420332489 426264114 435965157 450648613 466821632
628.8 466821632 481108360 491598663 497610359 500319557 497691269 492201195 484926720 479804268
636.5 479804268 476031952 472481003 472719383 475482979 483050041 494513588 509728546 525499039
644.2 525499039 540551147 554041862 565178833 574521484 579564781 581841125 583951530 586189499
651.9 586189499 588765221 591224747 593392868 594690666 595888481 597684975 598758430 599195023 599926186
660.6 599926186 600838470 601551285 602063408 602078018 602844009 604765549 603569260 597466202 602929497
$$ packed form
604.7E49256210n214309o675034p908974p429771q473778r665527j2644997j2733650
612.4D78510170j1288376q124695k836494M55589K026825L44010j225968m731522p677879
621.1D45451660j0427971j0117569m566383p248N931625R701043J4683456J6173019
628.8D66821632J4286728J0490303O011696K709198k628288n490074p274475n122452
636.5D79804268l772316l550949K38380K763596P567062J1463547J5214958J5770493
644.2E25499039J5052108J3490715J1136971R342651N043297K276344K110405K237969
651.9E86189499K575722K459526K168121J297798J197815J796494J073455M36593P31163
660.6E99926186R12284P12815N12123J4610P65991J921540j196289o103058N463295
$$ plain form
669.3 602929497 606555634 608305969 609440727 610670471 611198997 610960999 610374832 610738525 612494431
678 612494431 613055916 613044090 614126396 615724678 617067451 617607269 616926193 615014725 613164940
686.7 613164940 611874580 610018578 607551384 606252556 605324173 604175072 602829208 601700745 602017670
695.3 602017670 601510925 600353470 598953743 597213783 596525078 595761642 595421448 594470863 593617096
704 593617096 594631233 595541840 597763367 600406990 602349625 604814644 606364517 607858086 609468269
712.7 609468269 610083237 610648270 612135162 613815651 615121269 617021294 620196915 623262787 624106979
721.4 624106979 624402008 625168915 626085625 626074791 625330467 625297852 624265747 623297653 623245926 622380867
731 622380867 620757256 619629784 619410667 619035759 619617691 620260658 619853554 619688492 618361435 617067566
$$ packed form
669.3F02929497L626137J750335J134758J229744N28526k37998n86167L63693J755906
678F12494431N61485j1826J082306J598282J342773N39818o81076j911468j849785
686.7F13164940j290360j856002k467194j298828r28383j149101j345864j128463L16925
695.3F02017670n06745j157455j399727j739960o88705p63436l40194r50585q53767
704E93617096J014137R10607K221527K643623J942635K465019J549873J493569J610183
712.7F09468269O14968N65033J486892J680489J305618J900025L175621L065872Q44192
721.4F24106979K95029P66907R16710j0834p44324l2615j032105r68094n1727q65059
731F22380867j623611j127472k19117l74908N81932O42967m07104j65062j327057j293869
$$ plain form
740.7 617067566 617539825 618667793 619408340 619757805 621023712 622975540 626270409 630088730 633150864
749.3 633150864 636884918 639643059 641310577 643635864 645613403 648072205 651038666 653621521
757.1 653621521 655823364 657323914 660159988 663116379 664556046 665545578 665986786 665883255 664241943
765.7 664241943 662280655 660856171 659499512 659053497 659327316 659579391 660144577 661823502 663843689
774.4 663843689 664904404 665696640 668247986 671269989 672845764 674101410 675586090 677784424 680004120
783.1 680004120 682080154 683804932 684910507 686131744 687400589 689250259 690049591 690188751 690416183
791.8 690416183 690654602 690595245 689171600 688152542 687939682 688940887 688959045 688431015 689249420 689814148
801.4 689814148 690019302 689299011 689657745 689297256 688646088 689056702 688488922 689152679 689055099 688835831
$$ packed form
740.7F17067566M72259J127968P40547L49465J265907J951828L294869L818321L062134
749.3F33150864L734054K758141J667518K325287J977539K458802K966461K582855
757.1F53621521K201843J500550K836074K956391J439667R89532M41208j03531j641312
765.7F64241943j961288j424484j356659m46015K73819K52075N65186J678925K020187
774.4F63843689J060715P92236K551346L022003J575775J255646J484680K198334K219696
783.1F80004120K076034J724778J105575J221237J268845J849670P99332J39160K27432
791.8F90416183K38419n9357j423645j019058k12860J001205J8158n28030Q18405N64728
801.4F89814148K05154p20291L58734l60489o51168M10614n67780O63757r7580k19268
$$ plain form
811.1 688835831 689471130 689932632 690804443 691346207 692289505 693013153 693364182 693127213 693657455 693107376
820.7 693107376 690967331 690124283 689300995 689731979 688922348 686802139 685280228 683210144 681217422
829.4 681217422 677797470 673953400 670497589 667738800 664820862 660659790 656672440 652557602
837.1 652557602 648119431 643783646 640139618 636728439 634028778 632737389 631315384 629274940
844.8 629274940 627025452 625125046 624495430 625099525 626095085 627785797 630393333 633259315 636959496
853.5 636959496 640677643 643822556 647920532 652290192 655358124 657572250 659308090 660823441
861.2 660823441 663664474 666261749 668381042 670247421 671244888 672376633 673270874 675300217 677020721
869.9 677020721 677437744 677708588 678065491 678484955 678665924 679639435 679934387 680160294 679657593 678672638
$$ packed form
811.1F88835831O35299M61502Q71811N41764R43298P23648L51029k36969N30242n50079
820.7F93107376k140045q43048q23288M30984q09631k120209j521911k070084j992722
829.4F81217422l419952l844070l455811k758789k917938m161072l987350m114838
837.1F52557602m438171m335785l644028l411179k699661j291389j422005k040444
844.8F29274940k249488j900406o29616O04095R95560J690712K607536K865982L700181
853.5F36959496L718147L144913M097976M369660L067932K214126J735840J515351
861.2F60823441K841033K597275K119293J866379R97467J131745Q94241K029343J720504
869.9F77020721M17023K70844L56903M19464J80969R73511K94952K25907n02701r84955
$$ plain form
879.5 678672638 677629547 674211121 671695557 669689255 667562714 665481644 662709503 660104752
887.3 660104752 657497635 656702576 656410522 655558243 654949188 654921188 655932541 656677475 657340317 658110580
896.9 658110580 658658371 658193283 657988281 658113022 657685318 657767715 655862885 653931808 653425522 651602707
906.5 651602707 649392471 647177505 644738159 641658401 638184547 635090637 632092896 629119530
914.3 629119530 625273590 621344681 618621063 616071053 613136139 610196304 607993698 605644608
922 605644608 603481941 601777725 598924904 596354713 594498024 592586784 590991249 590227814 589888763
930.7 589888763 589902916 590878639 591582680 592731857 595272522 598527184 601407700 603670425 606695480
939.3 606695480 610979080 615327301 619089355 622978401 626130676 629253693 633765030 637614822
$$ packed form
879.5F78672638j043091l418426k515564k006302k126541k081070k772141k604751
887.3F60104752k607117p95059k92054q52279o09055k8000J011353P44934O62842P70263
896.9F58110580N47791m65088k05002J24741m27704Q2397j904830j931077n06286j822815
906.5F51602707k210236k214966k439346l079758l473854l093910k997741k973366
914.3F29119530l845940l928909k723618k550010k934914k939835k202606k349090
922F05644608k162667j704216k852821k570191j856689j911240j595535p63435l39051
930.7E89888763J4153R75723P04041J149177K540665L254662K880516K262725L025055
939.3F06695480M283600M348221L762054L889046L152275L123017M511337L849792
$$ plain form
947.1 637614822 640416183 643509369 645928879 646928864 647062607 647425385 647416916 646322708 645663376
955.7 645663376 645065918 643783035 642305069 640408936 637818184 635195694 632147369 628600883 625339050
964.4 625339050 622123146 619261093 616330452 613509140 611504936 610373878 609362030 607776680
972.1 607776680 606605110 606163750 605571327 604468575 603464088 602446175 601188011 599665871 597921715
980.8 597921715 596428528 594666748 592450104 589532928 586912727 585275574 583155098 580160637
988.5 580160637 576422234 572538185 567937317 561537552 553036537 541071739 525114479 512548790
996.2 512548790 513410568 524991875 537405434 544490089 547906532 549466286 549966240 549962845 548938179
1004.9 548938179 547234497 545205498 544486046 543944054 542600479 540789032 538797340 538129463 536780548
$$ packed form
947.1F37614822K801361L093186K419510R99985J33743L62778q469j094208o59332
955.7F45663376n97458j282883j477966j896133k590752k622490l048325l546486l261833
964.4F25339050l215904k862053k930641k821312k004204j131058j011848j585350
972.1F07776680j171570m41360n92423j102752j004487j017913j258164j522140j744156
980.8E97921715j493187j761780k216644k917176k620201j637153k120476k994461
988.5E80160637l738403l884049m600868o399765q501015j1964798j5957260j2565689
996.2E12548790Q61778J1581307J2413559P084655L416443J559754M99954l395j024666
1004.9E48938179j703682k028999p19452n41992j343575j811447j991692o67877j348915
$$ plain form
1013.6 536780548 534928856 533196945 530688362 527925377 525417061 523141708 520111160 517166252
1021.3 517166252 514700050 512511330 510013275 508256264 506266632 503562737 502265625 499687538
1029 499687538 497141266 494725304 492238464 490305023 487885704 486267700 484060669 482670135 481216927
1037.7 481216927 480154648 479458084 478559723 478935661 477768135 476990852 476162262 475990295 475994759 475724411
1047.4 475724411 476900673 476908836 477555733 477944832 478952293 479855423 480579910 481566391 480694313 481390495
1057 481390495 481272049 480777130 480474014 480029411 479712791 478311653 477722168 476040840 475255814 474721527
1066.6 474721527 474215126 473864174 472497749 472448463 471795883 470747070 469211922 468655510 467105560
1075.3 467105560 464871979 463886566 462330055 462690659 461872635 461681023 461147308 459006004 457838020
$$ packed form
1013.6E36780548j851692j731911k508583k762985k508316k275353l030548k944908
1021.3E17166252k466202k188720k498055j757011j989632k703895j297112k578087
1029D99687538k546272k415962k486840j933441k419319j618004k207031j390534j453208
1037.7D81216927j062279o96564q98361L75938j167526p77283q28590j71967M464k70348
1047.4D75724411J176262Q163O46897L89099J007461R03130P24487R86481q72078O96182
1057D81390495j18446m94919l03116m44603l16620j401138n89485j681328p85026n34287
1066.6D74721527n06401l50952j366425m9286o52580j048813j535148n56412j549950
1075.3D67105560k233581r85413j556511L60604q18024j91612n33715k141304j167984
$$ plain form
1084 457838020 456086388 454268761 450219574 446962395 442959442 438481789 434522057 428235970 421692734
1092.7 421692734 412490501 404034691 394695244 384708786 374808998 363588676 354503822 344119148
1100.4 344119148 334975319 325562325 317189598 308957539 300873413 294032021 285448360 279265652
1108.1 279265652 271406479 265793610 260103741 255271435 252447586 248043594 247628784 245960693
1115.8 245960693 246821957 247760124 248371811 249124050 249542084 252570782 253219090 255993805 257071209
1124.5 257071209 258534374 259536362 259662304 260973301 258748055 258611107 256192799 253501091 249491100
1133.2 249491100 245360909 243175583 238980389 237433510 234396610 234274464 232944832 230625782
1140.9 230625782 229515648 226463852 225272903 221400108 219626846 217272930 215801983 214520531
$$ packed form
1084D57838020j751632j817627m049187l257179m002953m477653l959732o286087o543236
1092.7D21692734r202233q455810r339447r986458r899788j1220322r084854j0384674
1100.4C44119148r143829r412994q372727q232059q084126o841392q583661o182708
1108.1B79265652p859173n612869n689869m832306k823849m403992m14810j668091
1115.8B45960693Q61264R38167O11687P52239M18034L028698O48308K774715J077404
1124.5B57071209J463165J001988J25942J310997k225246j36948k418308k691708m009991
1133.2B49491100m130191k185326m195194j546879l036900j22146j329632k319050
1140.9B30625782j110134l051796j190949l872795j773262k353916j470947j281452
$$ plain form
1148.6 214520531 212389717 213038483 211520805 212315483 211140957 212392006 214737778 215691776 217706089
1157.3 217706089 218096657 221257496 222035618 225249901 227735691 229710960 233825073 236044273 240721092
1166 240721092 243832111 249356728 254231434 259150906 264543228 269194717 276649418 282065773 289257565
1174.6 289257565 295155239 301795979 308699875 314456768 321211243 326470985 334182510 340023613
1182.4 340023613 346012077 352170982 357953415 363777237 367947884 374013939 378463898 383173065
1190.1 383173065 386959991 390946999 395855103 400024261 405383530 409439468 415196800 420416222
1197.8 420416222 425466881 430795288 436157265 442584572 447216911 452625656 457304573 462565994
1205.5 462565994 467635269 471555939 476127014 479808655 483841362 487068634 490800858 494507408
$$ packed form
1148.6B14520531k130814O48766j517678P94678j174526J251049K345772R53998K014313
1157.3B17706089L90568L160839P78122L214283K485790J975269M114113K219200M676819
1166B40721092L111019N524617M874706M919472N392322M651489P454701N416355P191792
1174.6B89257565N897674O640740O903896N756893O754475N259742P711525N841103
1182.4C40023613N988464O158905N782433N823822M170647O066055M449959M709167
1190.1C83173065L786926L987008M908104M169158N359269M055938N757332N219422
1197.8D20416222N050659N328407N361977O427307M632339N408745M678917N261421
1205.5D62565994N069275L920670M571075L681641M032707L227272L732224L706550
$$ plain form
1213.2 494507408 497824516 500657005 502347565 504694901 505975494 507560921 509172630 510504532
1220.9 510504532 511554146 512176437 513471680 513928757 514770432 515114250 515169029 515379143 515892754
1229.6 515892754 516843147 517164078 518256645 518791122 519618950 520526695 521784363 523268814 523472786
1238.3 523472786 524144783 524422951 525289574 525778275 526222000 527020073 527022667 527787437 528268394 529431725
1247.9 529431725 530041466 530357094 530882835 530735283 531230888 531495895 532067566 532154961 532697411 533124657
1257.6 533124657 533133163 534140129 534794312 535991974 536600914 537478561 538537865 539023399 539446983
1266.3 539446983 539840088 541040268 541338196 542446022 544115181 545570030 547428093 549356003 551729012
1274.9 551729012 553556747 555576553 556816673 558142738 560031548 561719742 563733597 565139999
$$ packed form
1213.2D94507408L317108K832489J690560K347336J280593J585427J611709J331902
1220.9E10504532J049614O22291J295243M57077Q41675L43818N4779K10114N13611
1229.6E15892754R50393L20931J092567N34477Q27828R07745J257668J484451K03972
1238.3E23472786O71997K78168Q66623M88701M43725P98073K594P64770M80957J163331
1247.9E29431725O09741L15628N25741j47552M95605K65007N71671Q7395N42450M27246
1257.6E33124657Q506J006966O54183J197662O08940Q77647J059304M85534M23584
1266.3E39446983L93105J200180K97928J107826J669159J454849J858063J927910K373009
1274.9E51729012J827735K019806J240120J326065J888810J688194K013855J406402
$$ plain form
1282.7 565139999 566827278 568852692 571573143 574223633 576589584 579137001 581154480 583147964
1290.4 583147964 584836044 586952057 588697281 589887619 591561127 593471794 595496674 597426834
1298.1 597426834 599730682 601677399 603610497 605578690 606857185 607899094 608761024 609526176 609896393
1306.8 609896393 610480804 611637650 612588387 613398476 614369583 615500526 616628571 617695923 618474808
1315.4 618474808 619256592 619953194 620409737 620746002 621170731 621946564 622797585 624340744 625902977
1324.1 625902977 626627197 627505417 628662567 629738464 630289268 630378036 630583992 630466232 630370674 630589104
1333.8 630589104 630635529 630611687 630752029 631357536 631946106 632036285 631847801 632208786 632957954 633000641
1343.4 633000641 632577858 632210999 631819382 631414490 631187477 631080132 630981369 631426582 631504478 631218147
$$ packed form
1282.7E65139999J687279K025414K720451K650490K365951K547417K017479J993484
1290.4E83147964J688080K116013J745224J190338J673508J910667K024880J930160
1298.1E97426834K303848J946717J933098J968193J278495J041909Q61930P65152L70217
1306.8F09896393N84411J156846R50737Q10089R71107J130943J128045J067352P78885
1315.4F18474808P81784O96602M56543L36265M24729P75833Q51021J543159J562233
1324.1F25902977P24220Q78220J157150J075897N50804Q8768K05956j17760r5558K18430
1333.8F30589104M6425k3842J40342O05507N88570R0179j88484L60985P49168M2687
1343.4F33000641m22783l66859l91617m04892k27013j07345r8763M45213P7896k86331
$$ plain form
1353.1 631218147 631120110 630363846 629568939 629271431 628531342 627657318 627786980 627574425 627034416 626582413
1362.7 626582413 625210762 625612717 626069946 625453720 624845200 623671417 622318420 621373978 620286942
1371.4 620286942 619807129 619281006 617351646 616169891 616336212 616762238 616631622 616037025 615703735
1380.1 615703735 615112724 614590073 614205208 613907814 614199677 615057106 615297318 614395561 615508766
1388.7 615508766 617267189 617901535 617986183 618230247 618545113 617356491 615361862 615621872 616108589
1397.4 616108589 616058502 613727493 612597504 613387756 613363876 613226929 612894135 610816269 609865799
1406.1 609865799 610316277 610265427 609283142 608023758 607309723 606942902 607018776 607500343 607658463 607684021
1415.7 607684021 607424927 607522240 608461609 604689140 604820175 606999321 607504082 607488937 606230316
$$ packed form
1353.1F31218147r8037p56264p94907k97508p40089q74024J29662k12555n40009m52003
1362.7F26582413j371651M01955M57229o16226o08520j173783j352997r44442j087036
1371.4F20286942m79813n26123j929360j181755J66321M26026j30616n94597l33290
1380.1F15703735n91011n22651l84865k97394K91863Q57429K40212r01757J113205
1388.7F15508766J758423O34346Q4648K44064L14866j188622j994629K60010M86717
1397.4F16108589n0087k331009j129989P90252k3880j36947l32794k077866r50470
1406.1F09865799M50478n0850r82285j259384p14035l66821P5874M81567J58120K5558
1415.7F07684021k59094R7313R39369l772469J31035K179146N04761j5145j258621
$$ plain form
1424.4 606230316 606989212 608580704 609406242 610724449 611356583 611375313 612075424 613696251 614774513
1433.1 614774513 614992638 616254921 616940422 614465790 615734634 618679543 620187798 621041641 622248192
1441.8 622248192 623178368 624399261 625052452 625831718 626844368 626848564 625558701 626563416 628495941
1450.5 628495941 629304848 630127945 631079979 632984734 634722443 635110741 634204674 632651367 634970131
1459.1 634970131 636574326 638984909 640198288 641360016 643806229 642514496 642957687 645202103
1466.8 645202103 647392883 648959427 650541153 653080368 653425827 652894897 654178085 658293915 661745529
1475.5 661745529 661976395 664278488 667209930 669293900 671018219 672083282 673438034 675073242
1483.2 675073242 676175995 676837540 677808228 677337494 676151733 677440796 675559616 673672333 675059280
$$ packed form
1424.4F06230316P58896J591492Q25538J318207O32134J8730P00111J620827J078262
1433.1F14774513K18125J262283O85501k474632J268844K944909J508255Q53843J206551
1441.8F22248192R30176J220893O53191P79266J012650M196j289863J004715J932525
1450.5F28495941Q08907Q23097R52034J904755J737709L88298r06067j553307K318764
1459.1F34970131J604195K410583J213379J161728K446213j291733M43191K244416
1466.8F45202103K190780J566544J581726K539215L45459n30930J283188M115830L451614
1475.5F61745529K30866K302093K931442K083970J724319J065063J354752J635208
1483.2F75073242J102753O61545R70688m70734j185761J289063j881180j887283J386947
$$ plain form
1491.9 675059280 676097641 676764145 677643127 677698669 671778870 673035583 672599182 668840714 669235840
1500.6 669235840 668201447 667120209 666956635 668225479 668229904 658031311 650361710 651832809 654966583
1509.3 654966583 654636841 655442200 653379288 649740448 649457169 648150101 647484894 643550110 640683899
1518 640683899 643857422 646991501 645039978 638734703 637897949 639323273 641467133 638469315 637412186
1526.6 637412186 637128754 635032234 635147438 635546494 635540695 635186806 634126663 629480400 630325317
1535.3 630325317 630709038 630883446 632751770 626787453 621324730 624483719 625646706 624346008 625630188
1544 625630188 626541138 624970627 627172127 627923965 629029121 629109306 627014771 628484573 629310112
1552.7 629310112 630843544 629228210 629845963 634311981 637984810 633434906 622373734 631471977
$$ packed form
1491.9F75059280J038361O66504Q78982N5542n919799J256713m36401l758468L95126
1500.6F69235840j034393j081238j63574J268844M425j0198593p669601J471099L133774
1509.3F54966583l29742Q05359k062912l638840k83279j307068o65207l934784k866211
1518F40683899L173523L134079j951523o305275q36754J425324K143860k997818j057129
1526.6F37412186k83432k096520J15204L99056n799l53889j060143m646263Q44917
1535.3F30325317L83721J74408J868324n964317n462723L158989J162987j300698J284180
1544F25630188R10950j570511K201500P51838J105156Q0185k094535J469802Q25539
1552.7F29310112J533432j615334O17753M466018L672829m549904j1061172R098243
$$ plain form
1560.4 631471977 636797676 640065155 641706161 642186203 641093292 641136551 642523117 643828354 645525208
1569.1 645525208 641080093 642134171 644351501 644849472 645602875 645994263 645357208 637491226 639269333
1577.7 639269333 640259399 639241066 638465958 636771736 635898743 634279556 633449440 632007561 630333138
1586.4 630333138 628928490 626558037 624894447 621598473 619349861 616375771 613838463 611506844
1594.1 611506844 608844261 607545052 604642792 603283310 601156883 599424133 596918526 594188423
1601.9 594188423 592276077 588580894 586712914 583824310 581773987 578461723 576194611 574267921
1609.6 574267921 571173439 571178055 569083023 567740479 565281830 564720764 563984947 552444267 553624611
1618.2 553624611 553132362 552778282 550416374 549816628 547901993 542519379 543925018 543205261 543468704
$$ packed form
1560.4F31471977N325699L267479J641006M80042j092911M3259J386566J305237J696854
1569.1F45525208m445115J054078K217330M97971P53403L91388o37055p865982J778107
1577.7F39269333R90066j018333p75108j694222q72993j619187q30116j441879j674423
1586.4F30333138j404648k370453j663590l295974k248612k974090k537308k331619
1594.1F11506844k662583j299209k902260j359482k126427j732750k505607k730103
1601.9E94188423j912346l695183j867980k888604k050323l312264k267112j926690
1609.6E74267921l094482M616k095032j342544k458649n61066p35817j1540680J180344
1618.2E53624611m92249l54080k361908n99746j914635n382614J405639p19757K63443
$$ plain form
1626.9 543468704 540210991 537955742 536931763 535184822 534218674 532273560 532881737 532216759 528533134
1635.6 528533134 525452881 526595459 527309990 527329483 528363380 527179489 527753792 526917801 527874222
1644.3 527874222 528571510 525204468 525909157 524196396 527631531 528284340 530554390 533964043 535934486
1653 535934486 528510399 528270073 532861748 534156761 536154137 536977119 537894936 539486427 540996437
1661.6 540996437 542926521 542591095 546338234 548312988 550524940 553102379 554746552 554799919 554799042
1670.3 554799042 559152832 559889832 562675743 565898743 566893387 567727776 570484047 574530296 577163506
1679 577163506 580602341 581608124 584926262 589873772 590102158 587674026 589244690 595651207 599268456
1687.7 599268456 601947212 605146217 607395172 611675529 615406418 619410172 623707428 628425026
$$ packed form
1626.9E43468704l257713k255249j023979j746941r66148j945114O08177o64978l683625
1635.6E28533134l080253J142578P14531J9493J033897j183891N74303q35991R56421
1644.3E27874222O97288l367042P04689j712761L435135O52809K270050L409653J970443
1653E35934486p424087k40326M591675J295013J997376Q22982R17817J591491J510010
1661.6E40996437J930084l35426L747139J974754K211952K577439J644173N3367q77
1670.3E54799042M353790P37000K785911L223000R94644Q34389K756271M046249K633210
1679E77163506L438835J005783L318138M947510K28386k428132J570664O406517L617249
1687.7E99268456K678756L199005K248955M280357L730889M003754M297256M717598
$$ plain form
1695.4 628425026 626708336 630245857 636359520 642012405 645809937 640696487 648460007 654297104
1703.1 654297104 658734207 662011490 664601669 667508011 671168518 675762024 678409500 680399399
1710.8 680399399 683278503 685989532 688786011 689580841 690472641 694066696 696352081 691759872 696476059
1719.5 696476059 701209106 703398666 704808884 705321579 705771866 707173157 708279724 709071198 710174789
1728.2 710174789 712178802 711824188 711682205 715791397 719809036 716640854 710198822 715232315 719434357
1736.9 719434357 721336746 723822632 722952347 720176163 723981323 726899796 726938705 728634109 732639542
1745.5 732639542 735782623 737619553 738682709 739043274 743090057 743269043 742463303 746965179 749460754
1754.2 749460754 751737823 754582748 754129791 755381775 758189468 760619965 763398972 761810532
$$ packed form
1695.4F28425026j716690L537521O113663N652885L797532n113450P763520N837097
1703.1F54297104M437103L277283K590179K906342L660507M593506K647476J989899
1710.8F80399399K879104K711029K796479P94830Q91800L594055K285385m592209M716187
1719.5F96476059M733047K189560J410218N12695M50287J401291J106567P91474J103591
1728.2G10174789K004013l54614j41983M109192M017639l168182o442032N033493M202042
1736.9G19434357J902389K485886q70285k776184L805160K918473L8909J695404M005433
1745.5G32639542L143081J836930J063156L60565M046783J78986q05740M501876K495575
1754.2G49460754K277069K844925m52957J251984K807693K430497K779007j588440
$$ plain form
1761.9 761810532 761465759 764280701 765189972 765741806 767129898 767925262 765186310 767626114 772154160
1770.6 772154160 772549133 769593430 768410797 772546539 774315643 773064423 774370804 774541397 775347824
1779.3 775347824 775433044 774289017 775501709 777677460 779432602 778912125 779257812 781150970 782278595
1788 782278595 782530594 783315735 783038940 782614441 779960785 778779221 782348099 783459015 783129807
1796.7 783129807 784915848 786951370 787308121 786344681 787819824 786888123 786591873 787666321 787495499
1805.3 787495499 787887268 787904739 787664948 788563614 789936829 788993683 789515762 791168365 791762314
1814 791762314 792590103 792396622 792586746 791790009 791196899 791525269 791500244 792535706 792644119 794010773
1823.7 794010773 795536804 793232117 793573685 796304626 798546295 797316589 791983795 792617569 794755936
$$ packed form
1761.9G61810532l44773K814942R09271N51834J388092P95364k738952K439804M528046
1770.6G72154160L94973k955703j182633M135742J769104j251220J306381J70593Q06427
1779.3G75347824Q5220j144027J212692K175751J755142n20477L45687J893158J127625
1788G82278595K51999P85141k76795m24499k653656j181564L568878J110916l29208
1796.7G83129807J786041K035522L56751r63440J475143r31701k96250J074448j70822
1805.3G87495499L91769J7471k39791Q98666J373215r43146N22079J652603N93949
1814G91762314Q27789j93481J90124p96737n93110L28370k5025J035462J08413J366654
1823.7G94010773J526031k304687L41568K730941K241669j229706n332794O33774K138367
$$ plain form
1832.3 794755936 794837112 795165863 796367493 797459106 797690277 797408447 798548355 798857422 799046326
1841 799046326 798862152 799667206 800130920 794341202 795794983 798097687 798470840 798397446 799095154 800559387
1850.7 800559387 800975952 801232910 801079178 801255341 801111145 800691757 800643692 800390778 800743027 800669556
1860.3 800669556 801147842 801352463 801823502 802661667 802875290 803534546 803365707 803637543 801897354
1869 801897354 799913025 801041412 802017746 802647400 802909775 803493881 803524933 803864670 804399109 804628754
1878.6 804628754 804880295 804680252 805009918 804757690 804619064 803970490 803279495 803647385 804026184 805522156
1888.3 805522156 805153046 803364563 804548798 805687027 805748138 806008606 805446167 804038086 804272537
1896.9 804272537 804330368 804532166 804621964 804514389 805103531 805610809 806352158 806039886 806123962 806671371
$$ packed form
1832.3G94755936Q1176L28751J201630J091613K31171k81830J139908L09067J88904
1841G99046326j84174Q05054M63714n789718J453781K302704L73153p3394O97708J464233
1850.7H00559387M16565K56958j53732J76163j44196m19388m8065k52914L52249p3471
1860.3H00669556M78286K04621M71039Q38165K13623O59256j68839K71836j740189
1869H01897354j984329J128387R76334O29654K62375N84106L1052L39737N34439K29645
1878.6H04628754K51541k00043L29666k52228j38626o48574o90995L67890L78799J495972
1888.3H05522156l69110j788483J184235J138229O1111K60468n62439j408081K34451
1896.9H04272537N7831K01798Q9798j07575N89142N07278P41349l12272Q4076N47409
$$ plain form
1906.6 806671371 806317368 805939636 805467148 804654770 804248505 805046768 804993057 805287704 805915146 806287994
1916.2 806287994 807395325 805301743 804541550 805841675 806320877 806530533 804925537 804079742 804716873
1924.9 804716873 805145416 805155334 805304184 805466537 805927124 806371155 806191635 806424484 806282806 805989914
1934.6 805989914 805190887 804719467 805013504 804924545 805084457 804975815 806168671 806504059 804476929
1943.2 804476929 805063629 805796509 805662766 805455704 805374908 805084000 804667358 804613724 804680023 804839401
1952.9 804839401 804969254 805126266 805055695 805447311 805730438 805459137 805422287 805183182 804629517 804186707
1962.5 804186707 804370117 804382553 804607239 804998245 804244537 803994446 804666748 805144043 805065155 805148087
1972.2 805148087 805085144 804607544 804357910 804356308 804296341 803641586 803479538 803810196 804056320 804147339
$$ packed form
1906.6H06671371l54003l77732m72488q12378m06265P98263n3711K94647O27442L72848
1916.2H06287994J107331k093582p60193J300125M79202K09656j604996q45795O37131
1924.9H04716873M28543R918J48850J62353M60587M44031j79520K32849j41678k92892
1934.6H05989914p99027m71420K94037q8959J59912j08642J192856L35388k027130
1943.2H04476929N86700P32880j33743k07062q0796k90908m16642n3634O6299J59378
1952.9H04839401J29853J57012p0571L91616K83127k71301l6850k39105n53665m42810
1962.5H04186707J83410J2436K24686L91006p53708k50091O72302M77295p8888Q2932
1972.2H05148087o2943m77600k49634j602n9967o54755j62048L30658K46124R1019
$$ plain form
1981.8 804147339 803893280 803767319 803592148 803710098 803628616 803138275 802524261 802127457 802481766 802361145
1991.5 802361145 801304550 801336212 802661819 803103180 802754593 802743378 802825699 802920685 802436905 801996536
2001.1 801996536 801462708 801271515 801430359 801179504 801277084 801322937 801591873 801956863 802337723 802595978
2010.7 802595978 802117996 801389084 800502396 800064697 799979935 799702148 799318771 799448700 799727554 799856644
2020.4 799856644 800423431 800593948 800245743 799899826 799845810 799464340 798924332 798654251 798303680 798404160
2030 798404160 798073502 798065491 798562546 798568573 798350906 798009338 798260727 798386078 798138123 797671661 797304382
2040.6 797304382 796743317 796188583 796356659 796102905 796397934 796613617 796588898 796872864 796712265 797058792
2050.3 797058792 797014389 796398315 795730743 795397186 795200424 794972153 794895096 794559784 794863434 795065918
$$ packed form
1981.8H04147339k54059j25961j75171J17950q1482m90341o14014l96804L54309j20621
1991.5H02361145j056595L1662J325607M41361l48587j1215Q2321R4986m83780m40369
2001.1H01996536n33828j91193J58844k50855R7580M5853K68936L64990L80860K58255
2010.7H02595978m77982p28912q86688m37699q4762k77787l83377J29929K78854J29090
2020.4G99856644N66787J70517l48205l45917n4016l81470n40008k70081l50571J00480
2030G98404160l30658q011M97055O027k17667l41568K51389J25351k47955m66462l67279
2040.6G97304382n61065n54734J68076k53754K95029K15683k4719K83966j60599L46527
2050.3G97058792m4403o16074o67572l33557j96762k28271p7057l35312L03650K02484
$$ plain form
2059.9 795065918 795353851 795312424 794826126 794800949 794105911 793467636 792796631 792508698 792532196 792125549
2069.6 792125549 791593246 791245804 791749878 791752625 791651382 791395187 790892563 790506592 789520187 789115753
2079.2 789115753 788814011 788271027 787734833 787749176 788127518 788178101 788358536 788209991 788245773 788116531
2088.9 788116531 788237610 788687897 788274765 787544174 787088623 787253113 787050705 786975327 787492599 788143768
2098.5 788143768 788539429 788452148 788797684 789234238 789856186 789837799 789412689 789367905 789298935 789463272
2108.1 789463272 789231262 789398651 789746475 790373306 790964813 790638580 790897827 791105270 791088638 791157608
2117.8 791157608 791067429 790563126 789822006 789445419 789376068 789958420 790100861 789937820 789829865 789560165
2127.4 789560165 789686356 789794540 789764328 789674377 789412994 788679733 788691788 789177475 789029922 789151993
$$ packed form
2059.9G95065918K87933m1427m86298k5177o95038o38275o71005k87933K3498m06647
2069.6G92125549n32303l47442N04074K747j01243k56195n02624l85971r86405m04434
2079.2G89115753l01742n42984n36194J4343L78342N0583J80435j48545L5782j29242
2088.9G88116531J21079M50287m13132p30591m55551J64490k02408p5378N17272O51169
2098.5G88143768L95661q7281L45536M36554O21948j8387m25110m4784o8970J64337
2108.1G89463272k32010J67389L47824O26831N91507l26233K59247K07443j6632O8970
2117.8G91157608r0179n04303p41120l76587o9351N82352J42441j63041j07955k69700
2127.4G89560165J26191J08184l0212q9951k61383p33261J2055M85687j47553J22071
$$ plain form
2137.1 789151993 789443130 789732971 790082245 790706787 790895386 790926590 790910110 790543289 790810928 790520706
2146.7 790520706 790213547 790174561 790318527 790802383 790641479 790852432 791273270 791905136 792471313 792464371
2156.4 792464371 791991119 791780319 792408981 792293243 792061462 791913071 791668854 791557007 791849136 792642746
2166 792642746 792754364 792892685 792735748 792693481 792654190 792078018 791920471 791703262 791693802 791142120 790706558
2176.6 790706558 790922623 791007996 791354446 791538162 791798859 791859818 791780167 791595840 791354523 791206589
2186.3 791206589 791073074 791361389 791427689 791714630 792228699 792846985 793622818 794199982 794543762 794577942
2195.9 794577942 794902649 794705887 794496536 794800949 794948349 794990921 794804077 794899521 795220108 795786362
2205.5 795786362 795900421 795820084 796133347 796367035 796709671 796388626 795972672 795942307 795940094 796123657
$$ packed form
2137.1G89151993K91137K89841L49274O24542J88599L1204j6480l66821K67639k90222
2146.7G90520706l07159l8986J43966M83856j60904K10953M20838O31866N66177o942
2156.4G92464371m73252k10800O28662j15738k31781j48391k44217j11847K92129P93610
2166G92642746J11618J38321j56937m2267l9291n76172j57547k17209r460n51682m35562
2176.6G90706558K16065Q5373L46450J83716K60697O0959p9651j84327k41317j47934
2186.3G91206589j33515K88315O6300K86941N14069O18286P75833N77164L43780L4180
2195.9G94577942L24707j96762k09351L04413J47400M2572j86844R5444L20587N66254
2205.5G95786362J14059q0337L13263K33688L42636l21045m15954l0365k213J83563
$$ plain form
2215.2 796123657 796443558 796380920 796163406 796484833 796603851 796935577 796930237 796781693 796956177 796861191
2224.8 796861191 796982498 796431198 796273956 796114426 795883789 796543503 796464691 796583939 796829758 796817322
2234.5 796817322 796865463 796821213 796803513 796505814 796114502 795572891 795325012 795235748 795699463 796287231
2244.1 796287231 796175842 796234741 796340942 796234283 796025162 796219559 796079483 795674438 795467072 795313492
2253.8 795313492 795689697 795720749 795887833 796046524 795962601 796142273 796546936 796859665 796602859 796731873
2263.4 796731873 796684875 796887894 796997833 796662140 796629562 796054993 796262207 796666412 796856308 796861420
2273 796861420 796569519 796853790 796916656 797161407 797230453 796994781 796393433 796118088 796326447 796255646
2282.7 796255646 796654358 796444321 796390228 796504898 796663055 796889191 796188965 796173248 796435318 796856766
$$ packed form
2215.2G96123657L19901o2638k17514L21427J19018L31726n340j48544J74484r4986
2224.8G96861191J21307n51300j57242j59530k30637O59714p8812J19248K45819j2436
2234.5G96817322M8141m4250j7700k97699l91312n41611k47879q9264M63715N87768
2244.1G96287231j11389N8899J06201j06659k09121J94397j40076m05045k07366j53580
2253.8G95313492L76205L1052J67084J58691q3923J79672M04663L12729k56806J29014
2263.4G96731873m6998K03019J09939l35693l2578n74569K07214M04205J89896N112
2273G96861420k91901K84271O2866K44751O9046k35672o01348k75345K08359p0801
2282.7G96255646L98712k10037n4093J14670J58157K26136p00226j5717K62070M21448
$$ plain form
2292.3 796856766 796869583 796341171 795879898 795401840 795777817 796071167 796480942 796446381 796303558 796615448
2302 796615448 796763687 796824493 796335602 796514359 796320343 796071930 795884399 795261383 795476456 795121460
2311.6 795121460 795014954 794855728 795161819 795722275 795330582 795392075 794938278 794189301 793646240 794178772
2321.3 794178772 793861389 792542267 792949448 792976913 793064880 793264771 793582001 794208450 794740906 794414825
2330.9 794414825 793721161 793924255 793063431 792846603 792742691 792481232 793500443 794494171 794912415
2339.6 794912415 794887390 795610886 795482483 795278091 794897461 794310608 794695511 794749374 795868301 797440186
2349.2 797440186 798280029 797801132 796661606 796078949 796666489 797052994 795568390 795552368 795362778
2357.9 795362778 794190826 794222336 794400253 794487381 794966354 795395355 795209579 795951920 795316010 794386368
$$ packed form
2292.3G96856766J2817n28412m61273m78058L75977K93350M09775l4561j42823L11890
2302G96615448J48239O0806m88891J78757j94016k48413j87531o23016K15073l54996
2311.6G95121460j06506j59226L06091N60456l91693O1493m53797p48977n43061N32532
2321.3G94178772l17383j319122M07181K7465Q7967J99891L17230O26449N32456l26081
2330.9G94414825o93664K03094q60824k16828j03912k61459J019211R93728M18244
2339.6G94912415k5025P23496j28403k04392l80630n86853L84903N3863J118927J571885
2349.2G97440186Q39843m78897j139526n82657N87540L86505j484604j6022j89590
2357.9G95362778j171952L1510J77917Q7128M78973M29001j85776P42341o35910r29642
$$ plain form
2367.6 794386368 794424591 795799866 797796631 797474289 798193970 799213104 799571686 799402313 798370743
2376.2 798370743 798341599 798820877 799518814 799446640 799551086 800574799 801367493 801986542 802221222 802246323
2385.9 802246323 801867523 801623077 801565628 801422806 801355057 801099167 800960541 800924301 801391678 801607056
2395.5 801607056 801688995 801750183 801392365 801550293 801335754 801090851 801030045 800904007 800816803 800329361
2405.2 800329361 800230942 800515137 800717010 800461884 800469894 800824509 800914230 800850449 800402222 800131989
2414.8 800131989 799917450 799644470 799333496 799307404 799524231 799552689 799720459 799831696 800305939 800404739
2424.5 800404739 800195694 799981079 799177094 798561096 798206406 798169250 797899399 797858047 798022614 798054810
2434.1 798054810 798551025 798312302 798187103 798457794 798480148 798444824 797948837 797468719 796981812 796621017
$$ packed form
2367.6G94386368L8223J375275J996765l22342P19681J019134L58582j69373j031570
2376.2G98370743k9144M79278O97937p2174J04446J023713P92694O19049K34680K5101
2385.9H02246323l78800k44446n7449j42822o7749k55890j38626l6240M67377K15378
2395.5H01607056Q1939O1188l57818J57928k14539k44903o0806j26038q7204m87442
2405.2H00329361r8419K84195K01873k55126Q010L54615Q9721o3781m48227k70233
2414.8H00131989k14539k72980l10974k6092K16827K8458J67770J11237M74243R8800
2424.5H00404739k09045k14615q03985o15998l54690l7156k69851m1352J64567L2196
2434.1G98054810M96215k38723j25199K70691K2354l5324m95987m80118m86907l60795
$$ plain form
2443.7 796621017 796585770 796624985 796729584 796944122 796952133 797091141 797371674 797167892 797275772 797180862
2453.4 797180862 796742096 796258240 795591431 795017395 794202576 794145584 794653854 795014114 795441818 795857849
2463 795857849 796041641 795935135 795881271 795290985 794532852 793805008 793497314 793629227 793192902 793060303
2472.7 793060303 793184738 793550873 794028244 794106598 794201050 794189987 793783112 792841949 792267761 792043991
2482.3 792043991 791697617 791311188 790938873 791098633 791624069 791926804 791793823 791712646 791621094 791685562
2492 791685562 791665192 791252060 790980453 790263596 789655609 789354401 789246750 789428406 789579315 790110931
2501.6 790110931 790249405 790112839 790019531 789654083 789334030 789188614 788858719 787979202 787279282 787071304
2511.2 787071304 787347412 787649307 787993774 788589554 788780899 788747864 788464661 788402252 788338470 787590485
$$ packed form
2443.7G96621017l5247L9215J04599K14538Q011J39008K80533k03782J07880r4910
2453.4G97180862m38766m83856o66809n74036q14819n6992N08270L60260M27704M16031
2463G95857849J83792j06506n3864n90286p58133p27844l07694J31913m36325j32599
2472.7G93060303J24435L66135M77371P8354R4452j1063m06875r41163n74188k23770
2482.3G92043991l46374l86429l72315J59760N25436L02735j32981q1177r1552O4468
2492G91685562k0370m13132k71607p16857o07987l01208j07651J81656J50909N31616
2501.6G90110931J38474j36566r3308l65448l20053j45416l29895q79517o99920k07978
2511.2G87071304K76108L01895L44467N95780J91345l3035k83203o2409o3782p47985
$$ plain form
2520.9 787590485 786759567 786283798 786239853 786360855 786530838 786793442 787182999 787188034 786995239 786719666
2530.5 786719666 786641617 787032394 786451874 785893097 785657501 785066071 784581985 784328842 784928284 785453415
2540.2 785453415 785635376 785646973 785860825 785990372 785404739 785329514 784939346 784085464 783466263 783353195
2549.8 783353195 783703918 783683243 783554840 783605194 783844376 783677368 783814011 784011078 783732986 783511124
2559.5 783511124 782636490 782242889 782265778 782312317 782203903 781628418 781558685 781719513 782554550 782990646
2569.1 782990646 782366867 781778336 781493073 781444168 780938568 780755005 780808258 780473709 780149384 780191956
2578.7 780191956 780415649 780334702 780739746 781119690 780814819 780541153 780423660 779952927 779237976 778614197
2588.4 778614197 778155136 778092270 777854691 777863617 778093948 778149490 778307190 778106308 778077774 778054047 777665634
$$ packed form
2520.9G87590485q30918m75769m3945J21002J69983K62604L89557N035j92795k75573
2530.5G86719666p8049L90777n80520n58777k35596n91430m84086k53143N99442N25131
2540.2G85453415J81961J1597K13852J29547n85633p5225l90168q53882o19201j13068
2549.8G83353195L50723k0675j28403N0354K39182j67008J36643J97067k78092k21862
2559.5G83511124q74634l93601K2889M6539j08414n75485o9733J60828Q35037M36096
2569.1G82990646o23779n88531k85263m8905n05600j83563N3253l34549l24325M2572
2578.7G80191956K23693q0947M05044L79944l04871k73666j17493m70733p14951o23779
2588.4G78614197m59061o2866k37579Q926K30331N5542J57700k00882k8534k3727l88413
$$ plain form
2599 777665634 777108994 776708832 776303711 775697861 775879517 775872650 775440826 775335541 775264435 775321579 775233231
2609.6 775233231 775079956 774847336 774652100 774411545 773852997 773453064 773083649 772612152 772403793 772436447
2619.3 772436447 772462082 772380600 772251053 772290497 772126846 771572189 770950928 770678177 770710983 770491333
2628.9 770491333 770337143 769908600 769800034 770078201 769653320 769498291 769217606 768884354 768863754 768458405
2638.5 768458405 767904129 767474747 767531204 767282791 766632004 766230087 766313782 766673737 766591339 766201096
2648.2 766201096 765781097 765591202 765208740 765033951 764985657 764550247 764606705 764390488 763603363 763223801
2657.8 763223801 763783264 764085236 763487473 762974091 762143326 761759262 762151108 762184677 761735382 761407928
2667.5 761407928 761169739 760500107 760370941 760780640 760670013 760164948 759952469 759902649 759728165 759711533
$$ packed form
2599G77665634n56640m00162m05121o05850J81656o867m31824j05285p1106N7144q8348
2609.6G75233231j53275k32620j95236k40555n58548l99933l69415m71497k08359L2654
2619.3G72436447K5635q1482j29547L9444j63651n54657o21261k72751L2806k19650
2628.9G70491333j54190m28543j08566K78167m24881j55029k80685l33252k0600m05349
2638.5G68458405n54276m29382N6457k48413o50787m01917Q3695L59955q2398l90243
2648.2G66201096m19999j89895l82462j74789m8294m35410N6458k16217p87125l79562
2657.8G63223801N59463L01972n97763n13382q30765l84064L91846L3569m49295l27454
2667.5G61407928k38189o69632j29166M09699j10627n05065k12479m9820j74484j6632
$$ plain form
2677.1 759711533 759653625 759242706 758605499 758464050 758240433 757929687 757867508 757244949 757001114 757165604
2686.8 757165604 757112808 756761322 756339874 756162415 756180725 756371078 756003647 755944061 755959015 755454483
2696.4 755454483 755169830 754724579 754193344 753622437 753696060 754009399 753970642 754115295 753998947 753547287
2706 753547287 752688980 752007217 751643906 751322174 751381531 751552277 751299362 750748596 750381927 750019226
2715.7 750019226 749878769 749593201 749632950 749926147 749380951 748991165 748590164 748329391 748235397 748015976
2725.3 748015976 747841568 747249908 746833191 746379547 746207047 746258926 746148529 746069946 745550766 745133514
2735 745133514 744815216 744547653 744368820 744276886 744079361 743751678 743573303 743082428 742814560 742467499
2744.6 742467499 742208710 742474365 742716599 742718353 741995468 741319809 741031494 741155396 741193161 740767288
$$ packed form
2677.1G59711533n7908m10919o37207j41449k23617l10746o2179o22559k43835J64490
2686.8G57165604n2796l51486m21448j77459J8310J90353l67431n9586J4954n04532
2696.4G55454483k84653m45251n31235n70907P3623L13339l8757J44653j16348m51660
2706G53547287q58307o81763l63311l21732N9357J70746k52915n50766l66669l62701
2715.7G50019226j40457k85568L9749K93197n45196l89786m01001k60773r3994k19421
2725.3G48015976j74408n91660m16717m53644j72500N1879j10397p8583n19180m17252
2735G45133514l18298k67563j78833r1934j97525l27683j78375m90875k67868l47061
2744.6G42467499k58789K65655K42234J754p22885o75659k88315J23902L7765m25873
$$ plain form
2754.3 740767288 740582886 740181198 739776382 739439621 738989563 738738327 738690262 738674774 738553772 738158722
2763.9 738158722 737384872 736990509 736688690 736292648 736077805 735860977 735547409 735165558 735095673 734701004
2773.5 734701004 734222107 733794479 733352051 733266983 732903061 732368469 731654663 731207809 730933075 730544205
2783.2 730544205 730127258 729462280 729353638 729349899 729381485 729254608 728541565 728121338 727818069 727220001
2792.8 727220001 726468201 726074524 725480423 724636307 724242783 724061661 723831100 723233414 722804184 722435913
2802.5 722435913 722069473 721718369 720908508 720454788 720209961 719616699 719074783 718570862 717736053 717075272
2812.1 717075272 716862717 716743851 716279297 715224533 714598389 714180603 713530731 712914352 712255173
2820.8 712255173 711716309 710883179 710051880 709648361 709430923 708844910 708119583 707527542 706646729 706111603
$$ packed form
2754.3G40767288j84402m01688m04816l36761m50058k51236m8065j5488j21002l95050
2763.9G38158722p73850l94363l01819l96042k14843k16828l13568l81851o9885l94669
2773.5G34701004m78897m27628m42428q5068l63922n34592p13806m46854k74734l88870
2783.2G30544205m16947o64978j08642l739L1586j26877p13043m20227l03269n98068
2792.8G27220001p51800l93677n94101q44116l93524j81122k30561n97686m29230l68271
2802.5G22435913l66440l51104q09861m53720k44827n93262n41916n03921q34809o60781
2812.1G17075272k12555j18866m64554j054764o26144m17786o49872o16379o59179
2820.8G12255173n38864q33130q31299m03519k17438n86013p25327n92041q80813n35126
$$ plain form
2830.4 706111603 705540695 704746475 703996429 703047638 702205734 701363220 700587387 699743271 698788986 697654953
2840.1 697654953 696307297 694973755 693492508 691836624 690114594 688506927 686626816 684534378
2847.8 684534378 682197952 679804459 678140488 677088242 676622620 676139374 675521393 675220413 675291367
2856.5 675291367 675174103 674728928 674605560 673913651 673413696 673365555 672893677 672448044 671619644 670721817
2866.1 670721817 669708252 668974991 668572540 667486115 666525879 665875092 664960709 663768768 663005981
2874.8 663005981 662592316 661810837 661211090 661173248 661077118 660429840 659974670 660004501 659979401 659180603
2884.4 659180603 657932510 656993484 655764618 654762726 654174881 653628845 653150940 652343597 651729202
2893.1 651729202 651251602 650280457 649178772 648508606 647844543 647053223 646493149 645961075 645183792
$$ packed form
2830.4G06111603n70908p94220p50046r48791q41904q42514p75833q44116r54285j134033
2840.1F97654953j347656j333542j481247j655884j722030j607667j880111k092438
2847.8F84534378k336426k393493j663971j052246m65622m83246o17981l00980P0954
2856.5F75291367j17264m45175j23368o91909m99955m8141m71878m45633q28400q97827
2866.1F70721817j013565p33261m02451j086425r60236o50787r14383j191941p62787
2874.8F63005981m13665p81479n99747l7842r6130o47278m55170K9831k5100p98798
2884.4F59180603j248093r39026j228866j001892n87845n46036m77905q07343o14395
2893.1F51729202m77600r71145j101685o70166o64063p91320n60074n32074p77283
$$ plain form
2901.8 645183792 644054565 643321304 642822647 642453079 642376022 642011261 641886520 641358871 640347366
2910.5 640347366 639617271 638843613 638225136 637268486 636257706 635657196 634522095 633171692 632386055
2919.2 632386055 631916542 631352348 630592117 629943390 629400749 628867989 629002724 629464874 629469109 629289093
2928.8 629289093 629103699 628894920 628972740 629446983 629624939 629463959 629624901 630142670 630593414 630981483
2938.5 630981483 631629486 632253304 632702370 632955360 633149834 633245010 633484421 634036026 633924561 633822746
2948.1 633822746 634103355 634106255 634103622 633509483 632191048 631298676 631217995 631172638 631009178 630634880
2957.7 630634880 630112076 630358696 630795822 630877342 631285973 631821518 631953583 632000618 632102509 632428322
2967.4 632428322 632986641 633593330 634880333 636367874 637441292 638320618 639428520 640590591 641213913
$$ packed form
2901.8F45183792j129227p33261m98657l69568p7057l64761j24741n27649j011505
2910.5F40347366p30095p73658o18477r56650j010780o00510j135101j350403p85637
2919.2F32386055m69513n64194p60231o48727n42641n32760J34735M62150M235j80016
2928.8F29289093j85394k08779P7820M74243J77956j60980J60942N17769M50744L88069
2938.5F30981483O48003O23818M49066K52990J94474R5176K39411N51605j11465j01815
2948.1F33822746K80609K900k633n94139j318435q92372q0681m5357j63460l74298
2957.7F30634880n22804K46620M37126Q1520M08631N35545J32065M7035J01891L25813
2967.4F32428322N58319O06689J287003J487541J073418Q79326J107902J162071O23322
$$ plain form
2976.1 641213913 642094955 642773819 643219223 644128723 644978638 645776062 646136093 646651535 647801437
2984.7 647801437 648705215 649353409 650355988 651345749 651885986 652638016 653332443 653608322 653715820
2993.4 653715820 654230118 654586182 654300156 654857407 655612564 655830612 655810928 655736465 655991058 655990829
3003.1 655990829 655819092 655639877 655499268 655507660 655868149 656340485 656011810 655423355 655156555 654929276
3012.7 654929276 654851913 655321274 655508041 654841690 654213409 654029465 654081650 653491898 652635040 652314758
3022.4 652314758 652009659 651323242 650836487 650982895 650621262 649911041 649930191 650379639 650154572 649107971
3032 649107971 648359375 647909470 647403564 646497650 645737076 645546188 645517807 645592957 644979248 644187927
3041.6 644187927 643891907 643550568 642942963 642047119 641423569 641187286 640762711 639965019 639320526 638737869
$$ packed form
2976.1F41213913Q81042O78864M45404R09500Q49915P97424L60031N15442J149902
2984.7F47801437R03778O48194J002579R89761N40237P52030O94427K75879J07498
2993.4F53715820N14298L56064k86026N57251P55157K18048j9684p4463K54593k29
3003.1F55990829j71737j79215j40609Q392L60489M72336l28675n88455k66800k27279
3012.7F54929276p7363M69361J86767o66351o28281j83944N2185n89752q56858l20282
3022.4F52314758l05099o86417m86755J46408l61633p10221J9150M49448k25067j046601
3032F49107971p48596m49905n05906r05914p60574j90888k8381P5150o13709p91321
3041.6F44187927k96020l41339o07605q95844o23550k36283m24575p97692o44493n82657
$$ plain form
3051.3 638737869 637950211 637535172 637382736 637015343 636516914 636040039 635571671 634862709 633786316
3060 633786316 633267899 633183823 632887611 632632446 631835670 631365967 631463356 630976219 630397911 629995232
3069.6 629995232 629711990 629232826 628554840 628116112 627894287 627470474 626651077 626191368 626090050 625747948
3079.2 625747948 625331917 625296364 625078354 624377670 623825798 623305779 622618179 622008400 621826172 621450920
3088.9 621450920 620702209 619977722 619727669 619906845 619210205 618744354 618548088 617741928 617364655 617163239
3098.5 617163239 616916466 615842667 614483452 613981209 613772354 613192520 612014656 611779785 612172470
3107.2 612172470 611748924 610951424 610177689 609497948 608871155 608231125 607681007 607278862 606459274 605616913
3116.9 605616913 605206604 604994011 604642525 604001770 603636780 602510376 601076355 600419083 599754944
$$ packed form
3051.3F38737869p87658m15039j52436l67393m98429m76875m68368p08962j076393
3060F33786316n18417q4076k96212k55165p96776m69703R7389m87137n78308m02679
3069.6F29995232k83242m79164o77986m38728k21825m23813q19397m59709j01318l42102
3079.2F25747948m16031l5553k18010p00684n51872n20019o87600o09779j82228l75252
3088.9F21450920p48711p24487k50053J79176o96640m65851j96266q06160l77273k01416
3098.5F17163239k46773j073799j359215n02243k08855n79834j177864k34871L92685
3107.2F12172470m23546p97500p73735o79741o26793o40030n50118m02145q19588q42361
3116.9F05616913m10309k12593l51486o40755l64990j126404j434021o57272o64139
$$ plain form
3125.5 599754944 598914299 597815971 597144241 596865654 596612396 596060638 595043564 594327469 593877754
3134.2 593877754 593586540 592909470 591902809 591058960 590470390 589986382 589096146 588201828 587296867
3142.9 587296867 586700172 586028748 584898071 584433899 584280357 583752060 582758980 581647606 580962677
3151.6 580962677 580373192 579064331 577851448 577495461 576916656 576264572 575761909 575392799 574804115
3160.3 574804115 573731956 572913170 572039986 571260300 570480766 569414864 568347015 567513618 566959038
3168.9 566959038 566142693 565450439 564846115 564091721 563395844 562770157 562284546 561717377 561010590 560076141
3178.6 560076141 559300270 558649292 558002892 557296371 556375961 555954590 555353165 554048424 553106499
3187.3 553106499 552584457 551952934 551466141 550773849 549804649 549377480 548766098 548045006 547565117 546731300
$$ packed form
3125.5E99754944q40645j098328o71730k78587k53258n51758j017074p16095m49715
3134.2E93877754k91214o77070j006661q43849n88570m84008q90236q94318r04961
3142.9E87296867n96695o71424j130677m64172j53542n28297r93080j111374o84929
3151.6E80962677n89485j308861j212883l55987n78805o52084n02663l69110n88684
3160.3E74804115j072159q18786q73184p79686p79534j065902j067849q33397n54580
3168.9E66959038q16345o92254o04324p54394o95877o25687m85611n67169p06787r34449
3178.6E60076141p75871o50978o46400p06521r20410m21371o01425j304741r41925
3187.3E53106499n22042o31523m86793o92292r69200m27169o11382p21092m79889q33817
$$ plain form
3196.9 546731300 545703583 544841995 544276237 543412781 542579498 542046471 541335449 540671120 540382919
3205.6 540382919 540203476 539489479 538751411 537952919 537086639 536557503 536011047 535641518 534857674 533806953
3215.2 533806953 533260422 532741356 532243767 531980400 531272697 530322189 530024834 529468842 528520203 527845764
3224.9 527845764 527405128 527126846 526537209 525747337 524905930 524286232 524139061 523921814 523253899 522419510
3234.5 522419510 521739731 521263390 520739441 520048103 519861259 519161263 517988358 517610245 517112083
3243.2 517112083 516759453 516423721 515729485 515128975 514484138 513901825 513307037 513025589 512707634 512295952
3252.8 512295952 511748543 510889511 510544548 510166702 509289131 508274422 507699432 507576561 507167511
3261.5 507167511 506414490 505740852 505319099 504842529 504528313 504437561 504304771 503961906 503741341 503493042
$$ packed form
3196.9E46731300j027717q61588n65758q63456q33283n33027p11022o64329k88201
3205.6E40382919j79443p13997p38068p98492q66280n29136n46456l69529p83844j050721
3215.2E33806953n46531n19066m97589k63367p07703r50508k97355n55992r48639o74439
3224.9E27845764m40636k78282n89637p89872q41407o19698j47171k17247o67915q34389
3234.5E22419510o79779m76341n23949o91338j86844o99996j172905l78113m98162
3243.2E17112083l52630l35732o94236o00510o44837n82313n94788k81448l17955m11682
3252.8E12295952n47409q59032l44963l77846q77571j014709n74990j22871m09050
3261.5E07167511p53021o73638m21753m76570l14216r0752j32790l42865k20565k48299
$$ plain form
3271.2 503493042 502654991 502083969 501346245 500468178 499933014 498966599 498293457 498130951 498255081 498352280
3280.8 498352280 497848320 497327538 496985817 496529655 496364365 496039734 495345383 494920197 494318275 494303093
3290.4 494303093 494293480 493138962 492638893 492724304 492572632 492086258 491568222 491555252 491461334 490846291
3300.1 490846291 490156021 490020714 489646950 489135361 489034538 488391151 487354164 486934471 486881561 486591949
3309.7 486591949 486422501 485843887 485292397 485068588 484156036 483301086 483126259 483323555 482649002 481785622
3319.4 481785622 481541939 481131439 481252251 481150932 480775948 480382156 479529114 478719559 477832794 477444954
3329 477444954 477268410 477069283 476657715 475521355 474612122 474420662 474581490 473946457 472833977 472193413
3338.7 472193413 471588402 471348953 471328773 470817261 469770889 468575859 468148232 468332062 467790031
$$ packed form
3271.2E03493042q38051n71022p37724q78067n35164r66415o73142j62506J24130R7199
3280.8D98352280n03960n20782l41721m56162j65290l24631o94351m25186o01922j5182
3290.4D94303093r613j154518n00069Q5411j51672m86374n18036j2970r3918o15043
3300.1D90846291o90270j35307l73764n11589j00823o43387j036987m19693n2910k89612
3309.7D86591949j69448n78614n51490k23809r12552q54950j74827J97296o74553q63380
3319.4D81785622k43683m10500J20812j01319l74984l93792q53042q09555q86765l87840
3329D77444954j76544j99127m11568j136360r09233j91460J60828o35033j112480o40564
3338.7D72193413o05011k39449k0180n11512j046372j195030m27627J83830n42031
$$ plain form
3347.3 467790031 467038193 466982651 466925850 466506653 465905380 465021515 463829384 462893715 462210846 461892166
3357 461892166 462130051 462200775 461606941 460307198 459575996 459690666 459604340 459354668 459054871 458508453
3366.6 458508453 457771263 457351341 456571121 455444450 454920464 454782295 454618416 453891335 453210297
3375.3 453210297 453012276 452708130 451992073 451331902 451121941 450750885 450387650 449789848 448976593 448613396
3384.9 448613396 448680115 448909225 448737030 448339691 447834549 447726822 447849922 447371979 446803627 446176491
3394.6 446176491 445396767 445036469 445190735 444999847 444672852 444561310 444526520 444586563 443961143 443667641
3404.2 443667641 444240456 444295311 443327980 442609978 442932892 442827644 442540474 442325592 441986160 441941490
3413.9 441941490 441749153 441959496 442167549 441877365 441823807 441909637 441823959 441698647 441425056 440953484
$$ packed form
3347.3D67790031p51838n5542n6801m19197o01273q83865j192131r35669o82869l18680
3357D61892166K37885P0724n93834j299743p31202J14670q6326k49672k99797n46418
3366.6D58508453p37190m19922p80220j126671n23986j38169j63879p27081o81038
3375.3D53210297j98021l04146p16057o60171k09961l71056l63235n97802q13255l63197
3384.9D48613396O6719K29110j72195l97339n05142j07727J23100m77943n68352o27136
3394.6D46176491p79724l60298J54266j90888l26995j11542l4790O0043o25420k93502
3404.2D43667641N72815N4855r67331p18002L22914j05248k87170k14882l39432m4670
3413.9D41941490j92337K10343K08053k90184n3558Q5830q5678j25312k73591m71572
$$ plain form
3423.5 440953484 440983582 441302490 441384850 441501694 441514168 441416512 441649246 441933212 442151070 442249489
3433.2 442249489 441964569 442025948 442346115 442641754 442864151 443009377 443220978 443561783 444150238 443910789
3442.8 443910789 443953476 444157410 444252434 445126686 444131775 443822212 444974289 445303192 445822372 446562538
3452.5 446562538 447140083 447002182 447325172 448144531 448260880 448373260 448724213 449596977 449970741 450138359
3462.1 450138359 450792656 451538963 452435112 452983589 453148689 452905388 453485947 454365158 454431953 454873695
3471.7 454873695 455506210 455814629 455899925 456347694 457098503 457545433 457877846 458581886 459612045 460463943
3481.4 460463943 460577431 459900894 460550995 461945915 462611732 463556747 463976936 463796616 464623909
3490.1 464623909 465624237 465751534 466150208 466967545 467569389 468263626 468734016 469226074 470003700
$$ packed form
3423.5D40953484L0098L18908Q2360J16844J2474r7656K32734K83966K17858R8419
3433.2D42249489k84920O1379L20167K95639K22397J45226K11601L40805N88455k39449
3442.8D43910789M2687K03934R5024Q74252r94911l09563J152077L28903N19180P40166
3452.5D46562538N77545j37901L22990Q19359J16349J12380L50953Q72764L73764J67618
3462.1D50138359O54297P46307Q96149N48477J65100k43301N80559Q79211O6795M41742
3471.7D54873695O32515L08419Q5296M47769P50809M46930L32413P04040J030159Q51898
3481.4D60463943J13488o76537O50101J394920O65817R45015M20189j80320Q27293
3490.1D64623909J000328J27297L98674Q17337O01844O94237M70390M92058P77626
$$ plain form
3498.7 470003700 470651207 471261520 472619171 473333092 472966080 473624229 474052582 474629517 475652008
3507.4 475652008 476831322 477581100 477219963 478161469 479144096 479477615 480032806 480673637 481478004
3516.1 481478004 482077141 482727890 483466187 484364738 484899559 486134796 487027893 485741463 486562271
3524.8 486562271 488327866 489265404 490550308 491391945 491084633 491251755 492497787 493717766 494752312
3533.5 494752312 495143127 496448555 497527504 497351112 498638382 499886093 500946884 501643066 502073288
3542.1 502073288 502468567 503250732 504637604 505495453 507050896 506500664 506802521 508811150 510592575
3550.8 510592575 512198067 510871162 511565704 512631836 513484688 515911980 516615181 517731476 519108124
3559.5 519108124 520014000 520756760 522180023 522854385 523052330 526969376 527775879 526877518 526877060 525713463
$$ packed form
3498.7D70003700O47507O10313J357651P13921l67012O58149M28353N76935J022491
3507.4D75652008J179314P49778l61137R41506R82627L33519N55191O40831Q04367
3516.1D81478004N99137O50749P38297Q98551N34821J235237Q93097j286430Q20808
3524.8D86562271J765595R37538J284904Q41637l07312J67122J246032J219979J034546
3533.5D94752312L90815J305428J078949j76392J287270J247711J060791O96182M30222
3542.1E02073288L95279P82165J386872Q57849J555443n50232L01857K008629J781425
3550.8E10592575J605492j326905O94542J066132Q52852K427292P03201J116295J376648
3559.5E19108124R05876P42760J423263O74362J97945L917046Q06503q98361m58j163597
$$ plain form
3569.1 525713463 528213425 529670563 531241684 533304977 534956932 535444984 535882835 537696609 538347893
3577.8 538347893 540564270 542052650 542279816 543724861 545700417 547628326 548141518 552136497 554203072
3586.5 554203072 551059494 552410812 552461472 555326653 557892647 560249634 561449852 561523972 564772682
3595.2 564772682 563942337 565851555 569197044 569703827 572056122 572919312 574156799 575504303 577031097
3603.9 577031097 579651375 582480774 584504776 582644806 585587769 585207291 584704742 592891579 595846252
3612.5 595846252 593096733 594985008 594203033 598490486 602807808 602529144 604984322 604706230 604932289
3621.2 604932289 608149071 611073914 614034386 616785889 618356476 619930611 626118622 628610535
3628.9 628610535 618274498 622070007 627160378 632812004 634887543 633544197 636745224 640773392
$$ packed form
3569.1E25713463K499962J457138J571121K063293J651955M88052M37851J813774O51284
3577.8E38347893K216377J488380K27166J445045J975556J927909N13192L994979K066575
3586.5E54203072l143578J351318N0660K865181K565994K356987J200218P4120L248710
3595.2E64772682q30345J909218L345489N06783K352295Q63190J237487J347504J526794
3603.9E77031097K620278K829399K024002j859970K942963l80478n02549Q186837K954673
3612.5E95846252k749519J888275p81975M287453M317322k78664K455178k78092K26059
3621.2F04932289L216782K924843K960472K751503J570587J574135O188011K491913
3628.9F28610535j0336037L795509N090371N651626K075539j343346L201027M028168
$$ plain form
3636.6 640773392 643525085 643978577 645560684 648323593 650906372 652516403 652827682 655444489 659279633
3645.3 659279633 664690323 665317841 662617645 666759567 665407104 663814926 664572525 670577927 675492554
3654 675492554 679268417 683753128 675986633 678258286 684256058 686342773 688125687 689012680 690957489
3662.7 690957489 691828842 693968964 696233215 696894836 701111908 703304901 701573486 701314240 697022934
3671.4 697022934 700224380 708429184 717192383 717590637 700509949 701411743 709123611 715063324
3679.1 715063324 713457718 713091202 716093903 718531113 719901657 719816895 719632492 723348846 729013443
3687.8 729013443 719749832 716835785 723841400 717323532 717831726 723578262 724447632 725428467 725545197
3696.4 725545197 724979324 726343307 727259903 729602661 732875061 727828751 724978943 729654160 731774521
$$ packed form
3636.6F40773392K751693M53492J582107K762909K582779J610031L11279K616807L835144
3645.3F59279633N410690O27518k700196M141922j352463j592178P57599O005402M914627
3654F75492554L775863M484711p766495K271653N997772K086715J782914Q86993J944809
3662.7F90957489Q71353K140122K264251O61621M217072K192993j731415k59246m291306
3671.4F97022934L201446Q204804Q763199L98254j7080688R01794P711868N939713
3679.1G15063324j605606l66516L002701K437210J370544q4762j84403L716354N664597
3687.8G29013443r263611k914047P005615o517868N08194N746536Q69370R80835J16730
3696.4G25545197n65873J363983R16596K342758L272400n046310k849808M675217K120361
$$ plain form
3705.1 731774521 732221375 732766113 736088257 740643768 733501968 738167953 744503403 730086060
3712.8 730086060 733066559 737449875 737885895 738327713 740859833 742260742 739022675 740509567 745992737
3721.5 745992737 742220306 737988129 743432617 744471512 744388733 741980057 741110001 744734879 745876389
3730.2 745876389 751063919 747819443 740570602 749456863 748960495 740785217 741918869 743192139
3737.9 743192139 743883057 747799911 750881042 746013489 748815536 759706268 749255753 732851181
3745.6 732851181 743280258 749210129 755066833 753850555 742564774 752064438 746927795 741341400
3753.3 741341400 746927948 751157913 754759750 748751068 750227127 755709000 747913437 746847992
3761 746847992 750995331 751711502 751857071 755326538 751926956 747143631 750813980 755886307 756671524
$$ packed form
3705.1G31774521M46854N44738L322144M555511p141800M665985O335450j4417343
3712.8G30086060K980499M383316M36020M41818K532120J400909l238067J486892N483170
3721.5G45992737l772431m232177N444488J038895q2779k408676q70056L624878J141510
3730.2G45876389N187530l244476p248841Q886261m96368q175278J133652J273270
3737.9G43192139O90918L916854L081131m867553K802047J0890732j0450515j6404572
3745.6G32851181J0429077N929871N856704j216278j1285781R499664n136643n586395
3753.3G41341400N586548M229965L601837o008682J476059N481873p795563j065445
3761G46847992M147339P16171J45569L469467l399582m783325L670349N072327P85217
$$ plain form
3769.7 756671524 747629395 748984833 752578659 752902679 752856445 752834625 754225464 754309464 756323013
3778.4 756323013 755698471 748809204 751625595 753878860 754482574 756228256 753824997 752734146 753927307
3787.1 753927307 754877472 755677872 755102997 754780502 754567719 754528885 754814529 756227188 758680725
3795.8 758680725 753609619 748870621 752046127 756685257 762858124 757754669 746058807 749038086
3803.5 749038086 752332001 757403870 762843018 752625580 748425522 753661728 755513077 755666428
3811.2 755666428 756592941 757042389 758214417 762951965 760912170 746923599 751585159 757301559
3818.9 757301559 761925812 762472610 743973312 747555466 752764053 754392395 757634811 758172226
3826.6 758172226 753705368 754244461 756701965 759956131 760851974 751402054 754472885 761923370 755866165
$$ packed form
3769.7G56671524r042129J355438L593826L24020m6234k1820J390839Q4000K013549
3778.4G56323013o24542o889267K816391K253265O03714J745682k403259j090851J193161
3787.1G53927307R50165Q00400n74875l22495k12783l8834K85644J412659K453537
3795.8G58680725n071106m738998L175506M639130O172867n103455j1695862K979279
3803.5G49038086L293915N071869N439148j0217438m200058N236206J851349J53351
3811.2G55666428R26513M49448J172028M737548k039795j3988571M661560N716400
3818.9G57301559M624253N46798j8499298L582154N208587J628342L242416N37415
3826.6G58172226m466858N39093K457504L254166Q95843r449920L070831P450485o057205
$$ plain form
3835.3 755866165 755045166 761828766 752660675 749340134 757685318 753181000 752866364 758991547 756287689
3844 756287689 752440796 754876099 756601028 756540527 757936707 757939682 760523834 767406387 760303574
3852.7 760303574 756363678 742689667 745326614 755358276 754395752 753336411 755509796 757193069
3860.4 757193069 759328232 753826370 754233398 761150894 755055923 749054565 752844696 758434982
3868.1 758434982 764130402 755069122 746405029 750684814 757490692 760948257 750256577 751465988
3875.8 751465988 755721436 755782394 757524185 761183777 755180588 748320999 754636536 755922470 757697525
3884.5 757697525 762706451 749716873 751102905 755132675 755855789 759845657 758553391 750388107
3892.2 750388107 752000885 755318527 754630051 755994110 756287079 757973709 760848923 752122879 756097336
$$ packed form
3835.3G55866165q20999O783600r168091l320541Q345184m504318l14636O125183k703858
3844G56287689l846893K435303J724929o0501J396180K975K584152O882553p102813
3852.7G60303574l939896j3674011K636947J0031662r62524j059341K173385J683273
3860.4G57193069K135163n501862M07028O917496o094971o001358L790131N590286
3868.1G58434982N695420r061280q664093M279785O805878L457565j0691680J209411
3875.8G51465988M255448O0958J741791L659592o003189o859589O315537J285934J775055
3884.5G57697525N008926j2989578J386032M029770P23114L989868j292266q165284
3892.2G50388107J612778L317642o88476J364059K92969J686630K875214q726044L974457
$$ plain form
3900.9 756097336 757379532 751015549 755578156 753330002 751524277 752467194 753826752 756010590
3908.6 756010590 755250931 755029984 755954285 756399155 755604248 754826889 756219864 758420181 755353699
3917.3 755353699 752339478 756430588 756350479 752669449 754472885 756047516 756541595 753494492 750684891
3926 750684891 752755508 754810867 756420822 755812149 755128708 756545181 753803101 752073746 753924561
3934.6 753924561 754317169 754154968 754714966 755019302 754102936 752934647 755105591 757177963 752938461
3943.3 752938461 752258911 753959427 754586411 755529785 753516769 753763275 753486328 751416702 753452148
3952 753452148 753379517 752400360 753324738 754473572 754827728 753463516 753234863 753496628 754669800 755562668
3961.6 755562668 753858795 752932739 753120422 753206482 752614441 752371826 752963867 752878036 752649460 753491135
$$ packed form
3900.9G56097336J282196o363983M562607k248154j805725R42917J359558K183838
3908.6G56010590p59659k20947R24301M44870p94907p77359J392975K200317l066482
3917.3G55353699l014221M091110q0109l681030J803436J574631M94079l047103k809601
3926G50684891K070617K055359J609955o08673o83441J416473k742080j729355J850815
3934.6G53924561L92608j62201N59998L04336r16366j168289K170944K072372m239502
3943.3G52938461o79550J700516O26984R43374k013016K46506k76947k069626K035446
3952G53452148p2631r79157R24378J148834L54156j364212k28653K61765J173172Q92868
3961.6G55562668j703873r26056J87683Q6060n92041k42615N92041q5831k28576Q41675
$$ plain form
3971.3 753491135 753554077 752672424 753330917 754057541 754137039 753930588 753473358 753354645 753251343 753276749
3980.9 753276749 752958374 752908020 753169174 753199921 753343964 753038712 753005219 753731766 754280396 753771286
3990.6 753771286 752764206 752703552 753736801 754461670 753943558 753517838 753798981 753658371 752472763
3999.2 752472763 751841278
4000.2 751841278
$$ packed form
3971.3G53491135O2942q81653O58493P26624P9498k06451m57230j18713j03302K5406
3980.9G53276749l18375n0354K61154L0747J44043l05252l3493P26547N48630n09110
3990.6G53771286j007080o0654J033249P24869n18112m25720K81143j40610j185608
3999.2G52472763o31485
4000.2G51841278
##END=$$ End of the data block
